CAS-RN;SMILES;Class;Class 0/1;Status
1120-21-4;CCCCCCCCCCC;RB;1;Train
106-88-7;CCC1CO1;RB;1;Train
112-50-5;CCOCCOCCOCCO;RB;1;Train
64-18-6;OC=O;RB;1;Train
124-17-4;CCCCOCCOCCOC(C)=O;RB;1;Train
112-15-2;CCOCCOCCOC(C)=O;RB;1;Train
75-75-2;C[S](O)(=O)=O;RB;1;Train
25415-84-3;CCCCC(CC)COC(=O)CCC;RB;1;Train
108-38-3;Cc1cccc(C)c1;RB;1;Train
552-16-9;OC(=O)c1ccccc1[N+]([O-])=O;RB;1;Train
91-64-5;O=C1Oc2ccccc2C=C1;RB;1;Train
109-66-0;CCCCC;RB;1;Train
107-83-5;CCCC(C)C;RB;1;Train
110-54-3;CCCCCC;RB;1;Train
111-84-2;CCCCCCCCC;RB;1;Train
112-52-7;CCCCCCCCCCCCCl;RB;1;Train
112-82-3;CCCCCCCCCCCCCCCCBr;RB;1;Train
110-58-7;CCCCCN;RB;1;Train
75-50-3;CN(C)C;RB;1;Train
67-56-1;CO;RB;1;Train
71-41-0;CCCCCO;RB;1;Train
75-56-9;CC1CO1;RB;1;Train
107-21-1;OCCO;RB;1;Train
57-55-6;CC(O)CO;RB;1;Train
584-03-2;CCC(O)CO;RB;1;Train
107-19-7;OCC#C;RB;1;Train
107-98-2;COCC(C)O;RB;1;Train
111-76-2;CCCCOCCO;RB;1;Train
123-38-6;CCC=O;RB;1;Train
5392-40-5;CC(C)=CCC\C(C)=C/C=O;RB;1;Train
563-80-4;CC(C)C(C)=O;RB;1;Train
67-64-1;CC(C)=O;RB;1;Train
88-09-5;CCC(CC)C(O)=O;RB;1;Train
65119-95-1;OC(=O)CCCCCCCCCCCCCCCCCCCCC=C;RB;1;Train
79-20-9;COC(C)=O;RB;1;Train
141-78-6;CCOC(C)=O;RB;1;Train
108-05-4;CC(=O)OC=C;RB;1;Train
110-49-6;COCCOC(C)=O;RB;1;Train
105-38-4;CCC(=O)OC=C;RB;1;Train
3050-69-9;CCCCCC(=O)OC=C;RB;1;Train
77-68-9;CC(C)C(O)C(C)(C)COC(=O)C(C)C;RB;1;Train
106-65-0;COC(=O)CCC(=O)OC;RB;1;Train
105-99-7;CCCCOC(=O)CCCCC(=O)OCCCC;RB;1;Train
103-24-2;CCCCC(CC)COC(=O)CCCCCCCC(=O)OCC(CC)CCCC;RB;1;Train
112-62-9;CCCCCCCC\C=C/CCCCCCCC(=O)OC;RB;1;Train
79-41-4;CC(=C)C(O)=O;RB;1;Train
80-62-6;COC(=O)C(C)=C;RB;1;Train
106-91-2;CC(=C)C(=O)OCC1CO1;RB;1;Train
868-77-9;CC(=C)C(=O)OCCO;RB;1;Train
2358-84-1;CC(=C)C(=O)OCCOCCOC(=O)C(C)=C;RB;1;Train
623-91-6;CCOC(=O)\C=C\C(=O)OCC;RB;1;Train
79-43-6;OC(=O)C(Cl)Cl;RB;1;Train
683-10-3;CCCCCCCCCCCC[N+](C)(C)CC([O-])=O;RB;1;Train
617-45-8;NC(CC(O)=O)C(O)=O;RB;1;Train
298-12-4;OC(=O)C=O;RB;1;Train
372-09-8;OC(=O)CC#N;RB;1;Train
08.10.4292;CCCCCCCCCCCC(=O)NCCC[N+](C)(C)CC([O-])=O;RB;1;Train
78-83-1;CC(C)CO;RB;1;Train
103429-90-9;COC(C)(C)CCOC(C)=O;RB;1;Train
620-17-7;CCc1cccc(O)c1;RB;1;Train
123-07-9;CCc1ccc(O)cc1;RB;1;Train
105-67-9;Cc1ccc(O)c(C)c1;RB;1;Train
91-16-7;COc1ccccc1OC;RB;1;Train
140-11-4;CC(=O)OCc1ccccc1;RB;1;Train
104-54-1;OC/C=C/c1ccccc1;RB;1;Train
123-08-0;Oc1ccc(C=O)cc1;RB;1;Train
121-33-5;COc1cc(C=O)ccc1O;RB;1;Train
118-90-1;Cc1ccccc1C(O)=O;RB;1;Train
131-11-3;COC(=O)c1ccccc1C(=O)OC;RB;1;Train
84-69-5;CC(C)COC(=O)c1ccccc1C(=O)OCC(C)C;RB;1;Train
1459-93-4;COC(=O)c1cccc(c1)C(=O)OC;RB;1;Train
552-30-7;OC(=O)c1ccc2C(=O)OC(=O)c2c1;RB;1;Train
120-51-4;O=C(OCc1ccccc1)c2ccccc2;RB;1;Train
99-96-7;OC(=O)c1ccc(O)cc1;RB;1;Train
98-67-9;Oc1ccc(cc1)[S](O)(=O)=O;RB;1;Train
99-85-4;CC(C)C1=CCC(=CC1)C;RB;1;Train
108-93-0;OC1CCCCC1;RB;1;Train
5726-19-2;CC1CCCCC1OC(C)=O;RB;1;Train
115-86-6;O=[P](Oc1ccccc1)(Oc2ccccc2)Oc3ccccc3;RB;1;Train
104-87-0;Cc1ccc(C=O)cc1;RB;1;Train
76-22-2;CC1(C)C2CCC1(C)C(=O)C2;RB;1;Train
80-56-8;CC1=CCC2CC1C2(C)C;RB;1;Train
507-70-0;CC1(C)[C@@H]2CC[C@@]1(C)[C@@H](O)C2;RB;1;Train
674-82-8;C=C1CC(=O)O1;RB;1;Train
87-41-2;O=C1OCc2ccccc12;RB;1;Train
98-01-1;O=Cc1occc1;RB;1;Train
97-99-4;OCC1CCCO1;RB;1;Train
85-41-6;O=C1NC(=O)c2ccccc12;RB;1;Train
872-50-4;CN1CCCC1=O;RB;1;Train
120-72-9;[nH]1ccc2ccccc12;RB;1;Train
1120-71-4;O=[S]1(=O)CCCO1;RB;1;Train
04.04.4719;OCCN1CN(CCO)CN(CCO)C1;RB;1;Train
26226-72-2;CCOC(=O)c1ccc(NC(=O)CCl)cc1;RB;1;Train
987-78-0;C[N+](C)(C)O[P]([O-])(=O)O[P](O)(=O)OC[C@H]1O[C@H]([C@H](O)[C@@H]1O)N2C=CC(=NC2=O)N;RB;1;Train
150-30-1;NC(Cc1ccccc1)C(O)=O;RB;1;Train
56-89-3;N[C@@H](CSSC[C@H](N)C(O)=O)C(O)=O;RB;1;Train
112-95-8;CCCCCCCCCCCCCCCCCCCC;RB;1;Train
78-81-9;CC(C)CN;RB;1;Train
124-40-3;CNC;RB;1;Train
109-89-7;CCNCC;RB;1;Train
64-17-5;CCO;RB;1;Train
67-63-0;CC(C)O;RB;1;Train
104-76-7;CCCCC(CC)CO;RB;1;Train
111-87-5;CCCCCCCCO;RB;1;Train
112-70-9;CCCCCCCCCCCCCO;RB;1;Train
546-68-9;CC(C)O[Ti](OC(C)C)(OC(C)C)OC(C)C;RB;1;Train
110-63-4;OCCCCO;RB;1;Train
143-28-2;CCCCCCCCC=CCCCCCCCCO;RB;1;Train
107-18-6;OCC=C;RB;1;Train
141-43-5;NCCO;RB;1;Train
2517-43-3;COC(C)CCO;RB;1;Train
75-07-0;CC=O;RB;1;Train
78-84-2;CC(C)C=O;RB;1;Train
108-10-1;CC(C)CC(C)=O;RB;1;Train
123-54-6;CC(=O)CC(C)=O;RB;1;Train
60-33-3;CCCCC\C=C/C/C=C\CCCCCCCC(O)=O;RB;1;Train
123-62-6;CCC(=O)OC(=O)CC;RB;1;Train
105-74-8;CCCCCCCCCCCC(=O)OOC(=O)CCCCCCCCCCC;RB;1;Train
7360-38-5;CCCCC(CC)C(=O)OCC(COC(=O)C(CC)CCCC)OC(=O)C(CC)CCCC;RB;1;Train
105-46-4;CCC(C)OC(C)=O;RB;1;Train
111-15-9;CCOCCOC(C)=O;RB;1;Train
626-86-8;CCOC(=O)CCCCC(O)=O;RB;1;Train
40677-77-8;CCCCCCCC\C=C/CCCCCCCCOC(=O)CCCCC(=O)OCCCCCCCC\C=C/CCCCCCCC;RB;1;Train
111-20-6;OC(=O)CCCCCCCCC(O)=O;RB;1;Train
821-38-5;OC(=O)CCCCCCCCCCCCC(O)=O;RB;1;Train
141-17-3;CCCCOCCOCCOC(=O)CCCCC(=O)OCCOCCOCCCC;RB;1;Train
105-53-3;CCOC(=O)CC(=O)OCC;RB;1;Train
123-28-4;CCCCCCCCCCCCOC(=O)CCSCCC(=O)OCCCCCCCCCCCC;RB;1;Train
95-92-1;CCOC(=O)C(=O)OCC;RB;1;Train
688-84-6;CCCCC(CC)COC(=O)C(C)=C;RB;1;Train
97-88-1;CCCCOC(=O)C(C)=C;RB;1;Train
32360-05-7;CCCCCCCCCCCCCCCCCCOC(=O)C(C)=C;RB;1;Train
110-16-7;OC(=O)\C=C/C(O)=O;RB;1;Train
79-14-1;OCC(O)=O;RB;1;Train
13562-76-0;CCC(C)OC(=O)CC(C)=O;RB;1;Train
126-98-7;CC(=C)C#N;RB;1;Train
107-68-6;CNCC[S](O)(=O)=O;RB;1;Train
541-41-3;CCOC(Cl)=O;RB;1;Train
2627-35-2;CCCCCCCCCCCCO[P](O)(O)=O;RB;1;Train
123-35-3;CC(C)=CCCC(=C)C=C;RB;1;Train
556-52-5;OCC1CO1;RB;1;Train
928-96-1;CC\C=C/CCO;RB;1;Train
5131-66-8;CCCCOCC(C)O;RB;1;Train
95-08-9;CCC(CC)C(=O)OCCOCCOCCOC(=O)C(CC)CC;RB;1;Train
869-29-4;CC(=O)OC(OC(C)=O)C=C;RB;1;Train
1758-73-2;NC(=N)[S](O)=O;RB;1;Train
99-87-6;CC(C)c1ccc(C)cc1;RB;1;Train
64-04-0;NCCc1ccccc1;RB;1;Train
108-95-2;Oc1ccccc1;RB;1;Train
120-80-9;Oc1ccccc1O;RB;1;Train
150-76-5;COc1ccc(O)cc1;RB;1;Train
93-15-2;COc1ccc(CC=C)cc1OC;RB;1;Train
88-06-2;Oc1c(Cl)cc(Cl)cc1Cl;RB;1;Train
122-03-2;CC(C)c1ccc(C=O)cc1;RB;1;Train
121-32-4;CCOc1cc(C=O)ccc1O;RB;1;Train
89-32-7;O=C1OC(=O)c2cc3C(=O)OC(=O)c3cc12;RB;1;Train
84-66-2;CCOC(=O)c1ccccc1C(=O)OCC;RB;1;Train
85-68-7;CCCCOC(=O)c1ccccc1C(=O)OCc2ccccc2;RB;1;Train
131-17-9;C=CCOC(=O)c1ccccc1C(=O)OCC=C;RB;1;Train
120-61-6;COC(=O)c1ccc(cc1)C(=O)OC;RB;1;Train
536-66-3;CC(C)c1ccc(cc1)C(O)=O;RB;1;Train
85-44-9;O=C1OC(=O)c2ccccc12;RB;1;Train
94-36-0;O=C(OOC(=O)c1ccccc1)c2ccccc2;RB;1;Train
1726-23-4;CCCCOC(=O)c1ccc(C(=O)OCCCC)c(c1)C(=O)OCCCC;RB;1;Train
65-85-0;OC(=O)c1ccccc1;RB;1;Train
150-13-0;Nc1ccc(cc1)C(O)=O;RB;1;Train
87-20-7;CC(C)CCOC(=O)c1ccccc1O;RB;1;Train
69-72-7;OC(=O)c1ccccc1O;RB;1;Train
50-78-2;CC(=O)Oc1ccccc1C(O)=O;RB;1;Train
2881-83-6;CCOC(=O)CC(=O)c1ccc(OC)cc1;RB;1;Train
98-11-3;O[S](=O)(=O)c1ccccc1;RB;1;Train
108-94-1;O=C1CCCCC1;RB;1;Train
93-09-4;OC(=O)c1ccc2ccccc2c1;RB;1;Train
120-57-0;O=Cc1ccc2OCOc2c1;RB;1;Train
626-64-2;O=C1C=CNC=C1;RB;1;Train
93-10-7;OC(=O)c1ccc2ccccc2n1;RB;1;Train
828-00-2;CC1CC(OC(C)O1)OC(C)=O;RB;1;Train
105-60-2;O=C1CCCCCN1;RB;1;Train
50-70-4;OC[C@H](O)[C@@H](O)[C@H](O)[C@H](O)CO;RB;1;Train
1338-41-6;CCCCCCCCCCCCCCCCCC(=O)OCC(O)[C@H]1OC[C@@H](O)[C@@H]1O;RB;1;Train
72-87-7;CC(=O)NC1C(O)OC(CO)C(O)C1O;RB;1;Train
6291-84-5;CNCCCN;RB;1;Train
1120-48-5;CCCCCCCCNCCCCCCCC;RB;1;Train
506-52-5;CCCCCCCCCCCCCCCCCCCCCCCCCCO;RB;1;Train
123-96-6;CCCCCCC(C)O;RB;1;Train
19780-16-6;CCCCCCCCCCCCCCCCCCC1CO1;RB;1;Train
4457-71-0;CC(CCO)CCO;RB;1;Train
141-79-7;CC(C)=CC(C)=O;RB;1;Train
64-19-7;CC(O)=O;RB;1;Train
627-83-8;CCCCCCCCCCCCCCCCCC(=O)OCCOC(=O)CCCCCCCCCCCCCCCCC;RB;1;Train
103-23-1;CCCCC(CC)COC(=O)CCCCC(=O)OCC(CC)CCCC;RB;1;Train
2432-87-3;CCCCCCCCOC(=O)CCCCCCCCC(=O)OCCCCCCCC;RB;1;Train
111-17-1;OC(=O)CCSCCC(O)=O;RB;1;Train
79-06-1;NC(=O)C=C;RB;1;Train
105-16-8;CCN(CC)CCOC(=O)C(C)=C;RB;1;Train
1852-16-0;CCCCOCNC(=O)C=C;RB;1;Train
110-17-8;OC(=O)/C=C/C(O)=O;RB;1;Train
50-21-5;CC(O)C(O)=O;RB;1;Train
617-48-1;OC(CC(O)=O)C(O)=O;RB;1;Train
105-45-3;COC(=O)CC(C)=O;RB;1;Train
142-22-3;C=CCOC(=O)OCCOCCOC(=O)OCC=C;RB;1;Train
6104-30-9;CC(C)C(NC(N)=O)NC(N)=O;RB;1;Train
110-93-0;CC(C)=CCCC(C)=O;RB;1;Train
100-44-7;ClCc1ccccc1;RB;1;Train
102-01-2;CC(=O)CC(=O)Nc1ccccc1;RB;1;Train
2415-85-2;CC(=O)CC(=O)Nc1ccc(C)cc1;RB;1;Train
588-46-5;CC(=O)NCc1ccccc1;RB;1;Train
501-24-6;CCCCCCCCCCCCCCCc1cccc(O)c1;RB;1;Train
123-31-9;Oc1ccc(O)cc1;RB;1;Train
122-00-9;CC(=O)c1ccc(C)cc1;RB;1;Train
28553-12-0;CC(C)CCCCCCOC(=O)c1ccccc1C(=O)OCCCCCCC(C)C;RB;1;Train
121-91-5;OC(=O)c1cccc(c1)C(O)=O;RB;1;Train
136-36-7;Oc1cccc(OC(=O)c2ccccc2)c1;RB;1;Train
586-62-9;CC(C)=C1CCC(=CC1)C;RB;1;Train
101-83-7;C1CCC(CC1)NC2CCCCC2;RB;1;Train
15205-57-9;C(OP(OCc1ccccc1)OCc2ccccc2)c3ccccc3;RB;1;Train
591-31-1;COc1cccc(C=O)c1;RB;1;Train
92-66-0;Brc1ccc(cc1)c2ccccc2;RB;1;Train
57-57-8;O=C1CCO1;RB;1;Train
98-00-0;OCc1occc1;RB;1;Train
96-48-0;O=C1CCCO1;RB;1;Train
517-23-7;CC(=O)C1CCOC1=O;RB;1;Train
108-32-7;CC1COC(=O)O1;RB;1;Train
499-83-2;OC(=O)c1cccc(n1)C(O)=O;RB;1;Train
56-40-6;NCC(O)=O;RB;1;Train
461-72-3;O=C1CNC(=O)N1;RB;1;Train
66-72-8;Cc1ncc(CO)c(C=O)c1O;RB;1;Train
56-85-9;N[C@@H](CCC(N)=O)C(O)=O;RB;1;Train
107-05-1;ClCC=C;RB;1;Train
56-81-5;OCC(O)CO;RB;1;Train
96-24-2;OCC(O)CCl;RB;1;Train
108-01-0;CN(C)CCO;RB;1;Train
34375-28-5;OCCNCO;RB;1;Train
107-22-2;O=CC=O;RB;1;Train
2724-58-5;CC(C)CCCCCCCCCCCCCCC(O)=O;RB;1;Train
111-03-5;CCCCCCCC\C=C/CCCCCCCC(=O)OCC(O)CO;RB;1;Train
60-35-5;CC(N)=O;RB;1;Train
4435-53-4;COC(C)CCOC(C)=O;RB;1;Train
142-77-8;CCCCCCCC/C=C/CCCCCCCC(=O)OCCCC;RB;1;Train
79-10-7;OC(=O)C=C;RB;1;Train
141-32-2;CCCCOC(=O)C=C;RB;1;Train
96-05-9;CC(=C)C(=O)OCC=C;RB;1;Train
74-79-3;N[C@@H](CCCN=C(N)N)C(O)=O;RB;1;Train
08.07.8013;CCCCCC1OC1CC2OC2CCCCCCCC(=O)OCC(COC(=O)CCCCCCCC3OC3CC4OC4CCCCC)OC(=O)CCCCCCCC5OC5CC6OC6CCCCC;RB;1;Train
2243-27-8;CCCCCCCCC#N;RB;1;Train
75-05-8;CC#N;RB;1;Train
105-56-6;CCOC(=O)CC#N;RB;1;Train
2082-80-6;CCCCCCCCCCCCCCCCCCOP(OCCCCCCCCCCCCCCCCCC)OCCCCCCCCCCCCCCCCCC;RB;1;Train
103-84-4;CC(=O)Nc1ccccc1;RB;1;Train
100-46-9;NCc1ccccc1;RB;1;Train
108-46-3;Oc1cccc(O)c1;RB;1;Train
103-73-1;CCOc1ccccc1;RB;1;Train
104-94-9;COc1ccc(N)cc1;RB;1;Train
100-52-7;O=Cc1ccccc1;RB;1;Train
98-86-2;CC(=O)c1ccccc1;RB;1;Train
84-74-2;CCCCOC(=O)c1ccccc1C(=O)OCCCC;RB;1;Train
117-81-7;CCCCC(CC)COC(=O)c1ccccc1C(=O)OCC(CC)CCCC;RB;1;Train
62-23-7;OC(=O)c1ccc(cc1)[N+]([O-])=O;RB;1;Train
149-91-7;OC(=O)c1cc(O)c(O)c(O)c1;RB;1;Train
100-47-0;N#Cc1ccccc1;RB;1;Train
108-91-8;NC1CCCCC1;RB;1;Train
31906-04-4;CC(C)(O)CCCC1=CCC(CC1)C=O;RB;1;Train
1745-81-9;Oc1ccccc1CC=C;RB;1;Train
92-52-4;c1ccc(cc1)c2ccccc2;RB;1;Train
96-49-1;O=C1OCCO1;RB;1;Train
142-08-5;O=C1NC=CC=C1;RB;1;Train
110-89-4;C1CCNCC1;RB;1;Train
101-25-7;O=NN1CN2CN(C1)CN(C2)N=O;RB;1;Train
69-65-8;OC[C@@H](O)[C@@H](O)[C@H](O)[C@H](O)CO;RB;1;Train
3234-85-3;CCCCCCCCCCCCCCOC(=O)CCCCCCCCCCCCC;RB;1;Train
629-62-9;CCCCCCCCCCCCCCC;RB;1;Train
124-09-4;NCCCCCCN;RB;1;Train
111-42-2;OCCNCCO;RB;1;Train
693-36-7;CCCCCCCCCCCCCCCCCCOC(=O)CCSCCC(=O)OCCCCCCCCCCCCCCCCCC;RB;1;Train
140-88-5;CCOC(=O)C=C;RB;1;Train
103-11-7;CCCCCCCCOC(=O)C=C;RB;1;Train
108-31-6;O=C1OC(=O)C=C1;RB;1;Train
78-82-0;CC(C)C#N;RB;1;Train
71-43-2;c1ccccc1;RB;1;Train
100-66-3;COc1ccccc1;RB;1;Train
90-04-0;COc1ccccc1N;RB;1;Train
84-65-1;O=C1c2ccccc2C(=O)c3ccccc13;RB;1;Train
1338-43-8;CCCCCCCC/C=C/CCCCCCCC(=O)OCC(O)C1OCC(O)C1O;RB;1;Train
26266-57-9;CCCCCCCCCCCCCCCC(=O)OC[C@@H](O)[C@H]1OC[C@H](O)[C@H]1O;RB;1;Train
102-47-6;ClCc1ccc(Cl)c(Cl)c1;NRB;0;Train
538-75-0;C1CCC(CC1)N=C=NC2CCCCC2;NRB;0;Train
935-79-5;O=C1OC(=O)C2CC=CCC12;NRB;0;Train
307-55-1;OC(=O)C(F)(F)C(F)(F)C(F)(F)C(F)(F)C(F)(F)C(F)(F)C(F)(F)C(F)(F)C(F)(F)C(F)(F)C(F)(F)F;NRB;0;Train
376-06-7;OC(=O)C(F)(F)C(F)(F)C(F)(F)C(F)(F)C(F)(F)C(F)(F)C(F)(F)C(F)(F)C(F)(F)C(F)(F)C(F)(F)C(F)(F)C(F)(F)F;NRB;0;Train
118-74-1;Clc1c(Cl)c(Cl)c(Cl)c(Cl)c1Cl;NRB;0;Train
732-26-3;CC(C)(C)c1cc(c(O)c(c1)C(C)(C)C)C(C)(C)C;NRB;0;Train
4904-61-4;C\1C\C=C\CC\C=C\CC\C=C1;NRB;0;Train
6731-36-8;CC1CC(C)(C)CC(C1)(OOC(C)(C)C)OOC(C)(C)C;NRB;0;Train
595-90-4;c1ccc(cc1)[Sn](c2ccccc2)(c3ccccc3)c4ccccc4;NRB;0;Train
52184-14-2;CC(C)(C)c1cc(N=Nc2ccccc2[N+]([O-])=O)c(O)c(c1)C(C)(C)C;NRB;0;Train
1460-02-2;CC(C)(C)c1cc(cc(c1)C(C)(C)C)C(C)(C)C;NRB;0;Train
92-86-4;Brc1ccc(cc1)c2ccc(Br)cc2;NRB;0;Train
118-82-1;CC(C)(C)c1cc(Cc2cc(c(O)c(c2)C(C)(C)C)C(C)(C)C)cc(c1O)C(C)(C)C;NRB;0;Train
115-32-2;OC(c1ccc(Cl)cc1)(c2ccc(Cl)cc2)C(Cl)(Cl)Cl;NRB;0;Train
72-20-8;ClC1=C(Cl)C2(Cl)C3C4CC(C5OC45)C3C1(Cl)C2(Cl)Cl;NRB;0;Train
309-00-2;ClC1=C(Cl)[C@]2(Cl)[C@@H]3[C@@H]4C[C@@H](C=C4)[C@@H]3[C@@]1(Cl)C2(Cl)Cl;NRB;0;Train
57-74-9;ClC1CC2C(C1Cl)C3(Cl)C(=C(Cl)C2(Cl)C3(Cl)Cl)Cl;NRB;0;Train
2668-47-5;CC(C)(C)c1cc(cc(c1O)C(C)(C)C)c2ccccc2;NRB;0;Train
4979-32-2;C1CCC(CC1)N(Sc2sc3ccccc3n2)C4CCCCC4;NRB;0;Train
127-90-2;ClC(COCC(Cl)C(Cl)(Cl)Cl)C(Cl)(Cl)Cl;NRB;0;Train
12002-48-1;Clc1cccc(Cl)c1Cl;NRB;0;Train
634-66-2;Clc1ccc(Cl)c(Cl)c1Cl;NRB;0;Train
95-94-3;Clc1cc(Cl)c(Cl)cc1Cl;NRB;0;Train
608-93-5;Clc1cc(Cl)c(Cl)c(Cl)c1Cl;NRB;0;Train
1836-77-7;[O-][N+](=O)c1ccc(Oc2c(Cl)cc(Cl)cc2Cl)cc1;NRB;0;Train
4821-19-6;Oc1c(cccc1C2CCCCC2)C3CCCCC3;NRB;0;Train
101-81-5;C(c1ccccc1)c2ccccc2;NRB;0;Train
42240-73-3;Nc1ccc(Cc2ccc(N)c(Cl)c2Cl)c(Cl)c1Cl;NRB;0;Train
90-30-2;N(c1ccccc1)c2cccc3ccccc23;NRB;0;Train
3030-47-5;CN(C)CCN(C)CCN(C)C;NRB;0;Train
57-14-7;CN(C)N;NRB;0;Train
52-51-7;OCC(Br)(CO)[N+]([O-])=O;NRB;0;Train
115-10-6;COC;NRB;0;Train
108-20-3;CC(C)OC(C)C;NRB;0;Train
111-96-6;COCCOCCOC;NRB;0;Train
624-92-0;CSSC;NRB;0;Train
108-62-3;CC1OC(C)OC(C)OC(C)O1;NRB;0;Train
144-48-9;NC(=O)CI;NRB;0;Train
78-67-1;CC(C)(N=NC(C)(C)C#N)C#N;NRB;0;Train
556-61-6;CN=C=S;NRB;0;Train
60-34-4;CNN;NRB;0;Train
1592-20-7;ClCc1ccc(C=C)cc1;NRB;0;Train
117-08-8;Clc1c(Cl)c(Cl)c2C(=O)OC(=O)c2c1Cl;NRB;0;Train
611-19-8;ClCc1ccccc1Cl;NRB;0;Train
87-62-7;Cc1cccc(C)c1N;NRB;0;Train
95-54-5;Nc1ccccc1N;NRB;0;Train
108-44-1;Cc1cccc(N)c1;NRB;0;Train
106-47-8;Nc1ccc(Cl)cc1;NRB;0;Train
83-41-0;Cc1cccc(c1C)[N+]([O-])=O;NRB;0;Train
100-14-1;[O-][N+](=O)c1ccc(CCl)cc1;NRB;0;Train
04.12.5329;NNc1c(Cl)cc(Cl)cc1Cl;NRB;0;Train
585-34-2;CC(C)(C)c1cccc(O)c1;NRB;0;Train
95-87-4;Cc1ccc(C)c(O)c1;NRB;0;Train
536-90-3;COc1cccc(N)c1;NRB;0;Train
89-64-5;Oc1ccc(Cl)cc1[N+]([O-])=O;NRB;0;Train
80-15-9;CC(C)(OO)c1ccccc1;NRB;0;Train
873-32-5;Clc1ccccc1C#N;NRB;0;Train
111-78-4;C\1C\C=C/CC\C=C1;NRB;0;Train
2579-20-6;NCC1CCCC(CN)C1;NRB;0;Train
106-86-5;OC1CCC(CC1O)C=C;NRB;0;Train
80-10-4;Cl[Si](Cl)(c1ccccc1)c2ccccc2;NRB;0;Train
605-71-0;[O-][N+](=O)c1cccc2c1cccc2[N+]([O-])=O;NRB;0;Train
130-15-4;O=C1C=CC(=O)c2ccccc12;NRB;0;Train
7417-99-4;O=C(Nc1ccc(Cc2ccc(NC(=O)N3CC3)cc2)cc1)N4CC4;NRB;0;Train
693-98-1;Cc1[nH]ccn1;NRB;0;Train
100-69-6;C=Cc1ccccn1;NRB;0;Train
21587-74-6;NCCC[CH]1OC[C]2(CO1)CO[CH](CCCN)OC2;NRB;0;Train
3347-22-6;O=C1C2=C(SC(=C(S2)C#N)C#N)C(=O)c3ccccc13;NRB;0;Train
100-74-3;CCN1CCOCC1;NRB;0;Train
140-31-8;NCCN1CCNCC1;NRB;0;Train
85-40-5;O=C1NC(=O)C2CC=CCC12;NRB;0;Train
2402-78-0;Clc1cccc(Cl)n1;NRB;0;Train
26172-55-4;CN1SC(=CC1=O)Cl;NRB;0;Train
2634-33-5;O=C1NSc2ccccc12;NRB;0;Train
107-06-2;ClCCCl;NRB;0;Train
527-84-4;CC(C)c1ccccc1C;NRB;0;Train
63-74-1;Nc1ccc(cc1)[S](N)(=O)=O;NRB;0;Train
131-56-6;Oc1ccc(c(O)c1)C(=O)c2ccccc2;NRB;0;Train
1333-16-0;Oc1ccccc1Cc2ccccc2O;NRB;0;Train
540-84-1;CC(C)CC(C)(C)C;NRB;0;Train
56-23-5;ClC(Cl)(Cl)Cl;NRB;0;Train
67-72-1;ClC(Cl)(Cl)C(Cl)(Cl)Cl;NRB;0;Train
124-73-2;FC(F)(Br)C(F)(F)Br;NRB;0;Train
626-23-3;CCC(C)NC(C)CC;NRB;0;Train
123-77-3;NC(=O)N=NC(N)=O;NRB;0;Train
15263-53-3;CN(C)C(CSC(N)=O)CSC(N)=O;NRB;0;Train
78-51-3;CCCCOCCO[P](=O)(OCCOCCCC)OCCOCCCC;NRB;0;Train
1461-25-2;CCCC[Sn](CCCC)(CCCC)CCCC;NRB;0;Train
98-83-9;CC(=C)c1ccccc1;NRB;0;Train
526-73-8;Cc1cccc(C)c1C;NRB;0;Train
28106-30-1;CCc1ccccc1C=C;NRB;0;Train
105-05-5;CCc1ccc(CC)cc1;NRB;0;Train
141-93-5;CCc1cccc(CC)c1;NRB;0;Train
1321-74-0;C=Cc1ccccc1C=C;NRB;0;Train
98-81-7;BrC(=C)c1ccccc1;NRB;0;Train
103-64-0;BrC=Cc1ccccc1;NRB;0;Train
541-73-1;Clc1cccc(Cl)c1;NRB;0;Train
106-46-7;Clc1ccc(Cl)cc1;NRB;0;Train
95-50-1;Clc1ccccc1Cl;NRB;0;Train
106-37-6;Brc1ccc(Br)cc1;NRB;0;Train
95-73-8;Cc1ccc(Cl)cc1Cl;NRB;0;Train
118-69-4;Cc1c(Cl)cccc1Cl;NRB;0;Train
696-44-6;CNc1cccc(C)c1;NRB;0;Train
122-39-4;N(c1ccccc1)c2ccccc2;NRB;0;Train
554-00-7;Nc1ccc(Cl)cc1Cl;NRB;0;Train
95-82-9;Nc1cc(Cl)ccc1Cl;NRB;0;Train
60-09-3;Nc1ccc(cc1)N=Nc2ccccc2;NRB;0;Train
88-74-4;Nc1ccccc1[N+]([O-])=O;NRB;0;Train
89-63-4;Nc1ccc(Cl)cc1[N+]([O-])=O;NRB;0;Train
3531-19-9;Nc1c(Cl)cc(cc1[N+]([O-])=O)[N+]([O-])=O;NRB;0;Train
88-73-3;[O-][N+](=O)c1ccccc1Cl;NRB;0;Train
25154-54-5;[O-][N+](=O)c1ccccc1[N+]([O-])=O;NRB;0;Train
610-39-9;Cc1ccc(c(c1)[N+]([O-])=O)[N+]([O-])=O;NRB;0;Train
25321-14-6;Cc1ccc(cc1[N+]([O-])=O)[N+]([O-])=O;NRB;0;Train
121-86-8;Cc1ccc(cc1Cl)[N+]([O-])=O;NRB;0;Train
118-83-2;[O-][N+](=O)c1ccc(Cl)cc1C(F)(F)F;NRB;0;Train
97-00-7;[O-][N+](=O)c1ccc(Cl)c(c1)[N+]([O-])=O;NRB;0;Train
99-54-7;[O-][N+](=O)c1ccc(Cl)c(Cl)c1;NRB;0;Train
611-06-3;[O-][N+](=O)c1ccc(Cl)cc1Cl;NRB;0;Train
102-06-7;NC(=N)N(c1ccccc1)c2ccccc2;NRB;0;Train
4286-23-1;CC(=C)c1ccc(O)cc1;NRB;0;Train
89-72-5;CCC(C)c1ccccc1O;NRB;0;Train
99-71-8;CCC(C)c1ccc(O)cc1;NRB;0;Train
140-66-9;CC(C)(C)CC(C)(C)c1ccc(O)cc1;NRB;0;Train
27193-86-8;CCCCCCCCCCCCc1ccccc1O;NRB;0;Train
120-95-6;CCC(C)(C)c1ccc(O)c(c1)C(C)(C)CC;NRB;0;Train
96-76-4;CC(C)(C)c1ccc(O)c(c1)C(C)(C)C;NRB;0;Train
2078-54-8;CC(C)c1cccc(C(C)C)c1O;NRB;0;Train
2409-55-4;Cc1ccc(O)c(c1)C(C)(C)C;NRB;0;Train
89-83-8;CC(C)c1ccc(C)cc1O;NRB;0;Train
4130-42-1;CCc1cc(c(O)c(c1)C(C)(C)C)C(C)(C)C;NRB;0;Train
88-26-6;CC(C)(C)c1cc(CO)cc(c1O)C(C)(C)C;NRB;0;Train
101-53-1;Oc1ccc(Cc2ccccc2)cc1;NRB;0;Train
67557-76-0;CCC(C)c1ccc(OCC2CO2)cc1;NRB;0;Train
20367-35-5;CCCCOc1ccccc1OCCCC;NRB;0;Train
25013-16-5;COc1ccc(O)c(c1)C(C)(C)C;NRB;0;Train
91-23-6;COc1ccccc1[N+]([O-])=O;NRB;0;Train
2042-14-0;Cc1ccc(O)cc1[N+]([O-])=O;NRB;0;Train
2581-34-2;Cc1cc(O)ccc1[N+]([O-])=O;NRB;0;Train
5428-54-6;Cc1ccc(cc1O)[N+]([O-])=O;NRB;0;Train
88-85-7;CCC(C)c1cc(cc(c1O)[N+]([O-])=O)[N+]([O-])=O;NRB;0;Train
95-57-8;Oc1ccccc1Cl;NRB;0;Train
108-43-0;Oc1cccc(Cl)c1;NRB;0;Train
106-41-2;Oc1ccc(Br)cc1;NRB;0;Train
591-20-8;Oc1cccc(Br)c1;NRB;0;Train
95-56-7;Oc1ccccc1Br;NRB;0;Train
29772-02-9;Clc1ccc(OCOCC#CI)cc1;NRB;0;Train
59-50-7;Cc1cc(O)ccc1Cl;NRB;0;Train
120-83-2;Oc1ccc(Cl)cc1Cl;NRB;0;Train
615-58-7;Oc1ccc(Br)cc1Br;NRB;0;Train
576-24-9;Oc1cccc(Cl)c1Cl;NRB;0;Train
87-65-0;Oc1c(Cl)cccc1Cl;NRB;0;Train
95-77-2;Oc1ccc(Cl)c(Cl)c1;NRB;0;Train
591-35-5;Oc1cc(Cl)cc(Cl)c1;NRB;0;Train
609-89-2;Oc1c(Cl)cc(Cl)cc1[N+]([O-])=O;NRB;0;Train
103-50-4;C(OCc1ccccc1)c2ccccc2;NRB;0;Train
119-61-9;O=C(c1ccccc1)c2ccccc2;NRB;0;Train
623-26-7;N#Cc1ccc(cc1)C#N;NRB;0;Train
1897-45-6;Clc1c(Cl)c(C#N)c(Cl)c(C#N)c1Cl;NRB;0;Train
330-55-2;CON(C)C(=O)Nc1ccc(Cl)c(Cl)c1;NRB;0;Train
24019-05-4;O[S](=O)(=O)c1cc(Cl)ccc1Oc2ccc(Cl)cc2NC(=O)Nc3ccc(Cl)c(Cl)c3;NRB;0;Train
3766-81-2;CCC(C)c1ccccc1OC(=O)NC;NRB;0;Train
2631-40-5;CNC(=O)Oc1ccccc1C(C)C;NRB;0;Train
584-84-9;Cc1ccc(cc1N=C=O)N=C=O;NRB;0;Train
1678-91-7;CCC1CCCCC1;NRB;0;Train
110-82-7;C1CCCCC1;NRB;0;Train
110-83-8;C1CCC=CC1;NRB;0;Train
87-84-3;ClC1C(Br)C(Br)C(Br)C(Br)C1Br;NRB;0;Train
542-18-7;ClC1CCCCC1;NRB;0;Train
3194-57-8;BrC1CCC(Br)C(Br)CCC1Br;NRB;0;Train
3644-38-0;CCCC[Sn](CCCC)(CCCC)Oc1c(Cl)c(Cl)c(Cl)c(Cl)c1Cl;NRB;0;Train
122-14-5;CO[P](=S)(OC)Oc1ccc(c(C)c1)[N+]([O-])=O;NRB;0;Train
608-71-9;Oc1c(Br)c(Br)c(Br)c(Br)c1Br;NRB;0;Train
19715-19-6;CC(C)(C)c1cc(C(O)=O)c(O)c(c1)C(C)(C)C;NRB;0;Train
961-11-5;CO[P](=O)(OC)OC(=CCl)c1cc(Cl)c(Cl)cc1Cl;NRB;0;Train
5707-44-8;CCc1ccc(cc1)c2ccccc2;NRB;0;Train
40766-31-2;CC(c1ccccc1)c2cccc(C)c2C;NRB;0;Train
101-77-9;Nc1ccc(Cc2ccc(N)cc2)cc1;NRB;0;Train
843-55-0;Oc1ccc(cc1)C2(CCCCC2)c3ccc(O)cc3;NRB;0;Train
97-23-4;Oc1ccc(Cl)cc1Cc2cc(Cl)ccc2O;NRB;0;Train
70-30-4;Oc1c(Cl)cc(Cl)c(Cl)c1Cc2c(O)c(Cl)cc(Cl)c2Cl;NRB;0;Train
101-14-4;Nc1ccc(Cc2ccc(N)c(Cl)c2)cc1Cl;NRB;0;Train
119-47-1;Cc1cc(Cc2cc(C)cc(c2O)C(C)(C)C)c(O)c(c1)C(C)(C)C;NRB;0;Train
6864-37-5;CC1CC(CCC1N)CC2CCC(N)C(C)C2;NRB;0;Train
80-05-7;CC(C)(c1ccc(O)cc1)c2ccc(O)cc2;NRB;0;Train
1843-05-6;CCCCCCCCOc1ccc(c(O)c1)C(=O)c2ccccc2;NRB;0;Train
510-15-6;CCOC(=O)C(O)(c1ccc(Cl)cc1)c2ccc(Cl)cc2;NRB;0;Train
79-94-7;CC(C)(c1cc(Br)c(O)c(Br)c1)c2cc(Br)c(O)c(Br)c2;NRB;0;Train
134-32-7;Nc1cccc2ccccc12;NRB;0;Train
2243-62-1;Nc1cccc2c(N)cccc12;NRB;0;Train
479-27-6;Nc1cccc2cccc(N)c12;NRB;0;Train
135-88-6;N(c1ccccc1)c2ccc3ccccc3c2;NRB;0;Train
2050-76-2;Oc1c(Cl)cc(Cl)c2ccccc12;NRB;0;Train
119-64-2;C1CCc2ccccc2C1;NRB;0;Train
3048-65-5;C1C=CCC2C=CCC12;NRB;0;Train
16219-75-3;C\C=C1/CC2CC1C=C2;NRB;0;Train
77-73-6;C1C=CC2C3CC(C=C3)C12;NRB;0;Train
82-45-1;Nc1cccc2C(=O)c3ccccc3C(=O)c12;NRB;0;Train
92-88-6;Oc1ccc(cc1)c2ccc(O)cc2;NRB;0;Train
6362-80-7;CC(C)(CC(=C)c1ccccc1)c2ccccc2;NRB;0;Train
85954-11-6;Cc1cc(cc(C)c1OCC2CO2)c3cc(C)c(OCC4CO4)c(C)c3;NRB;0;Train
948-65-2;[nH]1c2ccccc2cc1c3ccccc3;NRB;0;Train
10605-21-7;COC(=O)Nc1[nH]c2ccccc2n1;NRB;0;Train
94-52-0;[O-][N+](=O)c1ccc2[nH]cnc2c1;NRB;0;Train
100-43-6;C=Cc1ccncc1;NRB;0;Train
504-29-0;Nc1ccccn1;NRB;0;Train
504-24-5;Nc1ccncc1;NRB;0;Train
462-08-8;Nc1cccnc1;NRB;0;Train
148-24-3;Oc1cccc2cccnc12;NRB;0;Train
92-84-2;N1c2ccccc2Sc3ccccc13;NRB;0;Train
333-41-5;CCO[P](=S)(OCC)Oc1cc(C)nc(n1)C(C)C;NRB;0;Train
2465-27-2;CN(C)c1ccc(cc1)C(=N)c2ccc(cc2)N(C)C;NRB;0;Train
21564-17-0;N#CSCSc1sc2ccccc2n1;NRB;0;Train
55250-84-5;CN(C1CCCCC1)c2ccc3c(Oc4cc(C)c(Nc5ccccc5)cc4C36OC(=O)c7ccccc67)c2;NRB;0;Train
834-12-8;CCNc1nc(NC(C)C)nc(SC)n1;NRB;0;Train
90-41-5;Nc1ccccc1c2ccccc2;NRB;0;Train
134-83-8;ClC(c1ccccc1)c2ccc(Cl)cc2;NRB;0;Train
110-02-1;s1cccc1;NRB;0;Train
71-55-6;CC(Cl)(Cl)Cl;NRB;0;Train
7299-99-2;CCCCC(CC)C(=O)OCC(COC(=O)C(CC)CCCC)(COC(=O)C(CC)CCCC)COC(=O)C(CC)CCCC;NRB;0;Train
112-96-9;CCCCCCCCCCCCCCCCCCN=C=O;NRB;0;Train
79-19-6;NNC(N)=S;NRB;0;Train
402-31-3;FC(F)(F)c1cccc(c1)C(F)(F)F;NRB;0;Train
99-09-2;Nc1cccc(c1)[N+]([O-])=O;NRB;0;Train
88-75-5;Oc1ccccc1[N](=O)=O;NRB;0;Train
100-17-4;COc1ccc(cc1)[N+]([O-])=O;NRB;0;Train
119-33-5;Cc1ccc(O)c(c1)[N+]([O-])=O;NRB;0;Train
94-75-7;OC(=O)COc1ccc(Cl)cc1Cl;NRB;0;Train
3622-84-2;CCCCN[S](=O)(=O)c1ccccc1;NRB;0;Train
599-61-1;Nc1cccc(c1)[S](=O)(=O)c2cccc(N)c2;NRB;0;Train
330-54-1;CN(C)C(=O)Nc1ccc(Cl)c(Cl)c1;NRB;0;Train
782-74-1;Clc1ccccc1NNc2ccccc2Cl;NRB;0;Train
86-73-7;C1c2ccccc2c3ccccc13;NRB;0;Train
719-96-0;FC(Cl)(Cl)SN1C(=O)c2ccccc2C1=O;NRB;0;Train
1552-42-7;CN(C)c1ccc(cc1)C2(OC(=O)c3cc(ccc23)N(C)C)c4ccc(cc4)N(C)C;NRB;0;Train
05.11.3896;Cc1cc(n2nc3ccc(Cl)cc3n2)c(O)c(c1)C(C)(C)C;NRB;0;Train
10315-98-7;CC(C)CN1CCOCC1;NRB;0;Train
51-52-5;CCCC1=CC(=O)NC(=S)N1;NRB;0;Train
482-89-3;O=C1\C(Nc2ccccc12)=C\3Nc4ccccc4C3=O;NRB;0;Train
10319-14-9;Oc1c(Br)c2ccccc2nc1C3C(=O)c4ccccc4C3=O;NRB;0;Train
71767-67-4;[O-][N+](=O)c1cc(Cl)c(N=Nc2ccc(cc2)N(CCC#N)CCC#N)c(Cl)c1;NRB;0;Train
61968-52-3;CCC(=O)Nc1cc(ccc1N=Nc2ccc(cc2Cl)[N](=O)=O)N(CCOC(C)=O)CCOC(C)=O;NRB;0;Train
59722-76-8;Nc1c(Oc2ccc(Br)cc2)cc(O)c3C(=O)c4ccccc4C(=O)c13;NRB;0;Train
12217-77-5;Oc1ccc(Nc2ccccc2)c3C(=O)c4c(c(O)ccc4[N+]([O-])=O)C(=O)c13;NRB;0;Train
26780-96-1;CC1=CC(C)(C)Nc2ccccc12;NRB;0;Train
67-66-3;ClC(Cl)Cl;NRB;0;Train
106-93-4;BrCCBr;NRB;0;Train
96-18-4;ClCC(Cl)CCl;NRB;0;Train
103-69-5;CCNc1ccccc1;NRB;0;Train
2855-13-2;CC1(C)CC(N)CC(C)(CN)C1;NRB;0;Train
1141-38-4;OC(=O)c1ccc2cc(ccc2c1)C(O)=O;NRB;0;Train
583-39-1;S=C1Nc2ccccc2N1;NRB;0;Train
132-65-0;s1c2ccccc2c3ccccc13;NRB;0;Train
96-50-4;Nc1sccn1;NRB;0;Train
50-06-6;CCC1(C(=O)NC(=O)NC1=O)c2ccccc2;NRB;0;Train
09.04.4390;CC(CC(C)(C)C)CC(C)(C)CC(C)(C)C;NRB;0;Train
75-64-9;CC(C)(C)N;NRB;0;Train
108-00-9;CN(C)CCN;NRB;0;Train
111-40-0;NCCNCCN;NRB;0;Train
112-24-3;NCCNCCNCCN;NRB;0;Train
75-91-2;CC(C)(C)OO;NRB;0;Train
111-41-1;NCCNCCO;NRB;0;Train
2885-00-9;CCCCCCCCCCCCCCCCCCS;NRB;0;Train
461-58-5;NC(N)=NC#N;NRB;0;Train
1656-63-9;CCCCCCCCCCCCSP(SCCCCCCCCCCCC)SCCCCCCCCCCCC;NRB;0;Train
78-40-0;CCO[P](=O)(OCC)OCC;NRB;0;Train
512-56-1;CO[P](=O)(OC)OC;NRB;0;Train
78-42-2;CCCCC(CC)CO[P](=O)(OCC(CC)CCCC)OCC(CC)CCCC;NRB;0;Train
3634-67-1;CCCCCC[Si](Cl)(CCCCCC)CCCCCC;NRB;0;Train
95-80-7;Cc1ccc(N)cc1N;NRB;0;Train
95-78-3;Cc1ccc(C)c(N)c1;NRB;0;Train
101-61-1;CN(C)c1ccc(Cc2ccc(cc2)N(C)C)cc1;NRB;0;Train
99-64-9;CN(C)c1cccc(c1)C(O)=O;NRB;0;Train
603-11-2;OC(=O)c1cccc(c1C(O)=O)[N+]([O-])=O;NRB;0;Train
6683-19-8;CC(C)(C)c1cc(CCC(=O)OCC(COC(=O)CCc2cc(c(O)c(c2)C(C)(C)C)C(C)(C)C)(COC(=O)CCc3cc(c(O)c(c3)C(C)(C)C)C(C)(C)C)COC(=O)CCc4cc(c(O)c(c4)C(C)(C)C)C(C)(C)C)cc(c1O)C(C)(C)C;NRB;0;Train
88-44-8;Cc1ccc(N)c(c1)[S](O)(=O)=O;NRB;0;Train
88-53-9;Cc1cc(N)c(cc1Cl)[S](O)(=O)=O;NRB;0;Train
80-09-1;Oc1ccc(cc1)[S](=O)(=O)c2ccc(O)cc2;NRB;0;Train
19438-60-9;CC1CCC2C(C1)C(=O)OC2=O;NRB;0;Train
1212-29-9;S=C(NC1CCCCC1)NC2CCCCC2;NRB;0;Train
76-86-8;Cl[Si](c1ccccc1)(c2ccccc2)c3ccccc3;NRB;0;Train
1163-19-5;Brc1c(Br)c(Br)c(Oc2c(Br)c(Br)c(Br)c(Br)c2Br)c(Br)c1Br;NRB;0;Train
1709-70-2;Cc1c(Cc2cc(c(O)c(c2)C(C)(C)C)C(C)(C)C)c(C)c(Cc3cc(c(O)c(c3)C(C)(C)C)C(C)(C)C)c(C)c1Cc4cc(c(O)c(c4)C(C)(C)C)C(C)(C)C;NRB;0;Train
10081-67-1;CC(C)(c1ccccc1)c2ccc(Nc3ccc(cc3)C(C)(C)c4ccccc4)cc2;NRB;0;Train
76-93-7;OC(=O)C(O)(c1ccccc1)c2ccccc2;NRB;0;Train
81-11-8;Nc1ccc(\C=C\c2ccc(N)cc2[S](O)(=O)=O)c(c1)[S](O)(=O)=O;NRB;0;Train
7267-14-3;OC(=O)c1ccc(Cl)c2c(Cl)ccc(C(=O)OC(=O)c3ccc(Cl)c4c(Cl)ccc(C(O)=O)c34)c12;NRB;0;Train
115-28-6;OC(=O)C1C(C(O)=O)C2(Cl)C(=C(Cl)C1(Cl)C2(Cl)Cl)Cl;NRB;0;Train
3733-79-7;CC(C)C1=CC2C(C)CC1C3C2C(=O)OC3=O;NRB;0;Train
83-32-9;C1Cc2cccc3cccc1c23;NRB;0;Train
123251-96-7;Nc1c(Cl)cc(cc1[S](O)(=O)=O)c2cc(Cl)c(N)c(c2)[S](O)(=O)=O;NRB;0;Train
86-87-3;OC(=O)Cc1cccc2ccccc12;NRB;0;Train
2939-80-2;ClC(Cl)C(Cl)(Cl)SN1C(=O)C2CC=CCC2C1=O;NRB;0;Train
61-82-5;Nc1[nH]cnn1;NRB;0;Train
2403-88-5;CC1(C)CC(O)CC(C)(C)N1;NRB;0;Train
120-54-7;S=C(SSSSC(=S)N1CCCCC1)N2CCCCC2;NRB;0;Train
123-91-1;C1COCCO1;NRB;0;Train
108-78-1;Nc1nc(N)nc(N)n1;NRB;0;Train
108-80-5;O=C1NC(=O)NC(=O)N1;NRB;0;Train
27676-62-6;CC(C)(C)c1cc(CN2C(=O)N(Cc3cc(c(O)c(c3)C(C)(C)C)C(C)(C)C)C(=O)N(Cc4cc(c(O)c(c4)C(C)(C)C)C(C)(C)C)C2=O)cc(c1O)C(C)(C)C;NRB;0;Train
6674-22-2;C1CCN2CCCN=C2CC1;NRB;0;Train
280-57-9;C1CN2CCN1CC2;NRB;0;Train
91-96-3;CC(=O)CC(=O)Nc1ccc(cc1C)c2ccc(NC(=O)CC(C)=O)c(C)c2;NRB;0;Train
26630-87-5;CC(=O)OCCN(CCOC(C)=O)c1ccc(N=Nc2sc3cc(Cl)ccc3n2)c(NC(=O)c4ccccc4)c1;NRB;0;Train
6358-85-6;CC(=O)C(N=Nc1ccc(cc1Cl)c2ccc(N=NC(C(C)=O)C(=O)Nc3ccccc3)c(Cl)c2)C(=O)Nc4ccccc4;NRB;0;Train
2425-85-6;Cc1ccc(N=Nc2c(O)ccc3ccccc23)c(c1)[N+]([O-])=O;NRB;0;Train
1571-13-7;Clc1c(Cl)c(Cl)c2C(=O)NC(=O)c2c1Cl;NRB;0;Train
62717-50-4;Clc1ccccc1C2CO2;NRB;0;Train
1197-18-8;NCC1CCC(CC1)C(O)=O;NRB;0;Train
302-01-2;NN;NRB;0;Train
691-37-2;CC(C)CC=C;NRB;0;Train
2162-99-4;ClCCCCCCCCCl;NRB;0;Train
13116-53-5;ClCC(Cl)(Cl)CCl;NRB;0;Train
76-13-1;FC(F)(Cl)C(F)(Cl)Cl;NRB;0;Train
79-01-6;ClC=C(Cl)Cl;NRB;0;Train
102-82-9;CCCCN(CCCC)CCCC;NRB;0;Train
111-18-2;CN(C)CCCCCCN(C)C;NRB;0;Train
3710-84-7;CCN(O)CC;NRB;0;Train
126-30-7;CC(C)(CO)CO;NRB;0;Train
77-99-6;CCC(CO)(CO)CO;NRB;0;Train
4620-70-6;CC(C)(C)NCCO;NRB;0;Train
100-37-8;CCN(CC)CCO;NRB;0;Train
115-70-8;CCC(N)(CO)CO;NRB;0;Train
102-81-8;CCCCN(CCO)CCCC;NRB;0;Train
142-96-1;CCCCOCCCC;NRB;0;Train
78-63-7;CC(C)(C)OOC(C)(C)CCC(C)(C)OOC(C)(C)C;NRB;0;Train
126-58-9;OCC(CO)(CO)COCC(CO)(CO)CO;NRB;0;Train
24800-44-0;CC(O)COC(C)COC(C)CO;NRB;0;Train
110-30-5;CCCCCCCCCCCCCCCCCC(=O)NCCNC(=O)CCCCCCCCCCCCCCCCC;NRB;0;Train
1071-93-8;NNC(=O)CCCCC(=O)NN;NRB;0;Train
526-78-3;OC(=O)C(Br)C(Br)C(O)=O;NRB;0;Train
139-13-9;OC(=O)CN(CC(O)=O)CC(O)=O;NRB;0;Train
298-06-6;CCO[P]([S-])(=S)OCC;NRB;0;Train
680-31-9;CN(C)[P](=O)(N(C)C)N(C)C;NRB;0;Train
126-72-7;BrCC(Br)CO[P](=O)(OCC(Br)CBr)OCC(Br)CBr;NRB;0;Train
107-66-4;CCCCO[P](O)(=O)OCCCC;NRB;0;Train
56-35-9;CCCC[Sn](CCCC)(CCCC)O[Sn](CCCC)(CCCC)CCCC;NRB;0;Train
56-36-0;CCCC[Sn](CCCC)(CCCC)OC(C)=O;NRB;0;Train
3590-84-9;CCCCCCCC[Sn](CCCCCCCC)(CCCCCCCC)CCCCCCCC;NRB;0;Train
102-70-5;C=CCN(CC=C)CC=C;NRB;0;Train
23235-61-2;CCC(CO)(CO)COCC(CC)(CO)CO;NRB;0;Train
80-07-9;Clc1ccc(cc1)[S](=O)(=O)c2ccc(Cl)cc2;NRB;0;Train
50-31-7;OC(=O)c1c(Cl)ccc(Cl)c1Cl;NRB;0;Train
121-69-7;CN(C)c1ccccc1;NRB;0;Train
87-59-2;Cc1cccc(N)c1C;NRB;0;Train
108-69-0;Cc1cc(C)cc(N)c1;NRB;0;Train
622-57-1;CCNc1ccc(C)cc1;NRB;0;Train
611-21-2;CNc1ccccc1C;NRB;0;Train
793-24-8;CC(C)CC(C)Nc1ccc(Nc2ccccc2)cc1;NRB;0;Train
101-72-4;CC(C)Nc1ccc(Nc2ccccc2)cc1;NRB;0;Train
09.06.2095;C1OC1CN(CC2CO2)c3ccccc3;NRB;0;Train
108-45-2;Nc1cccc(N)c1;NRB;0;Train
108-42-9;Nc1cccc(Cl)c1;NRB;0;Train
95-51-2;Nc1ccccc1Cl;NRB;0;Train
99-88-7;CC(C)c1ccc(N)cc1;NRB;0;Train
40027-50-7;Cc1ccccc1N(CC2CO2)CC3CO3;NRB;0;Train
99-08-1;Cc1cccc(c1)[N+]([O-])=O;NRB;0;Train
88-72-2;Cc1ccccc1[N+]([O-])=O;NRB;0;Train
99-99-0;Cc1ccc(cc1)[N+]([O-])=O;NRB;0;Train
576-26-1;Cc1cccc(C)c1O;NRB;0;Train
2416-94-6;Cc1ccc(C)c(O)c1C;NRB;0;Train
120-71-8;COc1ccc(C)cc1N;NRB;0;Train
3586-14-9;Cc1cccc(Oc2ccccc2)c1;NRB;0;Train
346-10-1;CCC(Oc1ccc(cc1C(C)(C)CC)C(C)(C)CC)C(=O)Nc2ccc(NC(=O)C(F)(F)C(F)(F)C(F)(F)F)c(O)c2;NRB;0;Train
80-51-3;NN[S](=O)(=O)c1ccc(Oc2ccc(cc2)[S](=O)(=O)NN)cc1;NRB;0;Train
94-74-6;Cc1cc(Cl)ccc1OCC(O)=O;NRB;0;Train
96-69-5;Cc1cc(O)c(cc1Sc2cc(c(O)cc2C)C(C)(C)C)C(C)(C)C;NRB;0;Train
120-21-8;CCN(CC)c1ccc(C=O)cc1;NRB;0;Train
1953-99-7;Clc1c(Cl)c(Cl)c(C#N)c(C#N)c1Cl;NRB;0;Train
70-55-3;Cc1ccc(cc1)[S](N)(=O)=O;NRB;0;Train
121-03-9;Cc1ccc(cc1[S](O)(=O)=O)[N+]([O-])=O;NRB;0;Train
97-39-2;Cc1ccccc1NC(N)=Nc2ccccc2C;NRB;0;Train
2655-14-3;CNC(=O)Oc1cc(C)cc(C)c1;NRB;0;Train
3194-55-6;BrC1CCC(Br)C(Br)CCC(Br)C(Br)CCC1Br;NRB;0;Train
106-87-6;C1CC2OC2CC1C3CO3;NRB;0;Train
78-59-1;CC1=CC(=O)CC(C)(C)C1;NRB;0;Train
13149-00-3;OC(=O)[C@@H]1CCCC[C@@H]1C(=O)OC(=O)[C@@H]2CCCC[C@@H]2C(O)=O;NRB;0;Train
1241-94-7;CCCCC(CC)CO[P](=O)(Oc1ccccc1)Oc2ccccc2;NRB;0;Train
1803-12-9;CN(C)C(=S)S[Sn](c1ccccc1)(c2ccccc2)c3ccccc3;NRB;0;Train
07.03.2597;CCOC(=O)C(S[P](=S)(OC)OC)c1ccccc1;NRB;0;Train
2104-64-5;CCO[P](=S)(Oc1ccc(cc1)[N+]([O-])=O)c2ccccc2;NRB;0;Train
1200-14-2;CCCCc1ccc(C=O)cc1;NRB;0;Train
87-86-5;Oc1c(Cl)c(Cl)c(Cl)c(Cl)c1Cl;NRB;0;Train
36065-30-2;CC(Br)(CBr)COc1c(Br)cc(Br)cc1Br;NRB;0;Train
1502-22-3;O=C1CCCCC1C2=CCCCC2;NRB;0;Train
901-44-0;CC(C)(c1ccc(OCCO)cc1)c2ccc(OCCO)cc2;NRB;0;Train
25640-71-5;CC(c1ccccc1)c2ccc(O)c(C(C)c3ccccc3)c2C(C)c4ccccc4;NRB;0;Train
21850-44-2;CC(C)(c1cc(Br)c(OCC(Br)CBr)c(Br)c1)c2cc(Br)c(OCC(Br)CBr)c(Br)c2;NRB;0;Train
606-28-0;COC(=O)c1ccccc1C(=O)c2ccccc2;NRB;0;Train
66-81-9;CC1CC(C)C(=O)C(C1)C(O)CC2CC(=O)NC(=O)C2;NRB;0;Train
13560-89-9;ClC1=C(Cl)C2(Cl)C3CCC4C(CCC3C1(Cl)C2(Cl)Cl)C5(Cl)C(=C(Cl)C4(Cl)C5(Cl)Cl)Cl;NRB;0;Train
13358-11-7;CCCCC(CC)CN1C(=O)C2C(C1=O)C3(CCC2(C)C=C3)C(C)C;NRB;0;Train
118-44-5;CCNc1cccc2ccccc12;NRB;0;Train
26916-60-9;CC(C)C1CCCc2ccccc12;NRB;0;Train
79-92-5;CC1(C)C2CCC(C2)C1=C;NRB;0;Train
82-44-0;Clc1cccc2C(=O)c3ccccc3C(=O)c12;NRB;0;Train
116-82-5;Nc1c(Br)cc(O)c2C(=O)c3ccccc3C(=O)c12;NRB;0;Train
129-43-1;Oc1cccc2C(=O)c3ccccc3C(=O)c12;NRB;0;Train
2498-66-0;O=C1c2ccccc2C(=O)c3c4ccccc4ccc13;NRB;0;Train
13654-09-6;Brc1c(Br)c(Br)c(c(Br)c1Br)c2c(Br)c(Br)c(Br)c(Br)c2Br;NRB;0;Train
91-94-1;Nc1ccc(cc1Cl)c2ccc(N)c(Cl)c2;NRB;0;Train
41122-70-7;CCCCCCc1ccc(cc1)c2ccc(cc2)C#N;NRB;0;Train
13540-50-6;Cc1ccc(C)c(Cc2ccccc2)c1;NRB;0;Train
3891-29-0;CCCCCCCCCCCCCCCCCCNC(=O)N1CC1;NRB;0;Train
616-44-4;Cc1cscc1;NRB;0;Train
149-30-4;S=C1Nc2ccccc2S1;NRB;0;Train
120-78-5;S(Sc1sc2ccccc2n1)c3sc4ccccc4n3;NRB;0;Train
2440-22-4;Cc1ccc(O)c(c1)n2n3n2c4ccccc34;NRB;0;Train
109-06-8;Cc1ccccn1;NRB;0;Train
108-99-6;Cc1cccnc1;NRB;0;Train
109-09-1;Clc1ccccn1;NRB;0;Train
100-54-9;N#Cc1cccnc1;NRB;0;Train
626-67-5;CN1CCCCC1;NRB;0;Train
91-22-5;c1ccc2ncccc2c1;NRB;0;Train
91-53-2;CCOc1ccc2NC(C)(C)C=C(C)c2c1;NRB;0;Train
103-34-4;C1CN(CCO1)SSN2CCOCC2;NRB;0;Train
110-85-0;C1CNCCN1;NRB;0;Train
91-76-9;Nc1nc(N)nc(n1)c2ccccc2;NRB;0;Train
1025-15-6;C=CCN1C(=O)N(CC=C)C(=O)N(CC=C)C1=O;NRB;0;Train
5468-75-7;CC(=O)C(N=Nc1ccc(cc1Cl)c2ccc(N=NC(C(C)=O)C(=O)Nc3ccccc3C)c(Cl)c2)C(=O)Nc4ccccc4C;NRB;0;Train
13676-54-5;O=C1C=CC(=O)N1c2ccc(Cc3ccc(cc3)N4C(=O)C=CC4=O)cc2;NRB;0;Train
19666-30-9;CC(C)Oc1cc(N2N=C(OC2=O)C(C)(C)C)c(Cl)cc1Cl;NRB;0;Train
2921-88-2;CCO[P](=S)(OCC)Oc1nc(Cl)c(Cl)cc1Cl;NRB;0;Train
504-03-0;CC1CCCC(C)N1;NRB;0;Train
122-34-9;CCNc1nc(Cl)nc(NCC)n1;NRB;0;Train
1912-24-9;CCNc1nc(Cl)nc(NC(C)C)n1;NRB;0;Train
584-79-2;CC(C)=CC1C(C(=O)OC2CC(=O)C(=C2C)CC=C)C1(C)C;NRB;0;Train
483-63-6;CCN(C(=O)\C=C\C)c1ccccc1C;NRB;0;Train
7696-12-0;CC(C)=CC1C(C(=O)OCN2C(=O)C3=C(CCCC3)C2=O)C1(C)C;NRB;0;Train
119-93-7;Cc1cc(ccc1N)c2ccc(N)c(C)c2;NRB;0;Train
101-20-2;Clc1ccc(NC(=O)Nc2ccc(Cl)c(Cl)c2)cc1;NRB;0;Train
64-10-8;NC(=O)Nc1ccccc1;NRB;0;Train
132-64-9;o1c2ccccc2c3ccccc13;NRB;0;Train
6842-15-5;C\C=C\C\C=C\C\C=C\CC=C;NRB;0;Train
75-09-2;ClCCl;NRB;0;Train
74-97-5;ClCBr;NRB;0;Train
109-64-8;BrCCCBr;NRB;0;Train
110-56-5;ClCCCCCl;NRB;0;Train
110-53-2;CCCCCBr;NRB;0;Train
4101-68-2;BrCCCCCCCCCCBr;NRB;0;Train
3229-00-3;BrCC(CBr)(CBr)CBr;NRB;0;Train
76-12-0;FC(Cl)(Cl)C(F)(Cl)Cl;NRB;0;Train
127-18-4;ClC(Cl)=C(Cl)Cl;NRB;0;Train
87-68-3;ClC(Cl)=C(Cl)C(Cl)=C(Cl)Cl;NRB;0;Train
3452-97-9;CC(CCO)CC(C)(C)C;NRB;0;Train
115-84-4;CCCCC(CC)(CO)CO;NRB;0;Train
77-85-0;CC(CO)(CO)CO;NRB;0;Train
115-77-5;OCC(CO)(CO)CO;NRB;0;Train
335-99-9;OCC(F)(F)C(F)(F)C(F)(F)C(F)(F)C(F)(F)C(F)F;NRB;0;Train
105-59-9;CN(CCO)CCO;NRB;0;Train
544-01-4;CCCCCCCC(=O)OC;NRB;0;Train
103-44-6;CCCCC(CC)COC=C;NRB;0;Train
2425-79-8;C(CCOCC1CO1)COCC2CO2;NRB;0;Train
112-26-5;ClCCOCCOCCCl;NRB;0;Train
10496-18-1;CCCCCCCCCCSSCCCCCCCCCC;NRB;0;Train
107-70-0;COC(C)(C)CC(C)=O;NRB;0;Train
68-12-2;CN(C)C=O;NRB;0;Train
3290-92-4;CCC(COC(=O)C(C)=C)(COC(=O)C(C)=C)COC(=O)C(C)=C;NRB;0;Train
629-54-9;CCCCCCCCCCCCCCCC(N)=O;NRB;0;Train
28777-98-2;CCCCCCCCCCCCCCCC/C=C/C1CC(=O)OC1=O;NRB;0;Train
15625-89-5;CCC(COC(=O)C=C)(COC(=O)C=C)COC(=O)C=C;NRB;0;Train
3524-68-3;OCC(COC(=O)C=C)(COC(=O)C=C)COC(=O)C=C;NRB;0;Train
585-07-9;CC(=C)C(=O)OC(C)(C)C;NRB;0;Train
108-23-6;CC(C)OC(Cl)=O;NRB;0;Train
76-03-9;OC(=O)C(Cl)(Cl)Cl;NRB;0;Train
1115-20-4;CC(C)(CO)COC(=O)C(C)(C)CO;NRB;0;Train
29598-76-3;CCCCCCCCCCCCSCCC(=O)OCC(COC(=O)CCSCCCCCCCCCCCC)(COC(=O)CCSCCCCCCCCCCCC)COC(=O)CCSCCCCCCCCCCCC;NRB;0;Train
55107-14-7;COC(=O)CC(=O)C(C)(C)C;NRB;0;Train
67-68-5;C[S](C)=O;NRB;0;Train
2372-21-6;CC(C)OC(=O)OOC(C)(C)C;NRB;0;Train
1752-30-3;CC(C)=NNC(N)=S;NRB;0;Train
556-88-7;NC(=N)N[N+]([O-])=O;NRB;0;Train
39680-90-5;CNC(S)=S;NRB;0;Train
115-96-8;ClCCO[P](=O)(OCCCl)OCCCl;NRB;0;Train
121-75-5;CCOC(=O)CC(S[P](=S)(OC)OC)C(=O)OCC;NRB;0;Train
298-07-7;CCCCC(CC)CO[P](O)(=O)OCC(CC)CCCC;NRB;0;Train
57-15-8;CC(C)(O)C(Cl)(Cl)Cl;NRB;0;Train
22984-54-9;CCC(C)=NO[Si](C)(ON=C(C)CC)ON=C(C)CC;NRB;0;Train
919-30-2;CCO[Si](CCCN)(OCC)OCC;NRB;0;Train
3296-90-0;OCC(CO)(CBr)CBr;NRB;0;Train
139-87-7;CCN(CCO)CCO;NRB;0;Train
7580-85-0;CC(C)(C)OCCO;NRB;0;Train
144-19-4;CC(C)C(O)C(C)(C)CO;NRB;0;Train
107-71-1;CC(=O)OOC(C)(C)C;NRB;0;Train
3090-36-6;CCCCCCCCCCCC(=O)O[Sn](CCCC)(CCCC)CCCC;NRB;0;Train
69709-01-9;CO[Si](CCCN=C(N(C)C)N(C)C)(OC)OC;NRB;0;Train
2049-95-8;CCC(C)(C)c1ccccc1;NRB;0;Train
118-91-2;OC(=O)c1ccccc1Cl;NRB;0;Train
15233-47-3;CCCCCCC(C)Nc1ccc(Nc2ccccc2)cc1;NRB;0;Train
95-53-4;Cc1ccccc1N;NRB;0;Train
106-49-0;Cc1ccc(N)cc1;NRB;0;Train
93-68-5;CC(=O)CC(=O)Nc1ccccc1C;NRB;0;Train
709-98-8;CCC(=O)Nc1ccc(Cl)c(Cl)c1;NRB;0;Train
97-36-9;CC(=O)CC(=O)Nc1ccc(C)cc1C;NRB;0;Train
04.09.4152;NCCNCc1ccccc1;NRB;0;Train
97-02-9;Nc1ccc(cc1[N+]([O-])=O)[N+]([O-])=O;NRB;0;Train
1582-09-8;CCCN(CCC)c1c(cc(cc1[N+]([O-])=O)C(F)(F)F)[N+]([O-])=O;NRB;0;Train
98-95-3;[O-][N+](=O)c1ccccc1;NRB;0;Train
3209-22-1;[O-][N+](=O)c1cccc(Cl)c1Cl;NRB;0;Train
89-61-2;[O-][N+](=O)c1cc(Cl)ccc1Cl;NRB;0;Train
101-84-8;O(c1ccccc1)c2ccccc2;NRB;0;Train
123-30-8;Nc1ccc(O)cc1;NRB;0;Train
62-44-2;CCOc1ccc(NC(C)=O)cc1;NRB;0;Train
100-02-7;Oc1ccc(cc1)[N+]([O-])=O;NRB;0;Train
88-89-1;Oc1c(cc(cc1[N+]([O-])=O)[N+]([O-])=O)[N+]([O-])=O;NRB;0;Train
583-78-8;Oc1cc(Cl)ccc1Cl;NRB;0;Train
4433-79-8;COc1cc(NC(=O)CC(C)=O)c(OC)cc1Cl;NRB;0;Train
58-90-2;Oc1c(Cl)cc(Cl)c(Cl)c1Cl;NRB;0;Train
3772-94-9;CCCCCCCCCCCC(=O)Oc1c(Cl)c(Cl)c(Cl)c(Cl)c1Cl;NRB;0;Train
89-98-5;Clc1ccccc1C=O;NRB;0;Train
122-57-6;CC(=O)\C=C\c1ccccc1;NRB;0;Train
119-06-2;CCCCCCCCCCCCCOC(=O)c1ccccc1C(=O)OCCCCCCCCCCCCC;NRB;0;Train
98-73-7;CC(C)(C)c1ccc(cc1)C(O)=O;NRB;0;Train
614-45-9;CC(C)(C)OOC(=O)c1ccccc1;NRB;0;Train
121-92-6;OC(=O)c1cccc(c1)[N+]([O-])=O;NRB;0;Train
2082-79-3;CCCCCCCCCCCCCCCCCCOC(=O)CCc1cc(c(O)c(c1)C(C)(C)C)C(C)(C)C;NRB;0;Train
91-15-6;N#Cc1ccccc1C#N;NRB;0;Train
43051-46-3;OCCN(CCO)c1cccc(NC(=O)c2ccccc2)c1;NRB;0;Train
294-62-2;C1CCCCCCCCCCC1;NRB;0;Train
644-97-3;ClP(Cl)c1ccccc1;NRB;0;Train
60628-17-3;CCCCCCCCCCCCCOP(Oc1ccccc1)Oc2ccccc2;NRB;0;Train
2636-26-2;CO[P](=S)(OC)Oc1ccc(cc1)C#N;NRB;0;Train
6375-47-9;COc1ccc(NC(C)=O)cc1N;NRB;0;Train
36483-60-0;Brc1cc(Br)c(Br)c(Oc2ccc(Br)c(Br)c2Br)c1;NRB;0;Train
10541-83-0;CNc1ccc(cc1)C(O)=O;NRB;0;Train
114-26-1;CNC(=O)Oc1ccccc1OC(C)C;NRB;0;Train
3792-59-4;CCO[P](=S)(Oc1ccc(Cl)cc1Cl)c2ccccc2;NRB;0;Train
28575-17-9;CCc1ccccc1c2ccccc2CC;NRB;0;Train
61788-32-7;C1CC=CC(C1)c2ccc(cc2)C3CCC=CC3;NRB;0;Train
131-57-7;COc1ccc(c(O)c1)C(=O)c2ccccc2;NRB;0;Train
81-16-3;Nc1ccc2ccccc2c1[S](O)(=O)=O;NRB;0;Train
87-02-5;Nc1ccc2c(O)cc(cc2c1)[S](O)(=O)=O;NRB;0;Train
90-51-7;Nc1ccc2cc(cc(O)c2c1)[S](O)(=O)=O;NRB;0;Train
31127-54-5;Oc1ccc(cc1)C(=O)c2ccc(O)c(O)c2O;NRB;0;Train
126-33-0;O=[S]1(=O)CCCC1;NRB;0;Train
95-33-0;C1CCC(CC1)NSc2sc3ccccc3n2;NRB;0;Train
123-33-1;O=C1NNC(=O)C=C1;NRB;0;Train
3089-11-0;COCN(COC)c1nc(nc(n1)N(COC)COC)N(COC)COC;NRB;0;Train
533-74-4;CN1CSC(=S)N(C)C1;NRB;0;Train
92-77-3;Oc1cc2ccccc2cc1C(=O)Nc3ccccc3;NRB;0;Train
5567-15-7;COc1cc(NC(=O)C(N=Nc2ccc(cc2Cl)c3ccc(N=NC(C(C)=O)C(=O)Nc4cc(OC)c(Cl)cc4OC)c(Cl)c3)C(C)=O)c(OC)cc1Cl;NRB;0;Train
110-00-9;o1cccc1;NRB;0;Train
27605-76-1;C=CCOC1=N[S](=O)(=O)c2ccccc12;NRB;0;Train
3811-49-2;CO[P]1(=S)OCc2ccccc2O1;NRB;0;Train
83-88-5;Cc1cc2N=C3C(=O)NC(=O)N=C3N(C[C@H](O)[C@H](O)[C@H](O)CO)c2cc1C;NRB;0;Train
532-03-6;COc1ccccc1OCC(O)COC(N)=O;NRB;0;Train
109-70-6;ClCCCBr;NRB;0;Train
74-96-4;CCBr;NRB;0;Train
18375-66-1;CCCCCCCCCCCCCCCCCCNC(=O)[C@H](O)[C@@H](O)[C@H](O)[C@H](O)CO;NRB;0;Train
16935-34-5;CC(C)C1NC(=O)NC1=O;NRB;0;Train
612-22-6;CCc1ccccc1[N+]([O-])=O;NRB;0;Train
2051-24-3;Clc1c(Cl)c(Cl)c(c(Cl)c1Cl)c2c(Cl)c(Cl)c(Cl)c(Cl)c2Cl;NRB;0;Train
142-82-5;CCCCCCC;RB;1;Test
75-21-8;C1CO1;RB;1;Test
108-88-3;Cc1ccccc1;RB;1;Test
111-92-2;CCCCNCCCC;RB;1;Test
78-70-6;CC(C)=CCCC(C)(O)C=C;RB;1;Test
112-34-5;CCCCOCCOCCO;RB;1;Test
123-72-8;CCCC=O;RB;1;Test
123-42-2;CC(=O)CC(C)(C)O;RB;1;Test
1119-40-0;COC(=O)CCCC(=O)OC;RB;1;Test
141-02-6;CCCCC(CC)COC(=O)\C=C\C(=O)OCC(CC)CCCC;RB;1;Test
106-14-9;CCCCCCC(O)CCCCCCCCCCC(O)=O;RB;1;Test
28623-46-3;CCCCCCCCCCCCCCCCCCC#N;RB;1;Test
98-87-3;ClC(Cl)c1ccccc1;RB;1;Test
90-05-1;COc1ccccc1O;RB;1;Test
100-51-6;OCc1ccccc1;RB;1;Test
120-14-9;COc1ccc(C=O)cc1OC;RB;1;Test
99-94-5;Cc1ccc(cc1)C(O)=O;RB;1;Test
99-04-7;Cc1cccc(c1)C(O)=O;RB;1;Test
959-26-2;OCCOC(=O)c1ccc(cc1)C(=O)OCCO;RB;1;Test
767-00-0;Oc1ccc(cc1)C#N;RB;1;Test
104-15-4;Cc1ccc(cc1)[S](O)(=O)=O;RB;1;Test
123-11-5;COc1ccc(C=O)cc1;RB;1;Test
24851-98-7;CCCCCC1C(CCC1=O)CC(=O)OC;RB;1;Test
288-32-4;[nH]1ccnc1;RB;1;Test
109-00-2;Oc1cccnc1;RB;1;Test
592-41-6;CCCCC=C;RB;1;Test
75-26-3;CC(C)Br;RB;1;Test
109-73-9;CCCCN;RB;1;Test
36653-82-4;CCCCCCCCCCCCCCCCO;RB;1;Test
109-86-4;COCCO;RB;1;Test
109-60-4;CCCOC(C)=O;RB;1;Test
112-84-5;CCCCCCCC\C=C/CCCCCCCCCCCC(N)=O;RB;1;Test
124-04-9;OC(=O)CCCCC(O)=O;RB;1;Test
3121-61-7;COCCOC(=O)C=C;RB;1;Test
923-26-2;CC(O)COC(=O)C(C)=C;RB;1;Test
110-44-1;C/C=C/C=C/C(O)=O;RB;1;Test
97-65-4;OC(=O)CC(=C)C(O)=O;RB;1;Test
591-60-6;CCCCOC(=O)CC(C)=O;RB;1;Test
62-53-3;Nc1ccccc1;RB;1;Test
2495-37-6;CC(=C)C(=O)OCc1ccccc1;RB;1;Test
60-12-8;OCCc1ccccc1;RB;1;Test
96-09-3;C1OC1c2ccccc2;RB;1;Test
495-69-2;OC(=O)CNC(=O)c1ccccc1;RB;1;Test
119-68-6;CNc1ccccc1C(O)=O;RB;1;Test
98-55-5;CC1=CCC(CC1)C(C)(C)O;RB;1;Test
93-55-0;CCC(=O)c1ccccc1;RB;1;Test
520-45-6;CC(=O)C1C(=O)OC(=CC1=O)C;RB;1;Test
87-99-0;OC[C@@H](O)[C@H](O)[C@@H](O)CO;RB;1;Test
119-53-9;OC(c1ccccc1)C(=O)c2ccccc2;RB;1;Test
107-95-9;NCCC(O)=O;RB;1;Test
111-85-3;CCCCCCCCCl;RB;1;Test
110-80-5;CCOCCO;RB;1;Test
112-80-1;CCCCCCCC\C=C/CCCCCCCC(O)=O;RB;1;Test
111-82-0;CCCCCCCCCCCC(=O)OC;RB;1;Test
110-15-6;OC(=O)CCC(O)=O;RB;1;Test
818-61-1;OCCOC(=O)C=C;RB;1;Test
77-92-9;OC(=O)CC(O)(CC(O)=O)C(O)=O;RB;1;Test
133-37-9;OC(C(O)C(O)=O)C(O)=O;RB;1;Test
78-92-2;CCC(C)O;RB;1;Test
100-21-0;OC(=O)c1ccc(cc1)C(O)=O;RB;1;Test
140-29-4;N#CCc1ccccc1;RB;1;Test
138-86-3;CC(=C)C1CCC(=CC1)C;RB;1;Test
101-43-9;CC(=C)C(=O)OC1CCCCC1;RB;1;Test
109-83-1;CNCCO;RB;1;Test
110-97-4;CC(O)CNCC(C)O;RB;1;Test
112-35-6;COCCOCCOCCO;RB;1;Test
79-11-8;OC(=O)CCl;RB;1;Test
117-84-0;CCCCCCCCOC(=O)c1ccccc1C(=O)OCCCCCCCC;RB;1;Test
84-61-7;O=C(OC1CCCCC1)c2ccccc2C(=O)OC3CCCCC3;RB;1;Test
135-19-3;Oc1ccc2ccccc2c1;RB;1;Test
110-86-1;c1ccncc1;RB;1;Test
1338-39-2;CCCCCCCCCCCC(=O)OCC(O)C1OCC(O)C1O;RB;1;Test
306-98-9;FC(F)(F)C1(F)C(F)(F)C(F)(F)C(F)(F)C(F)(F)C1(F)C(F)(F)F;NRB;0;Test
60-57-1;ClC1=C(Cl)[C@@]2(Cl)[C@H]3[C@H]4C[C@H]([C@@H]5O[C@H]45)[C@H]3[C@]1(Cl)C2(Cl)Cl;NRB;0;Test
50-29-3;Clc1ccc(cc1)C(c2ccc(Cl)cc2)C(Cl)(Cl)Cl;NRB;0;Test
3846-71-7;CC(C)(C)c1cc(n2nc3ccccc3n2)c(O)c(c1)C(C)(C)C;NRB;0;Test
3864-99-1;CC(C)(C)c1cc(n2nc3ccc(Cl)cc3n2)c(O)c(c1)C(C)(C)C;NRB;0;Test
76-44-8;ClC1C=CC2C1C3(Cl)C(=C(Cl)C2(Cl)C3(Cl)Cl)Cl;NRB;0;Test
608-73-1;ClC1C(Cl)C(Cl)C(Cl)C(Cl)C1Cl;NRB;0;Test
76-06-2;[O-][N+](=O)C(Cl)(Cl)Cl;NRB;0;Test
3033-62-3;CN(C)CCOCCN(C)C;NRB;0;Test
96-31-1;CNC(=O)NC;NRB;0;Test
10222-01-2;NC(=O)C(Br)(Br)C#N;NRB;0;Test
121-87-9;Nc1ccc(cc1Cl)[N+]([O-])=O;NRB;0;Test
97-52-9;COc1cc(ccc1N)[N+]([O-])=O;NRB;0;Test
2100-42-7;COc1ccc(OC)c(Cl)c1;NRB;0;Test
3120-74-9;CSc1ccc(O)cc1C;NRB;0;Test
17420-30-3;Nc1ccc(cc1C#N)[N+]([O-])=O;NRB;0;Test
367-11-3;Fc1ccccc1F;NRB;0;Test
28768-32-3;C1OC1CN(CC2CO2)c3ccc(Cc4ccc(cc4)N(CC5CO5)CC6CO6)cc3;NRB;0;Test
2451-62-9;O=C1N(CC2CO2)C(=O)N(CC3CO3)C(=O)N1CC4CO4;NRB;0;Test
298-81-7;COc1c2occc2cc3C=CC(=O)Oc13;NRB;0;Test
5333-84-6;CC1=CCC2C(C1)C(=O)OC2=O;NRB;0;Test
307-70-0;OCC(F)(F)C(F)(F)C(F)(F)C(F)(F)C(F)(F)C(F)(F)C(F)(F)C(F)(F)C(F)(F)C(F)F;NRB;0;Test
14802-03-0;CCCCC(CC)CO[P](O)(=O)CC(CC)CCCC;NRB;0;Test
818-08-6;CCCC[Sn](=O)CCCC;NRB;0;Test
108-67-8;Cc1cc(C)cc(C)c1;NRB;0;Test
622-24-2;ClCCc1ccccc1;NRB;0;Test
95-49-8;Cc1ccccc1Cl;NRB;0;Test
106-43-4;Cc1ccc(Cl)cc1;NRB;0;Test
1712-70-5;CC(=C)c1ccc(Cl)cc1;NRB;0;Test
91-66-7;CCN(CC)c1ccccc1;NRB;0;Test
95-76-1;Nc1ccc(Cl)c(Cl)c1;NRB;0;Test
634-93-5;Nc1c(Cl)cc(Cl)cc1Cl;NRB;0;Test
86-30-6;O=NN(c1ccccc1)c2ccccc2;NRB;0;Test
1323-65-5;CCCCCCCCCc1cccc(O)c1CCCCCCCCC;NRB;0;Test
51-28-5;Oc1ccc(cc1[N+]([O-])=O)[N+]([O-])=O;NRB;0;Test
1570-64-5;Cc1cc(Cl)ccc1O;NRB;0;Test
95-95-4;Oc1cc(Cl)c(Cl)cc1Cl;NRB;0;Test
1940-42-7;Oc1cc(Cl)c(Br)cc1Cl;NRB;0;Test
30171-80-3;BrC(Br)c1ccccc1OCC2CO2;NRB;0;Test
120-52-5;O=C(O\N=C1\C=C\C(C=C1)=N/OC(=O)c2ccccc2)c3ccccc3;NRB;0;Test
80-43-3;CC(C)(OOC(C)(C)c1ccccc1)c2ccccc2;NRB;0;Test
100-40-3;C=CC1CCC=CC1;NRB;0;Test
1490-04-6;CC(C)C1CCC(C)CC1O;NRB;0;Test
25155-23-1;Cc1cc(C)cc(O[P](=O)(Oc2cc(C)cc(C)c2)Oc3cc(C)cc(C)c3)c1;NRB;0;Test
6165-51-1;CC(c1ccccc1)c2cc(C)ccc2C;NRB;0;Test
599-64-4;CC(C)(c1ccccc1)c2ccc(O)cc2;NRB;0;Test
90-13-1;Clc1cccc2ccccc12;NRB;0;Test
2216-69-5;COc1cccc2ccccc12;NRB;0;Test
84-47-9;CC(C)(C)c1ccc2C(=O)c3ccccc3C(=O)c2c1;NRB;0;Test
131-09-9;Clc1ccc2C(=O)c3ccccc3C(=O)c2c1;NRB;0;Test
91-60-1;Sc1ccc2ccccc2c1;NRB;0;Test
86-74-8;[nH]1c2ccccc2c3ccccc13;NRB;0;Test
32669-06-0;ClCCOC(c1ccccc1)c2ccccc2;NRB;0;Test
3380-34-5;Oc1cc(Cl)ccc1Oc2ccc(Cl)cc2Cl;NRB;0;Test
108-60-1;CC(CCl)OC(C)CCl;NRB;0;Test
100-01-6;Nc1ccc(cc1)[N](=O)=O;NRB;0;Test
134-62-3;CCN(CC)C(=O)c1cccc(C)c1;NRB;0;Test
82-05-3;O=C1c2ccccc2c3cccc4cccc1c34;NRB;0;Test
947-04-6;O=C1CCCCCCCCCCCN1;NRB;0;Test
95-16-9;s1cnc2ccccc12;NRB;0;Test
78-87-5;CC(Cl)CCl;NRB;0;Test
678-39-7;OCCC(F)(F)C(F)(F)C(F)(F)C(F)(F)C(F)(F)C(F)(F)C(F)(F)C(F)(F)F;NRB;0;Test
1085-98-9;CN(C)[S](=O)(=O)N(SC(F)(Cl)Cl)c1ccccc1;NRB;0;Test
208-96-8;c1cc2cccc3C=Cc(c1)c23;NRB;0;Test
76-83-5;ClC(c1ccccc1)(c2ccccc2)c3ccccc3;NRB;0;Test
102-71-6;OCCN(CCO)CCO;NRB;0;Test
51-79-6;CCOC(N)=O;NRB;0;Test
60-51-5;CNC(=O)CS[P](=S)(OC)OC;NRB;0;Test
26603-23-6;CCCCCCCCc1ccccc1Nc2ccccc2CCCCCCCC;NRB;0;Test
101-67-7;CCCCCCCCc1ccc(Nc2ccc(CCCCCCCC)cc2)cc1;NRB;0;Test
88-19-7;Cc1ccccc1[S](N)(=O)=O;NRB;0;Test
26967-76-0;CC(C)c1ccc(O[P](=O)(Oc2ccc(cc2)C(C)C)Oc3ccc(cc3)C(C)C)cc1;NRB;0;Test
98-10-2;N[S](=O)(=O)c1ccccc1;NRB;0;Test
25134-21-8;CC1=CC2CC1C3C2C(=O)OC3=O;NRB;0;Test
84-57-1;CC1=NN(C(=O)C1)c2cc(Cl)c(cc2Cl)[S](O)(=O)=O;NRB;0;Test
96-45-7;S=C1NCCN1;NRB;0;Test
100-26-5;OC(=O)c1ccc(nc1)C(O)=O;NRB;0;Test
110-91-8;C1COCCN1;NRB;0;Test
839-90-7;OCCN1C(=O)N(CCO)C(=O)N(CCO)C1=O;NRB;0;Test
5124-25-4;[O-][N+](=O)c1cc(ccc1Nc2ccccc2)[S](=O)(=O)Nc3ccccc3;NRB;0;Test
2814-20-2;CC(C)C1=NC(=O)C=C(C)N1;NRB;0;Test
542-75-6;ClCC=CCl;NRB;0;Test
5332-73-0;COCCCN;NRB;0;Test
07.03.2680;CN(C)C(=O)C=C;NRB;0;Test
111-94-4;N#CCCNCCC#N;NRB;0;Test
137-26-8;CN(C)C(=S)SSC(=S)N(C)C;NRB;0;Test
13674-87-8;ClCC(CCl)O[P](=O)(OC(CCl)CCl)OC(CCl)CCl;NRB;0;Test
598-09-4;CC1(CCl)CO1;NRB;0;Test
102-60-3;CC(O)CN(CCN(CC(C)O)CC(C)O)CC(C)O;NRB;0;Test
100-61-8;CNc1ccccc1;NRB;0;Test
579-10-2;CN(C(C)=O)c1ccccc1;NRB;0;Test
74-31-7;N(c1ccccc1)c2ccc(Nc3ccccc3)cc2;NRB;0;Test
103-83-3;CN(C)Cc1ccccc1;NRB;0;Test
81-15-2;Cc1c(c(C)c(c(c1[N+]([O-])=O)C(C)(C)C)[N+]([O-])=O)[N+]([O-])=O;NRB;0;Test
88-60-8;Cc1ccc(c(O)c1)C(C)(C)C;NRB;0;Test
1836-75-5;[O-][N+](=O)c1ccc(Oc2ccc(Cl)cc2Cl)cc1;NRB;0;Test
555-03-3;COc1cccc(c1)[N+]([O-])=O;NRB;0;Test
96-96-8;COc1ccc(N)c(c1)[N+]([O-])=O;NRB;0;Test
106-48-9;Oc1ccc(Cl)cc1;NRB;0;Test
25155-25-3;CC(C)(C)OOC(C)(C)c1ccc(cc1)C(C)(C)OOC(C)(C)C;NRB;0;Test
5405-84-5;CC1(C)C2CCC(C)(OO)C1C2;NRB;0;Test
873-94-9;CC1CC(=O)CC(C)(C)C1;NRB;0;Test
26140-60-3;c1ccc(cc1)c2ccc(cc2)c3ccccc3;NRB;0;Test
90-12-0;Cc1cccc2ccccc12;NRB;0;Test
620-92-8;Oc1ccc(Cc2ccc(O)cc2)cc1;NRB;0;Test
5809-23-4;CCN(CC)c1ccc(c(O)c1)C(=O)c2ccccc2C(O)=O;NRB;0;Test
2173-57-1;CC(C)COc1ccc2ccccc2c1;NRB;0;Test
117-62-4;Nc1ccc2c(cccc2[S](O)(=O)=O)c1[S](O)(=O)=O;NRB;0;Test
91-17-8;C1CCC2CCCCC2C1;NRB;0;Test
26896-48-0;OCC1CC23CCC1(CC2)CC3CO;NRB;0;Test
120-12-7;c1ccc2cc3ccccc3cc2c1;NRB;0;Test
117-79-3;Nc1ccc2C(=O)c3ccccc3C(=O)c2c1;NRB;0;Test
14233-37-5;CC(C)Nc1ccc(NC(C)C)c2C(=O)c3ccccc3C(=O)c12;NRB;0;Test
95-14-7;[nH]1nc2ccccc2n1;NRB;0;Test
57-41-0;O=C1NC(=O)C(N1)(c2ccccc2)c3ccccc3;NRB;0;Test
62-55-5;CC(N)=S;NRB;0;Test
79-27-6;BrC(Br)C(Br)Br;NRB;0;Test
306-83-2;FC(F)(F)C(Cl)Cl;NRB;0;Test
760-23-6;ClCC(Cl)C=C;NRB;0;Test
311-89-7;FC(F)(F)C(F)(F)C(F)(F)C(F)(F)N(C(F)(F)C(F)(F)C(F)(F)C(F)(F)F)C(F)(F)C(F)(F)C(F)(F)C(F)(F)F;NRB;0;Test
111-44-4;ClCCOCCCl;NRB;0;Test
109-59-1;CC(C)OCCO;NRB;0;Test
5435-64-3;CC(CC=O)CC(C)(C)C;NRB;0;Test
75-87-6;ClC(Cl)(Cl)C=O;NRB;0;Test
3061-75-4;CCCCCCCCCCCCCCCCCCCCCC(N)=O;NRB;0;Test
868-85-9;CO[PH](=O)OC;NRB;0;Test
2528-38-3;CCCCCO[P](=O)(OCCCCC)OCCCCC;NRB;0;Test
335-67-1;OC(=O)C(F)(F)C(F)(F)C(F)(F)C(F)(F)C(F)(F)C(F)(F)C(F)(F)F;NRB;0;Test
95-63-6;Cc1ccc(C)c(C)c1;NRB;0;Test
87-83-2;Cc1c(Br)c(Br)c(Br)c(Br)c1Br;NRB;0;Test
106-50-3;Nc1ccc(N)cc1;NRB;0;Test
122-80-5;CC(=O)Nc1ccc(N)cc1;NRB;0;Test
2219-82-1;Cc1cccc(c1O)C(C)(C)C;NRB;0;Test
527-60-6;Cc1cc(C)c(O)c(C)c1;NRB;0;Test
1879-09-0;Cc1cc(C)c(O)c(c1)C(C)(C)C;NRB;0;Test
615-74-7;Cc1ccc(Cl)c(O)c1;NRB;0;Test
1073-72-9;CSc1ccc(O)cc1;NRB;0;Test
80-54-6;CC(Cc1ccc(cc1)C(C)(C)C)C=O;NRB;0;Test
534-52-1;Cc1cc(cc(c1O)[N+]([O-])=O)[N+]([O-])=O;NRB;0;Test
14816-18-3;CCO[P](=S)(OCC)O\N=C(/C#N)c1ccccc1;NRB;0;Test
840-65-3;COC(=O)c1ccc2cc(ccc2c1)C(=O)OC;NRB;0;Test
826-36-8;CC1(C)CC(=O)CC(C)(C)N1;NRB;0;Test
40220-08-4;C=CC(=O)OCCN1C(=O)N(CCOC(=O)C=C)C(=O)N(CCOC(=O)C=C)C1=O;NRB;0;Test
40690-89-9;O=C(OCCN(CCC#N)c1ccc(cc1)N=Nc2ccc(cc2)[N](=O)=O)c3ccccc3;NRB;0;Test
12239-87-1;Clc1cccc2C3=NC4=NC(=Nc5n6[Cu]N3C(=NC7=NC(=Nc6c8ccccc58)c9ccccc79)c12)c%10ccccc4%10;NRB;0;Test
25512-42-9;Clc1ccccc1c2ccccc2Cl;NRB;0;Test
