series,200,205,210,215,220,225,230,235,240,245,250,255,260,265,270,275,280,285,290,295,300,305,310,315,320,325,330,335,340,345,350,355,360,365,370,375,380,385,390,395,400
1,-0.9084744229067804,-0.9059412821280417,-0.9048101094970559,-0.902271018939534,-0.9015140426019386,-0.901592704219497,-0.9019427731594176,-0.8998811521252796,-0.9004134434925933,-0.9001698525624069,-0.9013630697338574,-0.9015564656089011,-0.9025652580168455,-0.9046760199722819,-0.9045611800117401,-0.9070187630298818,-0.9090884341888905,-0.9097577627317013,-0.9102353882473799,-0.9113923478496689,-0.9124390111564195,-0.9132188419640129,-0.9123096221906507,-0.913696017584691,-0.9140880587878664,-0.914379679144385,-0.9126843236562131,-0.911725352112676,-0.9106581300435578,-0.9081488634675382,-0.906421720704828,-0.9041691070595791,-0.9026252214527299,-0.8981197229181856,-0.8958209058616615,-0.8925445000117048,-0.8906757567789686,-0.8922707915327932,-0.8858797507334292,-0.8850491557475422,-0.880323074954513
2,-0.8986015040617711,-0.8956881067442158,-0.8946758673437825,-0.8915936564267495,-0.8913122338969891,-0.8914596757430887,-0.8918319543864944,-0.8896951901565996,-0.8902331765895414,-0.8898325142355938,-0.8912064631712318,-0.8913560938132379,-0.8931882492495079,-0.8951771622399838,-0.8959808660247043,-0.8989576094510077,-0.9012152758872276,-0.9026482349378109,-0.9025356342048856,-0.9046034938642681,-0.9058319733882042,-0.9068420258862382,-0.9064604639560988,-0.9079519006982156,-0.9087897701146059,-0.908879679144385,-0.9073562035420673,-0.9073833626760563,-0.9057836159811398,-0.9028710444213341,-0.9011260484890268,-0.8993281002934752,-0.8972386125711943,-0.8935335125391004,-0.8910679992764806,-0.887629692876918,-0.8879119350171737,-0.8872066886822384,-0.8808798500692039,-0.8810854059457297,-0.8774612150888986
3,-0.9032614815410601,-0.9007719283239961,-0.8992705820159381,-0.896799871847005,-0.8958180857766549,-0.8958636458116815,-0.8960048815374219,-0.8937779642058166,-0.8945476706579777,-0.8937655756191961,-0.8952050735349214,-0.8949368564745265,-0.8960643070622462,-0.8982337567001436,-0.8980915982864351,-0.9006138522121844,-0.9023151223443064,-0.9033463546345395,-0.9032665922538202,-0.9047933286627946,-0.9056274599007483,-0.9062503625388159,-0.9057049175586813,-0.9068754848719938,-0.9079696922657873,-0.9080588235294118,-0.9062605411341214,-0.9065382922535211,-0.904021524562303,-0.9017660823057495,-0.8997252468722753,-0.897523910616455,-0.8954874888358542,-0.891437552139609,-0.8901777112413617,-0.8861413281191283,-0.8864946509908608,-0.8863151920851189,-0.8799516124403709,-0.8797025560148722,-0.8755356234454046
4,-0.904141196814928,-0.9014722234101697,-0.9003784875121617,-0.8974591204268481,-0.8965436042996519,-0.896422261484099,-0.8966347573337883,-0.8944630872483221,-0.8950809227338518,-0.8946148384312306,-0.8954366795866513,-0.8954719129641443,-0.8963028740697544,-0.8985438459932034,-0.897773115016174,-0.9008570766736159,-0.9023151223443064,-0.9029972947861752,-0.9028122129261041,-0.904314221790323,-0.9047008885902342,-0.9055388196896281,-0.9049349109431316,-0.9061029221618826,-0.9069943853955851,-0.9067566844919787,-0.9049654435463022,-0.904606073943662,-0.9029194605134084,-0.9005738374684297,-0.8985018688619881,-0.8963933478945625,-0.8951302361674403,-0.8910294278373977,-0.8893862015617243,-0.8853823606598581,-0.8853072924097484,-0.885339908213834,-0.8796392566152107,-0.8793728560313572,-0.8752682668530881
5,-0.8885023727177672,-0.8853226703160416,-0.8845584968478121,-0.881218192796323,-0.8807094807451202,-0.880703076283517,-0.8811634330855385,-0.8788310961968681,-0.8797689702694654,-0.8793489913263814,-0.8810498566086062,-0.8812997756878562,-0.8832081961020801,-0.8860706623887001,-0.8863014725167672,-0.8900741255501505,-0.8924546177216844,-0.8937985411351631,-0.8950186196746249,-0.8973581323871725,-0.8986364376254732,-0.9001249067066781,-0.8997798431789343,-0.901170157745022,-0.9024868860765426,-0.9031310160427808,-0.9013312913797221,-0.9022799295774648,-0.9000492497487051,-0.8977640766602288,-0.8955819832241756,-0.8938841267423621,-0.8918944640477898,-0.8876482217539937,-0.8867025090985128,-0.8826458887003791,-0.8829974260141186,-0.8831927196678896,-0.8774042016825273,-0.8768381561580922,-0.8733645214681102
6,-0.8897892704898255,-0.8876213488431767,-0.8860094593758612,-0.8828324276366862,-0.8820777832227024,-0.8822490126792767,-0.8823838174409984,-0.8800195749440716,-0.8811471152447765,-0.8805323903267573,-0.8827119706269031,-0.882369888667092,-0.8841823447160722,-0.8871401540321101,-0.8874754892777299,-0.8904679175353255,-0.89326044581895,-0.8946301248915605,-0.8946975908017819,-0.8973581323871725,-0.8990496383450268,-0.9000011601242106,-0.899581015179614,-0.9013867339022498,-0.902949644291233,-0.902879679144385,-0.9013312913797221,-0.9012345950704226,-0.8998130931667992,-0.897695364730352,-0.8961936722293191,-0.8941416438067931,-0.8924625543565792,-0.8881905428606608,-0.8858596859874565,-0.883176919503862,-0.8831365603860861,-0.8836284134935495,-0.8778092708974877,-0.8774387561280622,-0.8735486542184605
7,-0.8903623421539452,-0.8878512166958902,-0.8864537463515041,-0.8830480696955134,-0.882701474584577,-0.8829570255664103,-0.8829874484125162,-0.8804110738255033,-0.8814379800134352,-0.8810196722680886,-0.8825144242886629,-0.8829461033482189,-0.8842817476358672,-0.8869439750916029,-0.8863014725167672,-0.8907632615242066,-0.8930589887946336,-0.8944247955689932,-0.8949099637484319,-0.8971366584555583,-0.8981063720559449,-0.8996917936680421,-0.8989773010725867,-0.900077579519007,-0.9017839622061266,-0.9022860962566845,-0.9003808965719309,-0.9012345950704226,-0.898793784843188,-0.8964009805378101,-0.8946492419787633,-0.8928477775806272,-0.8914156869061041,-0.8876482217539937,-0.8846345778123288,-0.8825115908869693,-0.8826495900841999,-0.8831927196678896,-0.8769141451935833,-0.8767520561623972,-0.87281004262101
8,-0.8965052682377543,-0.8938063978103751,-0.8922688442352359,-0.889270883393097,-0.8889574807960339,-0.888887445437539,-0.8890368805401185,-0.8865282438478748,-0.8874214838258413,-0.8866651816169407,-0.8879639784470134,-0.8880565787939277,-0.8894440726038926,-0.8912156133123232,-0.8913160228308792,-0.893826731526523,-0.8958902767039453,-0.8969554794696344,-0.8967966257396012,-0.8987864132522769,-0.8994544915752964,-0.9004922793733783,-0.8999786711782547,-0.901170157745022,-0.9020973490983537,-0.9023716577540107,-0.9002848722260659,-0.9014458626760563,-0.8993347247060154,-0.8964009805378101,-0.8952727592243378,-0.893541817473789,-0.8912224190690933,-0.8874296331446738,-0.8851284695897362,-0.8827789544237576,-0.8829278588281348,-0.882458743146201,-0.8770774973565647,-0.8770103561494822,-0.87281004262101
9,-0.8826610632992842,-0.8797791130308343,-0.8782316253592257,-0.8754821140315207,-0.8745298449045052,-0.8747726564123883,-0.8752255414635427,-0.8731613534675615,-0.8741317340387958,-0.873480724518635,-0.8752188336591713,-0.8756473840539447,-0.8775356028124399,-0.8807358608774895,-0.8802627799218155,-0.885394950196896,-0.8880171184022825,-0.8896560220523693,-0.8903414759425902,-0.8931908065719,-0.8942247895389265,-0.8959600607905086,-0.8957815928653283,-0.8973525989138867,-0.8987906780579386,-0.8989385026737968,-0.897204706670245,-0.8972755281690141,-0.8963090946523654,-0.8934203684445104,-0.8925691614115484,-0.8904374806665923,-0.8884522467386052,-0.8846281019176309,-0.8826179599575638,-0.8819362048423602,-0.8800119325410535,-0.8798937353930852,-0.8744053650148231,-0.8748221562588921,-0.871116437436997
10,-0.8999487251668945,-0.8967465680195014,-0.8957050384392592,-0.8928567027713085,-0.8921904931616698,-0.8921482020369985,-0.8923371672648299,-0.8899468680089485,-0.8907318019072419,-0.8896654461414232,-0.890961233234106,-0.8911914610472016,-0.8920219216572455,-0.8940823571848955,-0.8936140981927636,-0.8956509149872597,-0.8977578377672027,-0.898223388036487,-0.8982190305915821,-0.8995367126940722,-0.8995671826806292,-0.9008596520400785,-0.8998449141605301,-0.9009535815877942,-0.9018630411415484,-0.9018582887700535,-0.9001863857174865,-0.9003807218309859,-0.8987332318734685,-0.8968132521170703,-0.8951173023501025,-0.8928477775806272,-0.891510856674329,-0.8877575160586537,-0.8853734912247618,-0.8830438537804834,-0.8829974260141186,-0.883484299381985,-0.8778092708974877,-0.8771825561408721,-0.8740053450512503
11,-0.8936851524169549,-0.8903744173117222,-0.8893331758645319,-0.8864428918216208,-0.8853235239834786,-0.8858085637081687,-0.8856184921035883,-0.8836479306487696,-0.8845543882490633,-0.8833098973923454,-0.8849803475453164,-0.8851000487038599,-0.8862698060317692,-0.8883741828514292,-0.8881499244382829,-0.8917419504285383,-0.8934564580588255,-0.8946301248915605,-0.8943716230232029,-0.89600668941671,-0.8967248625794577,-0.8974063489730967,-0.8969854060248499,-0.8984290147401086,-0.8992036458318079,-0.8994812834224599,-0.8977143743521434,-0.8977310739436619,-0.8958630211087653,-0.8940722032387461,-0.8923241478597643,-0.8903448373324373,-0.8892575293928169,-0.8851994759407266,-0.8836352487354446,-0.8817329099871986,-0.8804482013345108,-0.8809639781750909,-0.8752530302929964,-0.8757944562102772,-0.8714025193937559
12,-0.8987975548942331,-0.8952016422187059,-0.8945858851715004,-0.8913225635527954,-0.8909558388330607,-0.8907646539181043,-0.8911430277342186,-0.8886045861297539,-0.8895683428326073,-0.8881409497821153,-0.8900348090271865,-0.8895176945924996,-0.8905772658895568,-0.8922787766028136,-0.8921215981615397,-0.894932823720176,-0.8965490956213044,-0.8966577519519119,-0.8966929087191442,-0.8980225541820154,-0.8981648044809323,-0.8988797067205996,-0.8978891696581243,-0.8991110680113783,-0.8999446447452047,-0.8997513368983957,-0.8980172203660252,-0.898518926056338,-0.8965008457231437,-0.8942170554152429,-0.8931369169522342,-0.8907106999910497,-0.8894581179812296,-0.885990822045353,-0.8846345778123288,-0.8823403303726209,-0.8817369629324809,-0.8818655292451102,-0.8762552178875034,-0.8762312561884372,-0.872156735461575
13,-0.8932528351966541,-0.8898344951460463,-0.8890182382615445,-0.8858390940569049,-0.884833480770577,-0.8853278944086469,-0.8853297990302538,-0.883368288590604,-0.884000360118285,-0.8833098973923454,-0.8843264010463144,-0.8843592012566968,-0.8856137467611215,-0.8877097057948727,-0.8874754892777299,-0.8903694695390317,-0.8923511668173058,-0.8931620202352047,-0.8933937196874661,-0.8946145675608488,-0.8953642218261803,-0.8964898508466973,-0.8954960035572137,-0.8971166278769072,-0.8974375496073878,-0.8975534759358289,-0.8958554415027071,-0.8955325704225352,-0.8947609570598707,-0.8921631258356857,-0.8907442328879156,-0.8886741168656405,-0.8872208963528017,-0.8832321784568474,-0.8827462435361112,-0.8806388140394195,-0.8788340067987186,-0.8791184238161417,-0.8735466624283402,-0.8731978063401097,-0.8704464855091687
14,-0.8868284002252071,-0.8838953513236112,-0.8824832829995557,-0.8795546683425135,-0.8789720548084695,-0.8790012471419664,-0.879175387603257,-0.8768945749440716,-0.8775320816914479,-0.8772119119551144,-0.8789245304868496,-0.8791046721407061,-0.8801797204789895,-0.8829507843993444,-0.8823110644834951,-0.8859335186472087,-0.8889971796016596,-0.8895430909249573,-0.8898722798976658,-0.8916766480598431,-0.8928015426160196,-0.8936359452885422,-0.893287205237491,-0.8947213602275665,-0.8957827496624501,-0.8960320855614973,-0.8946883763760412,-0.8950572183098592,-0.8928252804611714,-0.890800029713267,-0.8890308277740603,-0.8876283463478899,-0.885106663347926,-0.8818030516630028,-0.8811901637283313,-0.8791713948121617,-0.8774049317239339,-0.8781744205272118,-0.8729385067404842,-0.8736535063173246,-0.8694758874522374
15,-0.8885023727177672,-0.8853226703160416,-0.8844460191324593,-0.881218192796323,-0.8804930980277351,-0.8810148617750987,-0.880750077094173,-0.878222874720358,-0.8792703449517649,-0.8773163295139711,-0.8804504056511877,-0.8801130478326782,-0.881611122524039,-0.8838747239256038,-0.8844967339852873,-0.8875202687051192,-0.8895362132613169,-0.8912165249038803,-0.8910329227456365,-0.8924133878731723,-0.8931938746123634,-0.8945369750921331,-0.8937354719995951,-0.8952094647013189,-0.8960463461138561,-0.8960320855614973,-0.8943633708977291,-0.8949383802816901,-0.8930291421258937,-0.890800029713267,-0.8890308277740603,-0.8877241301340502,-0.8855356593800787,-0.88228311652018,-0.8802626734554336,-0.8794535434293255,-0.8779355289051658,-0.8788056179925909,-0.8724120271341187,-0.8734708063264597,-0.8691814831112817
16,-0.8875522802219898,-0.8841359107043578,-0.8828375878029165,-0.8798873732332754,-0.8795193757995023,-0.8795403762211599,-0.8796018660070467,-0.8767897091722595,-0.8784600788105016,-0.8773163295139711,-0.8790267096273187,-0.8793036033996666,-0.8800803175591945,-0.882741948752998,-0.8823110644834951,-0.8859335186472087,-0.8879027779290218,-0.8893120954370691,-0.8891660163774114,-0.8911794616827499,-0.891737237732321,-0.8930056111340987,-0.8926834911304637,-0.893728988880269,-0.895158904727456,-0.8948609625668449,-0.8938216951005424,-0.8931095950704225,-0.8922116770346807,-0.8896374981429208,-0.888331271840001,-0.886854224928594,-0.8855356593800787,-0.8813188363891928,-0.8810580316424275,-0.8784604788641116,-0.8771761853835804,-0.8780939847440131,-0.8721471317346896,-0.8721835063908246,-0.8691814831112817
17,-0.8745023325022119,-0.8709211820553393,-0.8710274276908887,-0.867423262233066,-0.8671473757231319,-0.8670559654957389,-0.8670109112859308,-0.864716163310962,-0.8661121768457793,-0.8659139320868198,-0.8681820968522013,-0.8687190884832521,-0.87104790558048,-0.8741670305469595,-0.8745175915171044,-0.8789900393791985,-0.8816194966841263,-0.8838092695922672,-0.8845876507600976,-0.8868900992112816,-0.8887780527811747,-0.8903257242075385,-0.8900336561577031,-0.8918638479441428,-0.8931526428473103,-0.8933609625668449,-0.8917042351660852,-0.8915360915492958,-0.890677668468454,-0.8883709701381667,-0.8865401382890281,-0.884571116320772,-0.8833584679131466,-0.8795922630700078,-0.8772531407027118,-0.8764965273542469,-0.8752365579099659,-0.8757468239037273,-0.8703546728652191,-0.8710589564470522,-0.8680922910795484
18,-0.8847170835679241,-0.8816822050207416,-0.880458684123208,-0.8773736029475189,-0.8766173017075142,-0.8768122531698191,-0.8770167507594596,-0.8748951342281879,-0.8756414606951668,-0.8745666671307447,-0.8768332640785825,-0.8772456938242134,-0.8781850352217679,-0.8811661888760213,-0.8814617757627986,-0.8849606208014825,-0.8866777014298004,-0.8881622512306926,-0.8884498750456848,-0.8901670094239418,-0.8911320447592376,-0.8922940682849111,-0.8916857360793288,-0.8933119989656064,-0.8944384077602795,-0.8944652406417112,-0.8922680704277023,-0.8935409330985915,-0.8916586265779095,-0.8893236517605111,-0.8876215774141438,-0.8863658846417765,-0.8839104525688517,-0.8804624670906548,-0.8786398861868091,-0.878244863108637,-0.8767929763082463,-0.8774560842967007,-0.8719705348017368,-0.8719976564001172,-0.8687872101599666
19,-0.892709925199067,-0.8898344951460463,-0.8883883630555696,-0.8854324547459737,-0.8847316536094546,-0.884450997713573,-0.8847524128835845,-0.8817673378076063,-0.8828784531534589,-0.8826485861862531,-0.8834749082090722,-0.8833233867703854,-0.8841823447160722,-0.8861655876824939,-0.8860079683265265,-0.8892691684039843,-0.8908048480360663,-0.8919813766304432,-0.8913786461471597,-0.8926574611855635,-0.8933858668658934,-0.8939839825517318,-0.8926075749852687,-0.8943076027928627,-0.8948894505771298,-0.8950588235294118,-0.8932726328152122,-0.8931095950704225,-0.8917272532769249,-0.8894815034913088,-0.8881538482335368,-0.8863658846417765,-0.885106663347926,-0.8813188363891928,-0.8807950503064054,-0.878244863108637,-0.877024080858294,-0.8776962744826415,-0.8716151334741694,-0.8730140563492972,-0.8692803114236166
20,-0.8797303547011984,-0.8765983834409614,-0.8755265363049946,-0.8725308984264291,-0.8716277708125171,-0.8720575244231968,-0.8723254883177723,-0.8693092841163311,-0.8708837441221078,-0.8703273142411628,-0.8722011430439847,-0.8725605196907648,-0.8739769782837754,-0.8767426701852309,-0.8771154158392347,-0.8808952976604123,-0.8834380546874149,-0.88542110477442,-0.8858618884399972,-0.8877624353092726,-0.8890618674168277,-0.8904765403549206,-0.8895528539048011,-0.8914306956296871,-0.8927777501164218,-0.8927486631016043,-0.8910172917687438,-0.8908296654929577,-0.8895332173407557,-0.8872381518347943,-0.8859909699833053,-0.8843669869404304,-0.8822383929486523,-0.8785823283560614,-0.8781883279903223,-0.8763486765504929,-0.8751575578852047,-0.8750005585818278,-0.8691615398369569,-0.8708699564565022,-0.8670863228897815
21,-0.8840836885707392,-0.8811797032031818,-0.8798456805745362,-0.8766712259559104,-0.87558630170115,-0.8759093743504469,-0.8761244267146072,-0.8740282438478747,-0.8747827170924604,-0.8733693457891879,-0.8758727801581733,-0.8760795450647898,-0.8775356028124399,-0.8800903688796917,-0.8800442129716363,-0.8834144081538106,-0.8854254010083741,-0.8871048052194713,-0.8869830200420795,-0.8890099211281611,-0.8900385236630453,-0.8909173875549609,-0.8906699057555283,-0.8918638479441428,-0.892965196481866,-0.8926470588235295,-0.8911330134163247,-0.8910233274647887,-0.8900378254217515,-0.8871564403506166,-0.8857155409561274,-0.8843669869404304,-0.8826893512350108,-0.8788368872428644,-0.8776726280045618,-0.8756771874834438,-0.8747625577613987,-0.8748329840334971,-0.869622899324296,-0.8704898564755071,-0.8669843736833728
22,-0.8928205179763532,-0.8898344951460463,-0.888917008317727,-0.8853338755190813,-0.8849289437341293,-0.8845484306796924,-0.8846539947904023,-0.8825223713646533,-0.883439406635872,-0.8823631781920448,-0.8836656426046144,-0.8836114941109487,-0.8844739266141377,-0.8871401540321101,-0.8867948093471717,-0.8894718554551772,-0.891218651653581,-0.8916579829473997,-0.8912650513152306,-0.8922913512169767,-0.8933232606962641,-0.8934271229306284,-0.8923762114951505,-0.8932279544866821,-0.8939815072445091,-0.894066844919786,-0.8919307541358178,-0.8914084507042254,-0.8908189587311327,-0.8884508245431585,-0.8871737940264006,-0.8849746644034476,-0.8838006412978228,-0.8798426715401781,-0.8778124571051784,-0.8768649222736004,-0.8759416626085809,-0.8761579401289654,-0.8705356847214956,-0.8708699564565022,-0.86779268524847
23,-0.8797303547011984,-0.8765983834409614,-0.8756615095634177,-0.8731531797961875,-0.8718759745177529,-0.8719406048638537,-0.8725616917414097,-0.8698895413870246,-0.8712230863522096,-0.8703273142411628,-0.8726575432047465,-0.8728966449214222,-0.8747722016421362,-1.0,-0.8773464723294241,-0.8821693305536252,-0.8847339133843691,-0.8860268262759934,-0.8864891294684749,-0.8884856154941354,-0.8897588827720342,-0.891137811154981,-0.8902722497568876,-0.8916892940263771,-0.8924965805682554,-0.89325935828877,-0.8913619945487717,-0.8910893485915493,-0.8900378254217515,-0.8877265636606745,-0.8863576454366648,-0.8842664924762621,-0.8829133662279096,-0.8790900626574565,-0.8772531407027118,-0.8767170714698465,-0.8749205578109212,-0.8761579401289654,-0.8707166965777722,-0.8712479564376022,-0.8681921596899079
24,-0.8956858762969516,-0.8925822178505752,-0.8914758763419998,-0.8885068943846808,-0.8875509931330309,-0.8878806381209727,-0.8880395771958717,-0.8853747203579418,-0.8859186825211051,-0.8850571512105475,-0.8865334704804463,-0.8862799168604532,-0.8870120144995726,-0.8889374062612724,-0.8878626650180473,-0.8912555015056752,-0.8926560747460008,-0.8927359618908778,-0.892618311486907,-0.8940269836606477,-0.8938408050318666,-0.8941231974570077,-0.8926834911304637,-0.8942267907938971,-0.8942568190937554,-0.8939679144385027,-0.8924945893974349,-0.8927992957746479,-0.8908189587311327,-0.8885306789481503,-0.8872633507039492,-0.8855744907364517,-0.8839104525688517,-0.8803379545916751,-0.8793210719888958,-0.8784604788641116,-0.8766396926781126,-0.8775365200798996,-0.871792834137953,-0.8725541563722922,-0.8686883818476318
25,-0.887310986889729,-0.884371124321088,-0.8831862687205098,-0.8802200781240374,-0.879080246167162,-0.8793260236956973,-0.8792803669026514,-0.8769924496644296,-0.8780514830640526,-0.8771074943962577,-0.8785158139249732,-0.8790017766619335,-0.8799742877780796,-0.8823242774603054,-0.8817802590330598,-0.885180681028492,-0.8869063823763217,-0.8876951270218522,-0.8880843960212176,-0.889204275802843,-0.8901762572362297,-0.8904765403549206,-0.8896360001590624,-0.8907292474786657,-0.8915476333431938,-0.891187165775401,-0.889500599536621,-0.8899823943661972,-0.8880718723381924,-0.885830485811915,-0.8844076755141905,-0.8825078393533181,-0.8807493521135009,-0.8770369898965025,-0.8769324317563433,-0.8746200542366032,-0.8738829455454008,-0.8748329840334971,-0.8684165215260624,-0.8698189065090547,-0.8660647502296458
26,-0.8840836885707392,-0.8811797032031818,-0.879603853486528,-0.8763200374601062,-0.8758154128136754,-0.87602629390979,-0.8759013457033941,-0.8735947986577182,-0.8745680311917837,-0.8737034819775293,-0.8752188336591713,-0.8754347333978145,-0.876886170403112,-1.0,-0.8793822673510935,-0.8825110030113504,-0.8844997876534068,-0.8857855643219769,-0.8853581200549206,-0.8872245700467807,-0.8882104235098688,-0.8895059030986918,-0.8880019955101023,-0.8893910007757951,-0.8905811130213718,-0.8897967914438503,-0.8881833424843715,-0.8884507042253521,-0.8866448406851367,-0.8844748180062398,-0.8823918053950295,-0.881341161433365,-0.880049488279477,-0.8761169808762637,-0.8781190548579066,-0.8730774775174371,-0.8727451093678701,-0.8732220340422109,-0.8677575942199823,-0.8681599065920047,-0.8651316029015993
27,-0.88815048660822,-0.8853226703160416,-0.8843335414171067,-0.8813229332248962,-0.8802767153103501,-0.8800730097692787,-0.8804417004022019,-0.8780201342281879,-0.8784600788105016,-0.8777270385788074,-0.8794354261891949,-0.8792075676194788,-0.8802857502601044,-0.8828495307526311,-0.8827357088438433,-0.885180681028492,-0.8869063823763217,-0.8876951270218522,-0.8873534379722828,-0.8886844900449727,-0.8896921028577629,-0.8901787751408584,-0.888659935435126,-0.8896625290923196,-0.8902882280753651,-0.890120320855615,-0.8880626965113616,-0.8883164612676057,-0.886263356975904,-0.8836967018273659,-0.8829747686734122,-0.8812343860651863,-0.8794608998667623,-0.8758513542117736,-0.8766502078835391,-0.8739313159091161,-0.872990363176084,-0.8723573493728243,-0.8676626733685203,-0.8685536565723172,-0.864922502998659
28,-0.8816054049706427,-0.8789986314844117,-0.8778548250127943,-0.8745148053676389,-0.8735752152689829,-0.8738372999376429,-0.8743135338000538,-0.8714904921700224,-0.8729197975027182,-0.8723738983947541,-0.8740063078589383,-0.8745635516775393,-0.8757861114240463,-0.8791031458242363,-0.8783706146102639,-0.8823951818392403,-0.8849625943308904,-0.8862680882300099,-0.8868595473986783,-0.8882912608194535,-0.8894124619667519,-0.8908439130216208,-0.8897155313587906,-0.8908165244375484,-0.8921187589879068,-0.8921283422459894,-0.8902072402356782,-0.8903763204225352,-0.8883665634574939,-0.8857469172485515,-0.8842201134159282,-0.8827182496376703,-0.8812120236021025,-0.87845504891266,-0.8788759279713363,-0.8747728334004823,-0.8742838411934427,-0.8753334733511782,-0.8697145089832652,-0.8703943064802847,-0.8670863228897815
29,-0.885843119118475,-0.8826765171278279,-0.8813022669883529,-0.8786428104937587,-0.8774128264037829,-0.8776956453959676,-0.877777850680069,-0.8757410514541387,-0.8764932789462385,-0.8758544836899773,-0.8773645956090217,-0.8772456938242134,-0.8791393032518009,-0.8812737708756542,-0.8811370477225324,-0.8840803798934446,-0.8859971033746774,-0.8866274145445026,-0.8871064926854806,-0.8885534136364663,-0.8896211491988497,-0.8905500148882607,-0.8891515828516273,-0.8904641841220584,-0.8913543292788294,-0.8913983957219251,-0.8897369671572115,-0.8899823943661972,-0.8878478263502303,-0.885494354479275,-0.8833600313617346,-0.8825078393533181,-0.8809806878578017,-0.8774271290599721,-0.8769324317563433,-0.8747728334004823,-0.8743640203230512,-0.8745816222110009,-0.8701725572781115,-0.8703943064802847,-0.8669843736833728
30,-0.891046006595351,-0.8886316982423128,-0.8872129709301345,-0.8843049548383917,-0.8829051289068218,-0.8829570255664103,-0.8832827026920629,-0.8809983221476511,-0.8817288447820938,-0.8811171286563548,-0.8822283226953495,-0.8818897097661529,-0.8830093902624899,-0.8854821255671786,-0.885102476675784,-0.8873117905953208,-0.8889971796016596,-0.8895430909249573,-0.8892845501150765,-0.8902302876901173,-0.8908607513575104,-0.891284760221661,-0.8897155313587906,-0.8910815877941557,-0.8910673020317429,-0.8915026737967915,-0.8891435859430207,-0.8893882042253521,-0.8873997343743062,-0.8854107859159115,-0.8843147393393759,-0.8826130444954943,-0.8812120236021025,-0.8779431641946324,-0.8772146556291476,-0.8761995936567076,-0.8747625577613987,-0.8750832286923376,-0.8687895825469251,-0.8696257065187146,-0.8664756679493542
31,-0.8890905252151532,-0.8864827011076423,-0.8851208854245752,-0.8819760206030585,-0.8810276906236277,-0.8809109332779048,-0.881058453786144,-0.8791317114093959,-0.8798659251923516,-0.8787433694850126,-0.8803482265107186,-0.8804148745704113,-0.8814123166844487,-0.8836722166321771,-0.8830479473440993,-0.8859335186472087,-0.8874617503893021,-0.8878131913823283,-0.8871064926854806,-0.8882912608194535,-0.888849006440088,-0.8898810099267962,-0.888251434272886,-0.8893910007757951,-0.8900919951615407,-0.8900133689839572,-0.8879420505383518,-0.8878411091549295,-0.886263356975904,-0.8842166839994058,-0.88248812106711,-0.8812343860651863,-0.8796966280619043,-0.8759841675440186,-0.8772146556291476,-0.8738536942371453,-0.8728264676023256,-0.8732220340422109,-0.8685103386466936,-0.8691406065429697,-0.8656517519138883
32,-0.8783429180406982,-0.8756361459179746,-0.8743342725222565,-0.8712555296785085,-0.8698712522831559,-0.8699789544793183,-0.8704030548976124,-0.8678901006711409,-0.8684183189401442,-0.8678630598521447,-0.869864646698592,-0.8703722758421994,-0.8717636066030047,-0.874647985368848,-0.8748797881774014,-0.8777739170720408,-0.8798717208785705,-0.8815044479464501,-0.8816341851299426,-0.8832651585346561,-0.8844457058428251,-0.8856852273650099,-0.8845026227220638,-0.886329842254978,-0.8867443202286845,-0.8866764705882353,-0.8848151038909557,-0.8850418133802817,-0.8830379021221797,-0.8807532313177834,-0.8791779034950761,-0.8779274901036506,-0.8761738824872985,-0.8722930636853763,-0.8736034728930384,-0.8695475395778121,-0.8694648396830095,-0.8708592329107475,-0.865251021502884,-0.8668621066568947,-0.8633329276171038
33,-0.8913828118716319,-0.8886316982423128,-0.8867799317260268,-0.8842002144098184,-0.8829051289068218,-0.8829570255664103,-0.8832827026920629,-0.8808025727069351,-0.8815349349363214,-0.8807273031032898,-0.881833230018869,-0.882369888667092,-0.8831087931822851,-0.885184692979958,-0.8842906565751183,-0.8872075515404216,-0.8881260140911021,-0.888855237694357,-0.8883264024022838,-0.8888155664534791,-0.8894124619667519,-0.889730193779414,-0.8880851417643635,-0.8891194724592707,-0.8894974387211472,-0.8890320855614974,-0.8874520801581693,-0.8870840669014084,-0.8851814772502493,-0.8824654583271431,-0.8814049921933613,-0.880479107357922,-0.8788649907026457,-0.8754501472706169,-0.8765090959471369,-0.8733891962953517,-0.8722510644369008,-0.8727908088711731,-0.8681350701641689,-0.8677630066118497,-0.864922502998659
34,-0.8868284002252071,-0.8838953513236112,-0.8824832829995557,-0.8795546683425135,-0.8784183696198665,-0.8784621180627729,-0.8790704083038626,-0.8765799776286354,-0.8769088000443223,-0.8763765714842608,-0.8781002854203991,-0.8781786128317521,-0.8791393032518009,-0.8812737708756542,-0.8811370477225324,-0.8835244382673153,-0.885082379588592,-0.8859036286824531,-0.8854815926983217,-0.8862799159303035,-0.8874174120278973,-0.8868028136879188,-0.885290704610279,-0.886992500646496,-0.8877811329375481,-0.8872459893048128,-0.8857064067935994,-0.8848987676056338,-0.8834415885869763,-0.8813902094785322,-0.880200201418037,-0.8783797151924077,-0.8771665763773994,-0.8740971114483709,-0.8746348728645594,-0.8709348729530364,-0.8697230636445423,-0.8713921199744393,-0.8660324629312001,-0.8661533566923322,-0.8630114755275091
35,-0.8825303627443095,-0.8797791130308343,-0.8783553508461136,-0.8750015403004202,-0.8744089251506724,-0.8740711390563293,-0.8745431760174791,-0.8724972035794183,-0.8730306031288738,-0.8725966558536483,-0.8736725226667393,-0.8739050206133943,-0.8751101715694396,-0.8779956840633089,-0.8772278216993268,-0.880542043085476,-0.8822293125415165,-0.8834294103455179,-0.8829034839041062,-0.8842640511649981,-0.885201153623019,-0.8856852273650099,-0.8837036956702492,-0.8859451771399017,-0.8863254947558951,-0.886331550802139,-0.8838450117814486,-0.8843199823943662,-0.8813969166427819,-0.87955355816372,-0.8781370183371522,-0.876551972125348,-0.8749103207953264,-0.8717272235511241,-0.873304572155023,-0.8695475395778121,-0.867804660058177,-0.8684997832702508,-0.8641627429035627,-0.8651264567436772,-0.8615966702140829
36,-0.8779860049867289,-0.8753581661891118,-0.8736594062301406,-0.8706086035020271,-0.8701258201859619,-0.8694787985865724,-0.8700356273497319,-0.8677712527964205,-0.8686607062473597,-0.8676194188814791,-0.869864646698592,-0.8700224312143724,-0.8711671890842341,-0.8740467918414874,-0.8740367442267102,-0.8780171415334723,-0.8794905859677016,-0.880847394114235,-0.8808143267777592,-0.882758932405252,-0.8833647059805587,-0.884463229863144,-0.8828975385093684,-0.8843903542798035,-0.8851568838213285,-0.8855187165775401,-0.8831211359433899,-0.8827750880281691,-0.8813969166427819,-0.8786138760956768,-0.8760011760650486,-0.8753821537533897,-0.8736218685485878,-0.870291179396225,-0.8718690789110777,-0.8683832144982498,-0.8672717046672507,-0.8680361603532024,-0.8633592268586275,-0.8637688068115597,-0.8607113765951669
37,-0.881871833025014,-0.8788649873839969,-0.8778548250127943,-0.8743915813340234,-0.8735752152689829,-0.8734865412596133,-0.8736180459415659,-0.8714904921700224,-0.8722480383941494,-0.8715872861180336,-0.8736725226667393,-0.873123014974722,-0.8747722016421362,-0.877198311595441,-0.8773464723294241,-0.8799513551077137,-0.8817447267262689,-0.8827928894455594,-0.8825083714452227,-0.8840516169856946,-0.884366404694628,-0.8852830509719908,-0.883884448396904,-0.885366563227308,-0.8859037404336455,-0.8859839572192514,-0.883187614336681,-0.8835893485915493,-0.881727939543915,-0.879178428168177,-0.8778227250914153,-0.8764357754011535,-0.8743978681971918,-0.8715861093856139,-0.8727798923187642,-0.8689684572631091,-0.8679815257852543,-0.8681288849366121,-0.8628526144072193,-0.8646077567696122,-0.8624705205547285
38,-0.879318145258586,-0.8760477697472523,-0.8747335684117584,-0.8717669094180129,-0.8706285917940036,-0.870479110372064,-0.8712494504989797,-0.8690715883668904,-0.8698380160252637,-0.8691647987525583,-0.871506324888795,-0.8717647946549228,-0.873175128064095,-0.8762870287750207,-0.8761849451084717,-0.8798297428769979,-0.8818645119839705,-0.8830495510987686,-0.8829034839041062,-0.8844041673258153,-0.8858773002550158,-0.8865669217650903,-0.8853774659190734,-0.8871799844840962,-0.8879861523997528,-0.8881470588235294,-0.8860855798516301,-0.8861091549295774,-0.8841601504943141,-0.8811190759173971,-0.8799974315820779,-0.8778144338314614,-0.8766716935826293,-0.8731328313173837,-0.8749273594236475,-0.8712564484512012,-0.8703220489069109,-0.8706804867258614,-0.8661295912443241,-0.8675635066218247,-0.8642910420977402
39,-0.8729087911204054,-0.870097934396784,-0.8694583635617193,-0.8654824837036216,-0.8648562645978781,-0.8646786011224278,-0.865186895958953,-0.8630732662192394,-0.8642354065527678,-0.8632756484330405,-0.8658251646787147,-0.8660232269394083,-0.8676019376942499,-0.8711104360867997,-0.87092684876416,-0.8751274032893213,-0.8776829175332949,-0.8791020948724135,-0.8788634590120213,-0.8811408167416213,-0.8821084088433302,-0.8833843143472561,-0.8828071621460409,-0.8839927592448927,-0.8848317815312611,-0.8854010695187166,-0.883517544140422,-0.8835893485915493,-0.8814796723680651,-0.878896152131927,-0.8775050523484127,-0.87608718522857,-0.8745267134218656,-0.8700006502319391,-0.8720987065166775,-0.8679618397075511,-0.8670924807304791,-0.8682216095200218,-0.8635612096006923,-0.8647117067644147,-0.8613761270328724
40,-0.8774933644333628,-0.8740965658811958,-0.8729789160522572,-0.8696967456532723,-0.8689739004257648,-0.8684719912700062,-0.8694123127595778,-0.866932326621924,-0.8676980823701324,-0.866526515098779,-0.8685499417578899,-0.8684721393341976,-0.8705707715654635,-0.8733253596086546,-0.8731812107360086,-0.8767778549918925,-0.8785921965349391,-0.8800466097562227,-0.8796388672125803,-0.8817374403941332,-0.8826635168807102,-0.8835505988174467,-0.8825324180015256,-0.8834949573312646,-0.8842899443811487,-0.8844572192513369,-0.8816463004774133,-0.8828499119718309,-0.8805572487960052,-0.8776593373941465,-0.876650039540118,-0.8751450496269928,-0.8734915591736336,-0.8700006502319391,-0.8711776304227072,-0.8672829581003143,-0.866464017846931,-0.8668151004776992,-0.8627510711707714,-0.8627051568647421,-0.8611555838516618
41,-0.8746481138904528,-0.8711457041440362,-0.8701782209399763,-0.867146008157431,-0.8659445423823737,-0.8658802743712326,-0.866499137201383,-0.864212807606264,-0.8652395825398035,-0.8641666782686177,-0.8665812903181859,-0.8673814472592074,-0.8686092206148401,-0.8711104360867997,-0.8714326751345748,-0.8746119990734306,-0.8767573041783275,-0.8786965694603432,-0.8785078577990261,-0.8794006644217949,-0.8813070498720748,-0.881682798838329,-0.8803995358269979,-0.8823829842254978,-0.8831886969841637,-0.8825187165775401,-0.8808239381307753,-0.8810365316901408,-0.8791927885449928,-0.8764930916654287,-0.8746848618799468,-0.8727284718089474,-0.8715017789425906,-0.8686739003817,-0.8699307140392265,-0.8658155388730565,-0.8653709876535931,-0.8665302237455369,-0.8608912847206126,-0.8623828068808597,-0.8599280321826597
42,-0.8764879755489423,-0.8739575760167643,-0.8717304134118428,-0.8695673604179759,-0.8675419559724812,-0.8671858761172313,-0.868159122373057,-0.8658347315436241,-0.8670955767779109,-0.8660392331574478,-0.8680594818836384,-0.8685956139087249,-0.8698418168202994,-0.8722305545535664,-0.8720633969050919,-0.875642807505212,-0.8776829175332949,-0.8791020948724135,-0.8785078577990261,-0.8805441930891094,-0.8810649726828413,-0.8823672721226019,-0.8809634843341612,-0.8819724592707525,-0.8827435118662336,-0.8827647058823529,-0.8805481759067529,-0.8804181338028169,-0.8786720330054053,-0.876591516862279,-0.8755652209177363,-0.8726059941807425,-0.8719058844199769,-0.867623844973638,-0.8689788498864048,-0.8659030172652776,-0.8648179874802647,-0.8651840415406133,-0.8607864302916719,-0.8612971069351446,-0.8593621100572892
43,-0.8735974825062334,-0.8713648804687166,-0.8694583635617193,-0.8667332076448191,-0.8654035855889111,-0.8648085117439201,-0.8657117924559251,-0.8628145973154362,-0.8639791685422827,-0.8627605218093475,-0.8653210809190673,-0.8663936506629899,-0.8676019376942499,-0.8704776007948412,-0.8708019533640576,-0.8744845957841093,-0.8768879790049112,-0.8782961772813371,-0.8783646295326807,-0.8794775023164365,-0.8813905247649139,-0.8815938559821805,-0.8808694929163007,-0.8819724592707525,-0.882629286737291,-0.8832540106951872,-0.8811686409108033,-0.8809595070422536,-0.8790192033651304,-0.8763946664685782,-0.8737909848530933,-0.8730974749195651,-0.8712323752909998,-0.868227038857584,-0.8693765289799018,-0.8661642203519095,-0.8650950771193525,-0.8659560016265903,-0.861100993578494,-0.8622746568862671,-0.8601527365559686
44,-0.8735220783399019,-0.8715145618611811,-0.8693121425317609,-0.8667332076448191,-0.8655372337378842,-0.8644057888172937,-0.8653181200831961,-0.8629474272930648,-0.8642354065527678,-0.8634009495036685,-0.8657025497101518,-0.8665171252375171,-0.8670982962339547,-0.8702244666780578,-0.8705459177938476,-0.8740908037989344,-0.8760875956920865,-0.877325996232207,-0.8775003210288729,-0.8787091233700196,-0.8801717913294629,-0.881249685799693,-0.8796403743750475,-0.8809348332040341,-0.8821811727699008,-0.882024064171123,-0.8797824433025481,-0.8797953345070423,-0.8786720330054053,-0.8752042787104443,-0.8735645585362721,-0.8712336166544451,-0.8712323752909998,-0.8687818112141491,-0.8689788498864048,-0.8654656253041723,-0.8640739723216928,-0.8647941514248305,-0.8601550962563658,-0.8607479569626022,-0.858793067037845
45,-0.8718279980696534,-0.8693441816704444,-0.8679905293763673,-0.8644966914346974,-0.8630551966855259,-0.8629053211390564,-0.8631726056518231,-0.8608571029082774,-0.8619084884034987,-0.861319559497125,-0.8631208234276333,-0.8642465650059337,-0.8654217003200774,-0.8680285282149615,-0.8679293591617021,-0.8718264998841788,-0.87389334756237,-0.8759810891693915,-0.875435858431206,-0.8777689891296978,-0.8779972703710042,-0.879122791413534,-0.8784835569244562,-0.8798810447375226,-0.8809217675020722,-0.8803877005347593,-0.8782928348602845,-0.8786861795774648,-0.8761833059499348,-0.8741940276333383,-0.8714979959581213,-0.8706008155753857,-0.8691723158464985,-0.8670497040061205,-0.8668685850193003,-0.8636889514790624,-0.8630375391610198,-0.8638099302443013,-0.8586584372495911,-0.8604161569791922,-0.8567020680084431
46,-0.8684699991956889,-0.8659816961040072,-0.8642843886554976,-0.8620322107623871,-0.8598858262955915,-0.859793961754313,-0.860108522350749,-0.8574734340044743,-0.8589513632554693,-0.8584933242374038,-0.8607162076552612,-0.862161216636141,-0.8627577020695688,-0.8658895449281415,-0.8668552587208214,-0.8710099606208015,-0.8730494059740175,-0.8751187060146092,-0.875435858431206,-0.8774525977988203,-0.8790949652118384,-0.8799271441995723,-0.8779919095079549,-0.8803044996121024,-0.8810389214804748,-0.8812727272727273,-0.8780761645414099,-0.8791637323943662,-0.8775296003100312,-0.8742961669885604,-0.8731117059026299,-0.8707280038815987,-0.8686115462891111,-0.8675062498357127,-0.8674432954511926,-0.8640474896781658,-0.8634160318169652,-0.8645986477851113,-0.859197057895097,-0.8605274569736272,-0.8581023091495251
47,-0.8707270972412129,-0.868574391652055,-0.8666632923352061,-0.8639236996783852,-0.8626287954483259,-0.8617880897942216,-0.8635794004369763,-0.8597944630872483,-0.8612436546465647,-0.8603937238085957,-0.8629913965163725,-0.8638624218851824,-0.8648981782758233,-0.8674969465697163,-0.8687224449523524,-0.8723708593930971,-0.8743125959643258,-0.8759092239064931,-0.8760334660252674,-0.878162218355217,-0.8797585906099094,-0.8804608013364631,-0.8802115529912768,-0.8813518231186966,-0.8821811727699008,-0.8822727272727273,-0.8797824433025481,-0.8802618838028169,-0.8784984478255429,-0.8753045609864805,-0.8742387682408365,-0.8717360889752862,-0.8704168435848255,-0.8684843646888086,-0.8682553305033975,-0.8645834488417737,-0.8641683007094674,-0.8645986477851113,-0.8604718670048498,-0.8619502069024897,-0.8592487175726102
48,-0.879318145258586,-0.8770046615062225,-0.8751328643012604,-0.8718962946533092,-0.8705076720401708,-0.870479110372064,-0.871131348787161,-0.8683654921700223,-0.8693670921141021,-0.8691647987525583,-0.8706957037077404,-0.8709553502219113,-0.8717636066030047,-0.8742872692524317,-0.8742802902569098,-0.8775249015520037,-0.8787228713615228,-0.8800466097562227,-0.8793573495856258,-0.8812899726547493,-0.8819498065469359,-0.8821120447962628,-0.8805911337172522,-0.8820758986294285,-0.8828548081457162,-0.8827647058823529,-0.8795017567530968,-0.8797953345070423,-0.8781472406011699,-0.8757038330114396,-0.8744618150603917,-0.8722338506181194,-0.8710976734652045,-0.8695939094019388,-0.8691379215238036,-0.8651144796452567,-0.8645408978411769,-0.8650868483025815,-0.8606815758627312,-0.8617339069133046,-0.858793067037845
49,-0.866806080591973,-0.8646880212119916,-0.8626253423540461,-0.8596293421068846,-0.85854298060829,-0.8580401683641654,-0.8585207104474086,-0.8559284116331096,-0.8570053394461103,-0.8564049730602699,-0.8590677175223602,-0.859739743035691,-0.8608292854255439,-0.8639657256405875,-0.8646508549090137,-0.8693421357424137,-0.8707625965088042,-0.8724545580542994,-0.8729911000918636,-0.8751113019503266,-0.8760105679214334,-0.8774792821151385,-0.8763000639864652,-0.8779318593224722,-0.8792845406538949,-0.8787032085561497,-0.8769115615774584,-0.877312940140845,-0.8751781266525914,-0.8724409448818897,-0.8717311812694744,-0.8687934854463603,-0.8676188523990103,-0.8653508001311532,-0.8651123828289864,-0.8615857737956628,-0.8615011655451414,-0.8619006975569865,-0.8572390394009832,-0.8588485070575747,-0.8562297727052847
50,-0.866806080591973,-0.8643619296069794,-0.8626253423540461,-0.8599374021909233,-0.858243863322493,-0.8580401683641654,-0.8588159647269554,-0.8557885906040269,-0.8570053394461103,-0.8561195650660615,-0.8590677175223602,-0.859739743035691,-0.8612467776886833,-0.8639657256405875,-0.8645072251988959,-0.8686356265925411,-0.8710566148686173,-0.8721516973035127,-0.8730701225836404,-0.8747768311148274,-0.8762735138338766,-0.8772008523045868,-0.8765025070403187,-0.8774890095681407,-0.8786870553640413,-0.8781764705882353,-0.876320642525982,-0.8764084507042254,-0.8749016014242058,-0.8720212449858862,-0.8709116531824725,-0.8682674597354797,-0.867043441338819,-0.8640876900026148,-0.8646877641839946,-0.8614933670433166,-0.860423463714817,-0.861183478490131,-0.8563516398128955,-0.8577061071146946,-0.8552737388206973
