series,Temp,Humi,Pres,200,205,210,215,220,225,230,235,240,245,250,255,260,265,270,275,280,285,290,295,300,305,310,315,320,325,330,335,340,345,350,355,360,365,370,375,380,385,390,395,400,configuration
0,31.6,33.56,98957.0,32697.0,31659.0,30753.0,28988.0,28496.0,28189.0,28132.0,27183.0,27487.0,27686.0,28132.0,28227.0,29170.0,30397.0,30958.0,33188.0,35254.0,38072.0,40305.0,44310.0,49170.0,53953.0,59682.0,68352.0,78178.0,88225.0,99525.0,116969.0,134430.0,155669.0,181670.0,206927.0,234476.0,262719.0,296547.0,328163.0,360097.0,391880.0,417809.0,457193.0,474030.0,"TEMP:200,205,210,215,220,225,230,235,240,245,250,255,260,265,270,275,280,285,290,295,300,305,310,315,320,325,330,335,340,345,350,355,360,365,370,375,380,385,390,395,400;HTDR:500;CTDR:50;TRSH:0.002;NEUTR;ENV;;Preheating:300"
1,32.38,49.92,98979.0,15063.0,14693.0,14302.0,13712.0,13613.0,13561.0,13658.0,13319.0,13578.0,13857.0,14224.0,14341.0,14977.0,15719.0,16357.0,17550.0,18694.0,20269.0,21585.0,23980.0,26496.0,29272.0,32595.0,37526.0,42598.0,49055.0,56160.0,65930.0,77240.0,90415.0,105946.0,123799.0,142311.0,162621.0,185693.0,209693.0,237520.0,265472.0,293638.0,325246.0,348660.0,"TEMP:200,205,210,215,220,225,230,235,240,245,250,255,260,265,270,275,280,285,290,295,300,305,310,315,320,325,330,335,340,345,350,355,360,365,370,375,380,385,390,395,400;HTDR:500;CTDR:50;TRSH:0.002;NEUTR;ENV;;Preheating:300"
2,32.69,45.17,98959.0,16306.0,15934.0,15463.0,14881.0,14703.0,14734.0,14776.0,14520.0,14849.0,15205.0,15509.0,15778.0,16434.0,17261.0,17941.0,19174.0,20547.0,22203.0,23709.0,26198.0,29008.0,32096.0,35523.0,40815.0,46782.0,53505.0,61433.0,72305.0,84487.0,98356.0,116725.0,135299.0,154378.0,176130.0,200136.0,224870.0,247516.0,271602.0,292335.0,316799.0,338623.0,"TEMP:200,205,210,215,220,225,230,235,240,245,250,255,260,265,270,275,280,285,290,295,300,305,310,315,320,325,330,335,340,345,350,355,360,365,370,375,380,385,390,395,400;HTDR:500;CTDR:50;TRSH:0.002;NEUTR;ENV;;Preheating:300"
3,32.69,44.68,98957.0,20567.0,20055.0,19459.0,18545.0,18382.0,18238.0,18302.0,17895.0,18238.0,18661.0,18931.0,19138.0,19865.0,20771.0,0.0,22808.0,24413.0,26084.0,27487.0,30331.0,33267.0,36545.0,39959.0,45711.0,52139.0,58310.0,66612.0,76886.0,88786.0,101331.0,118542.0,136846.0,156104.0,177061.0,201483.0,224258.0,246774.0,269601.0,291043.0,321124.0,348660.0,"TEMP:200,205,210,215,220,225,230,235,240,245,250,255,260,265,270,275,280,285,290,295,300,305,310,315,320,325,330,335,340,345,350,355,360,365,370,375,380,385,390,395,400;HTDR:500;CTDR:50;TRSH:0.002;NEUTR;ENV;;Preheating:300"
4,32.62,40.75,98949.0,26699.0,25939.0,25160.0,24063.0,23736.0,23552.0,23525.0,22908.0,23264.0,23749.0,23912.0,23980.0,24788.0,25684.0,26346.0,27889.0,29581.0,31375.0,33031.0,36198.0,39433.0,42860.0,47017.0,53642.0,60941.0,68914.0,78914.0,92106.0,104950.0,121465.0,141112.0,162938.0,185083.0,204995.0,238379.0,261675.0,279674.0,303655.0,322066.0,345008.0,367736.0,"TEMP:200,205,210,215,220,225,230,235,240,245,250,255,260,265,270,275,280,285,290,295,300,305,310,315,320,325,330,335,340,345,350,355,360,365,370,375,380,385,390,395,400;HTDR:500;CTDR:50;TRSH:0.002;NEUTR;ENV;;Preheating:300"
5,32.59,45.85,98951.0,16512.0,16143.0,15637.0,14934.0,14745.0,14683.0,14662.0,14380.0,14601.0,14934.0,15128.0,15283.0,15850.0,16538.0,17148.0,18207.0,19459.0,20854.0,22063.0,24427.0,27008.0,29792.0,32979.0,38037.0,43213.0,49112.0,56615.0,66825.0,77742.0,90709.0,106824.0,124535.0,143777.0,164862.0,188996.0,213085.0,235819.0,259817.0,279912.0,305912.0,329147.0,"TEMP:200,205,210,215,220,225,230,235,240,245,250,255,260,265,270,275,280,285,290,295,300,305,310,315,320,325,330,335,340,345,350,355,360,365,370,375,380,385,390,395,400;HTDR:500;CTDR:50;TRSH:0.002;NEUTR;ENV;;Preheating:300"
6,32.5,43.58,98949.0,23187.0,22684.0,21970.0,20958.0,20751.0,20608.0,20710.0,20152.0,20527.0,20896.0,21192.0,21408.0,22274.0,23238.0,24118.0,25590.0,27219.0,29190.0,30844.0,33750.0,37160.0,40421.0,44545.0,50535.0,57078.0,63966.0,71687.0,82652.0,94177.0,107925.0,126415.0,145652.0,165025.0,186852.0,211715.0,235482.0,259204.0,284999.0,306481.0,334836.0,359311.0,"TEMP:200,205,210,215,220,225,230,235,240,245,250,255,260,265,270,275,280,285,290,295,300,305,310,315,320,325,330,335,340,345,350,355,360,365,370,375,380,385,390,395,400;HTDR:500;CTDR:50;TRSH:0.002;NEUTR;ENV;;Preheating:300"
7,32.38,42.02,98941.0,21452.0,21022.0,20367.0,19405.0,19174.0,19034.0,19069.0,18595.0,18931.0,19226.0,19531.0,19660.0,20507.0,21430.0,0.0,23394.0,25085.0,26974.0,28476.0,31422.0,34757.0,38176.0,42001.0,47605.0,53642.0,61074.0,69834.0,81447.0,94710.0,109334.0,129744.0,149955.0,171443.0,193323.0,219475.0,245121.0,267847.0,292595.0,311998.0,335177.0,356974.0,"TEMP:200,205,210,215,220,225,230,235,240,245,250,255,260,265,270,275,280,285,290,295,300,305,310,315,320,325,330,335,340,345,350,355,360,365,370,375,380,385,390,395,400;HTDR:500;CTDR:50;TRSH:0.002;NEUTR;ENV;;Preheating:300"
8,32.63,43.6,98943.0,22274.0,21765.0,21085.0,20152.0,19979.0,19903.0,19903.0,19405.0,19752.0,20132.0,20367.0,20527.0,21321.0,22180.0,0.0,24427.0,25955.0,27741.0,29313.0,31998.0,34960.0,37865.0,41917.0,47849.0,53953.0,60676.0,68632.0,80122.0,92820.0,107648.0,127570.0,148493.0,169878.0,192532.0,220209.0,249013.0,276853.0,302818.0,326536.0,362076.0,388694.0,"TEMP:200,205,210,215,220,225,230,235,240,245,250,255,260,265,270,275,280,285,290,295,300,305,310,315,320,325,330,335,340,345,350,355,360,365,370,375,380,385,390,395,400;HTDR:500;CTDR:50;TRSH:0.002;NEUTR;ENV;;Preheating:300"
9,32.79,44.01,98949.0,20055.0,19549.0,19051.0,18207.0,18003.0,17941.0,18034.0,17624.0,17926.0,18350.0,18628.0,18829.0,19604.0,20487.0,21192.0,22660.0,24286.0,26019.0,27505.0,30463.0,33641.0,37160.0,40895.0,47123.0,53814.0,60808.0,69371.0,81053.0,93966.0,107717.0,126798.0,146416.0,166667.0,191190.0,220948.0,251293.0,281347.0,304779.0,321437.0,353526.0,367736.0,"TEMP:200,205,210,215,220,225,230,235,240,245,250,255,260,265,270,275,280,285,290,295,300,305,310,315,320,325,330,335,340,345,350,355,360,365,370,375,380,385,390,395,400;HTDR:500;CTDR:50;TRSH:0.002;NEUTR;ENV;;Preheating:300"
10,32.96,46.63,98941.0,14014.0,13667.0,13302.0,12743.0,12590.0,12590.0,12568.0,12331.0,12530.0,12814.0,13053.0,13185.0,13721.0,14351.0,14828.0,15874.0,17022.0,18382.0,19531.0,21630.0,24035.0,26597.0,29477.0,34162.0,39175.0,44783.0,51849.0,61478.0,71871.0,84402.0,100239.0,118458.0,137070.0,158318.0,184268.0,208895.0,232983.0,257784.0,280867.0,307626.0,328163.0,"TEMP:200,205,210,215,220,225,230,235,240,245,250,255,260,265,270,275,280,285,290,295,300,305,310,315,320,325,330,335,340,345,350,355,360,365,370,375,380,385,390,395,400;HTDR:500;CTDR:50;TRSH:0.002;NEUTR;ENV;;Preheating:300"
11,33.15,49.09,98937.0,11158.0,10902.0,10582.0,10170.0,10072.0,10033.0,10101.0,9919.0,10131.0,10331.0,10614.0,10778.0,11291.0,11951.0,0.0,13387.0,14420.0,15672.0,16723.0,18711.0,20854.0,23368.0,26068.0,30309.0,34699.0,40382.0,46678.0,55749.0,65672.0,77383.0,93546.0,109836.0,126702.0,145779.0,169706.0,191524.0,214333.0,237520.0,258593.0,284752.0,307339.0,"TEMP:200,205,210,215,220,225,230,235,240,245,250,255,260,265,270,275,280,285,290,295,300,305,310,315,320,325,330,335,340,345,350,355,360,365,370,375,380,385,390,395,400;HTDR:500;CTDR:50;TRSH:0.002;NEUTR;ENV;;Preheating:300"
12,33.5,47.62,98935.0,10593.0,10424.0,10111.0,9716.0,9609.0,9609.0,9662.0,9513.0,9680.0,9938.0,10150.0,10290.0,10756.0,11328.0,11876.0,12736.0,13784.0,14892.0,15958.0,17819.0,19846.0,22250.0,24965.0,29008.0,33750.0,39029.0,45761.0,55052.0,65364.0,77240.0,93442.0,108908.0,126225.0,146416.0,169192.0,192195.0,214753.0,236836.0,260228.0,284261.0,303096.0,"TEMP:200,205,210,215,220,225,230,235,240,245,250,255,260,265,270,275,280,285,290,295,300,305,310,315,320,325,330,335,340,345,350,355,360,365,370,375,380,385,390,395,400;HTDR:500;CTDR:50;TRSH:0.002;NEUTR;ENV;;Preheating:300"
13,33.62,46.98,98933.0,13127.0,12845.0,12560.0,11992.0,11951.0,11896.0,11923.0,11736.0,11985.0,12316.0,12568.0,12736.0,13353.0,14052.0,14642.0,15719.0,16981.0,18318.0,19641.0,21810.0,24441.0,27219.0,30309.0,34873.0,40382.0,46368.0,53471.0,63338.0,74031.0,87763.0,103014.0,120764.0,138430.0,158318.0,181473.0,207972.0,226416.0,250910.0,274317.0,300332.0,323014.0,"TEMP:200,205,210,215,220,225,230,235,240,245,250,255,260,265,270,275,280,285,290,295,300,305,310,315,320,325,330,335,340,345,350,355,360,365,370,375,380,385,390,395,400;HTDR:500;CTDR:50;TRSH:0.002;NEUTR;ENV;;Preheating:300"
14,33.64,47.57,98933.0,11528.0,11267.0,10971.0,10603.0,10497.0,10486.0,10603.0,10444.0,10668.0,11006.0,11230.0,11490.0,12082.0,12659.0,13152.0,14147.0,15261.0,16486.0,17684.0,19660.0,21855.0,24470.0,27487.0,31852.0,36834.0,42298.0,49257.0,58229.0,68744.0,81131.0,96264.0,114023.0,131786.0,153388.0,176688.0,199048.0,223194.0,246221.0,272051.0,294163.0,315888.0,"TEMP:200,205,210,215,220,225,230,235,240,245,250,255,260,265,270,275,280,285,290,295,300,305,310,315,320,325,330,335,340,345,350,355,360,365,370,375,380,385,390,395,400;HTDR:500;CTDR:50;TRSH:0.002;NEUTR;ENV;;Preheating:300"
15,33.69,46.47,98933.0,14341.0,14024.0,13631.0,13086.0,13086.0,12940.0,13021.0,12806.0,13045.0,13404.0,13676.0,13893.0,14550.0,15183.0,15742.0,16844.0,18191.0,19513.0,20813.0,23110.0,25622.0,28303.0,31635.0,36292.0,41917.0,48014.0,55417.0,65161.0,76256.0,90027.0,107029.0,125280.0,143777.0,166336.0,190417.0,213916.0,238725.0,262092.0,286237.0,312590.0,333818.0,"TEMP:200,205,210,215,220,225,230,235,240,245,250,255,260,265,270,275,280,285,290,295,300,305,310,315,320,325,330,335,340,345,350,355,360,365,370,375,380,385,390,395,400;HTDR:500;CTDR:50;TRSH:0.002;NEUTR;ENV;;Preheating:300"
16,33.57,46.7,98933.0,12173.0,11903.0,11566.0,11052.0,11017.0,10914.0,11017.0,10823.0,11064.0,11352.0,11684.0,11923.0,12507.0,13111.0,13721.0,14631.0,15838.0,17134.0,18334.0,20527.0,22808.0,25606.0,28612.0,33241.0,38456.0,44170.0,51466.0,61074.0,72119.0,85609.0,101948.0,120677.0,139933.0,162621.0,186218.0,211308.0,236836.0,260023.0,281828.0,309651.0,332470.0,"TEMP:200,205,210,215,220,225,230,235,240,245,250,255,260,265,270,275,280,285,290,295,300,305,310,315,320,325,330,335,340,345,350,355,360,365,370,375,380,385,390,395,400;HTDR:500;CTDR:50;TRSH:0.002;NEUTR;ENV;;Preheating:300"
17,33.46,49.07,98933.0,10444.0,10220.0,9957.0,9600.0,9513.0,9452.0,9521.0,9351.0,9547.0,9780.0,10024.0,10230.0,10734.0,11328.0,11809.0,12751.0,13757.0,14934.0,16106.0,17926.0,20036.0,22369.0,25221.0,29540.0,34246.0,39470.0,46266.0,55343.0,65262.0,77742.0,93861.0,110125.0,128846.0,149021.0,174298.0,196319.0,220504.0,243490.0,268283.0,290274.0,309070.0,"TEMP:200,205,210,215,220,225,230,235,240,245,250,255,260,265,270,275,280,285,290,295,300,305,310,315,320,325,330,335,340,345,350,355,360,365,370,375,380,385,390,395,400;HTDR:500;CTDR:50;TRSH:0.002;NEUTR;ENV;;Preheating:300"
18,33.37,49.58,98937.0,9966.0,9725.0,9469.0,9083.0,9043.0,8996.0,9043.0,8889.0,9059.0,9293.0,9521.0,9671.0,10140.0,10723.0,11170.0,12103.0,13053.0,14166.0,15183.0,17036.0,19086.0,21365.0,23980.0,28019.0,32569.0,37763.0,44263.0,52763.0,62815.0,74294.0,90318.0,105879.0,123616.0,144521.0,167668.0,189213.0,213916.0,237348.0,257784.0,285741.0,308202.0,"TEMP:200,205,210,215,220,225,230,235,240,245,250,255,260,265,270,275,280,285,290,295,300,305,310,315,320,325,330,335,340,345,350,355,360,365,370,375,380,385,390,395,400;HTDR:500;CTDR:50;TRSH:0.002;NEUTR;ENV;;Preheating:300"
19,33.34,50.19,98947.0,9146.0,8973.0,8748.0,8410.0,8356.0,8343.0,8363.0,8264.0,8444.0,8654.0,8889.0,9051.0,9495.0,10043.0,10507.0,11377.0,12418.0,13430.0,14430.0,16231.0,18207.0,20447.0,23059.0,26939.0,31493.0,36355.0,42426.0,50934.0,60545.0,71933.0,87123.0,101824.0,119387.0,139120.0,161992.0,184963.0,208103.0,231509.0,252255.0,279437.0,298969.0,"TEMP:200,205,210,215,220,225,230,235,240,245,250,255,260,265,270,275,280,285,290,295,300,305,310,315,320,325,330,335,340,345,350,355,360,365,370,375,380,385,390,395,400;HTDR:500;CTDR:50;TRSH:0.002;NEUTR;ENV;;Preheating:300"
20,33.29,49.26,98959.0,10561.0,10300.0,10053.0,9689.0,9609.0,9591.0,9662.0,9521.0,9761.0,10043.0,10290.0,10497.0,10971.0,11617.0,12131.0,13061.0,14137.0,15316.0,16383.0,18399.0,20507.0,22733.0,25559.0,29855.0,34528.0,39959.0,46626.0,55564.0,65569.0,77598.0,93756.0,108908.0,126894.0,147188.0,170744.0,192532.0,213916.0,238207.0,257986.0,283771.0,304498.0,"TEMP:200,205,210,215,220,225,230,235,240,245,250,255,260,265,270,275,280,285,290,295,300,305,310,315,320,325,330,335,340,345,350,355,360,365,370,375,380,385,390,395,400;HTDR:500;CTDR:50;TRSH:0.002;NEUTR;ENV;;Preheating:300"
21,33.25,47.91,98963.0,14410.0,14024.0,13631.0,13070.0,12972.0,12997.0,13045.0,12806.0,13127.0,13439.0,13730.0,13903.0,14540.0,15261.0,15814.0,16858.0,18081.0,19369.0,20608.0,22808.0,25251.0,28038.0,30912.0,35674.0,40696.0,46574.0,53745.0,63290.0,73641.0,86315.0,101454.0,119132.0,136735.0,156688.0,179914.0,201730.0,223648.0,246037.0,266978.0,290530.0,308780.0,"TEMP:200,205,210,215,220,225,230,235,240,245,250,255,260,265,270,275,280,285,290,295,300,305,310,315,320,325,330,335,340,345,350,355,360,365,370,375,380,385,390,395,400;HTDR:500;CTDR:50;TRSH:0.002;NEUTR;ENV;;Preheating:300"
22,33.23,51.13,98975.0,10033.0,9816.0,9565.0,9211.0,9162.0,9146.0,9194.0,9075.0,9309.0,9556.0,9807.0,9995.0,10465.0,11099.0,11605.0,12537.0,13526.0,14662.0,15707.0,17506.0,19586.0,21970.0,24599.0,28710.0,33373.0,38598.0,45218.0,53988.0,63966.0,75773.0,91203.0,105479.0,123891.0,143654.0,166833.0,189431.0,210902.0,234142.0,254990.0,280150.0,299786.0,"TEMP:200,205,210,215,220,225,230,235,240,245,250,255,260,265,270,275,280,285,290,295,300,305,310,315,320,325,330,335,340,345,350,355,360,365,370,375,380,385,390,395,400;HTDR:500;CTDR:50;TRSH:0.002;NEUTR;ENV;;Preheating:300"
23,33.21,50.23,98983.0,8777.0,8618.0,8390.0,8103.0,8072.0,8091.0,8116.0,7998.0,8212.0,8423.0,8632.0,8814.0,9219.0,9807.0,10230.0,11029.0,12005.0,13013.0,14071.0,15742.0,17565.0,19771.0,22156.0,25971.0,30419.0,35165.0,41297.0,49519.0,59092.0,70421.0,85609.0,101515.0,117133.0,137183.0,160441.0,181670.0,204232.0,225795.0,246589.0,270709.0,288747.0,"TEMP:200,205,210,215,220,225,230,235,240,245,250,255,260,265,270,275,280,285,290,295,300,305,310,315,320,325,330,335,340,345,350,355,360,365,370,375,380,385,390,395,400;HTDR:500;CTDR:50;TRSH:0.002;NEUTR;ENV;;Preheating:300"
24,33.12,48.44,98985.0,9716.0,9556.0,9368.0,9075.0,9043.0,9075.0,9162.0,9035.0,9268.0,9521.0,9734.0,9938.0,10444.0,11040.0,11617.0,12575.0,13685.0,14870.0,16081.0,18019.0,20387.0,23008.0,25891.0,30375.0,35403.0,41502.0,48627.0,58473.0,69601.0,82816.0,99171.0,116888.0,137521.0,159828.0,185275.0,208631.0,232818.0,257986.0,279674.0,301708.0,321124.0,"TEMP:200,205,210,215,220,225,230,235,240,245,250,255,260,265,270,275,280,285,290,295,300,305,310,315,320,325,330,335,340,345,350,355,360,365,370,375,380,385,390,395,400;HTDR:500;CTDR:50;TRSH:0.002;NEUTR;ENV;;Preheating:300"
25,33.02,48.21,98987.0,11903.0,11617.0,11303.0,10801.0,10712.0,10701.0,10778.0,10603.0,10846.0,11146.0,11389.0,11592.0,12152.0,12837.0,13327.0,14321.0,15441.0,16670.0,17957.0,19884.0,22227.0,24951.0,27852.0,32244.0,37259.0,43169.0,49902.0,59428.0,69892.0,82652.0,97554.0,115120.0,134000.0,155669.0,180108.0,202474.0,228141.0,250528.0,273633.0,298427.0,322066.0,"TEMP:200,205,210,215,220,225,230,235,240,245,250,255,260,265,270,275,280,285,290,295,300,305,310,315,320,325,330,335,340,345,350,355,360,365,370,375,380,385,390,395,400;HTDR:500;CTDR:50;TRSH:0.002;NEUTR;ENV;;Preheating:300"
26,33.12,49.18,98991.0,9090.0,8897.0,8661.0,8336.0,8264.0,8277.0,8310.0,8186.0,8403.0,8618.0,8874.0,9043.0,9487.0,10014.0,10507.0,11352.0,12345.0,13447.0,14460.0,16155.0,18065.0,20328.0,22908.0,26818.0,31351.0,36292.0,42729.0,51214.0,60764.0,72119.0,87123.0,101700.0,119814.0,138315.0,162149.0,183864.0,205506.0,228775.0,249579.0,274545.0,294953.0,"TEMP:200,205,210,215,220,225,230,235,240,245,250,255,260,265,270,275,280,285,290,295,300,305,310,315,320,325,330,335,340,345,350,355,360,365,370,375,380,385,390,395,400;HTDR:500;CTDR:50;TRSH:0.002;NEUTR;ENV;;Preheating:300"
27,33.18,49.84,98989.0,9178.0,8966.0,8755.0,8464.0,8396.0,8410.0,8451.0,8369.0,8548.0,8814.0,9059.0,9243.0,9698.0,10300.0,10801.0,11717.0,12720.0,13811.0,14881.0,16697.0,18694.0,21064.0,23789.0,27963.0,32443.0,37831.0,44263.0,53300.0,63147.0,75093.0,90906.0,105879.0,124535.0,144272.0,168511.0,191301.0,214753.0,236157.0,257180.0,282554.0,303655.0,"TEMP:200,205,210,215,220,225,230,235,240,245,250,255,260,265,270,275,280,285,290,295,300,305,310,315,320,325,330,335,340,345,350,355,360,365,370,375,380,385,390,395,400;HTDR:500;CTDR:50;TRSH:0.002;NEUTR;ENV;;Preheating:300"
28,33.06,45.75,98996.0,13319.0,13021.0,12689.0,12194.0,12089.0,12082.0,12138.0,11978.0,12230.0,12545.0,12845.0,13045.0,13694.0,14370.0,15031.0,16106.0,17332.0,18761.0,20171.0,22489.0,25175.0,28151.0,31469.0,36449.0,42128.0,48431.0,55897.0,66086.0,77526.0,90906.0,107717.0,126798.0,145147.0,166667.0,191747.0,214893.0,238898.0,262092.0,284752.0,307626.0,328491.0,"TEMP:200,205,210,215,220,225,230,235,240,245,250,255,260,265,270,275,280,285,290,295,300,305,310,315,320,325,330,335,340,345,350,355,360,365,370,375,380,385,390,395,400;HTDR:500;CTDR:50;TRSH:0.002;NEUTR;ENV;;Preheating:300"
29,33.03,47.48,98998.0,10290.0,10072.0,9826.0,9452.0,9376.0,9393.0,9469.0,9276.0,9504.0,9780.0,10014.0,10170.0,10712.0,11352.0,0.0,12790.0,13829.0,14987.0,16081.0,17957.0,20094.0,22562.0,25450.0,29644.0,34528.0,40305.0,47149.0,56654.0,67092.0,79213.0,94633.0,111370.0,130249.0,150901.0,175209.0,197733.0,222440.0,245304.0,266546.0,291301.0,312887.0,"TEMP:200,205,210,215,220,225,230,235,240,245,250,255,260,265,270,275,280,285,290,295,300,305,310,315,320,325,330,335,340,345,350,355,360,365,370,375,380,385,390,395,400;HTDR:500;CTDR:50;TRSH:0.002;NEUTR;ENV;;Preheating:300"
30,32.95,45.24,98998.0,12613.0,12367.0,12075.0,11553.0,11439.0,11439.0,11515.0,11315.0,11566.0,11836.0,12124.0,12266.0,12821.0,13508.0,14090.0,15106.0,16256.0,17654.0,18863.0,21043.0,23605.0,26413.0,29436.0,34415.0,39807.0,46012.0,53642.0,64015.0,75568.0,89164.0,105812.0,125374.0,145147.0,167500.0,192644.0,218601.0,244393.0,270265.0,291817.0,320499.0,342853.0,"TEMP:200,205,210,215,220,225,230,235,240,245,250,255,260,265,270,275,280,285,290,295,300,305,310,315,320,325,330,335,340,345,350,355,360,365,370,375,380,385,390,395,400;HTDR:500;CTDR:50;TRSH:0.002;NEUTR;ENV;;Preheating:300"
31,33.02,49.11,99008.0,9284.0,9075.0,8874.0,8548.0,8478.0,8423.0,8513.0,8376.0,8576.0,8785.0,9004.0,9186.0,9662.0,10250.0,10756.0,11671.0,12643.0,13703.0,14745.0,16578.0,18761.0,21170.0,24174.0,28593.0,33507.0,39138.0,46266.0,55860.0,66771.0,80122.0,96264.0,115358.0,134646.0,157277.0,183662.0,208367.0,235145.0,260228.0,283527.0,310527.0,331800.0,"TEMP:200,205,210,215,220,225,230,235,240,245,250,255,260,265,270,275,280,285,290,295,300,305,310,315,320,325,330,335,340,345,350,355,360,365,370,375,380,385,390,395,400;HTDR:500;CTDR:50;TRSH:0.002;NEUTR;ENV;;Preheating:300"
32,32.99,49.42,99010.0,8874.0,8690.0,8485.0,8192.0,8116.0,8135.0,8179.0,8041.0,8264.0,8471.0,8690.0,8897.0,9309.0,9891.0,10372.0,11230.0,12187.0,13243.0,14272.0,16081.0,17926.0,20132.0,22709.0,26631.0,31073.0,36260.0,42598.0,51058.0,60941.0,72808.0,88318.0,103140.0,121553.0,140993.0,165187.0,187064.0,210632.0,234810.0,255981.0,283771.0,304779.0,"TEMP:200,205,210,215,220,225,230,235,240,245,250,255,260,265,270,275,280,285,290,295,300,305,310,315,320,325,330,335,340,345,350,355,360,365,370,375,380,385,390,395,400;HTDR:500;CTDR:50;TRSH:0.002;NEUTR;ENV;;Preheating:300"
33,33.06,49.74,99014.0,9342.0,9146.0,8912.0,8625.0,8541.0,8541.0,8590.0,8492.0,8682.0,8943.0,9170.0,9401.0,9835.0,10476.0,10936.0,11896.0,12908.0,14024.0,15085.0,16926.0,19000.0,21408.0,24201.0,28399.0,33215.0,38669.0,45365.0,54657.0,64959.0,77240.0,93756.0,108344.0,127280.0,147707.0,171619.0,194235.0,216731.0,240292.0,261260.0,288747.0,306196.0,"TEMP:200,205,210,215,220,225,230,235,240,245,250,255,260,265,270,275,280,285,290,295,300,305,310,315,320,325,330,335,340,345,350,355,360,365,370,375,380,385,390,395,400;HTDR:500;CTDR:50;TRSH:0.002;NEUTR;ENV;;Preheating:300"
34,32.95,49.36,99010.0,9653.0,9444.0,9211.0,8852.0,8785.0,8755.0,8814.0,8690.0,8874.0,9106.0,9351.0,9521.0,10014.0,10561.0,11087.0,12040.0,13021.0,14185.0,15216.0,17078.0,19156.0,21518.0,24314.0,28476.0,33400.0,38598.0,45611.0,54693.0,64758.0,76956.0,93027.0,108134.0,126894.0,145906.0,170224.0,192983.0,216304.0,238207.0,259000.0,283771.0,306196.0,"TEMP:200,205,210,215,220,225,230,235,240,245,250,255,260,265,270,275,280,285,290,295,300,305,310,315,320,325,330,335,340,345,350,355,360,365,370,375,380,385,390,395,400;HTDR:500;CTDR:50;TRSH:0.002;NEUTR;ENV;;Preheating:300"
35,32.88,46.81,99016.0,11643.0,11377.0,11087.0,10679.0,10603.0,10614.0,10712.0,10550.0,10790.0,11064.0,11340.0,11553.0,12103.0,12767.0,13311.0,14321.0,15441.0,16723.0,17957.0,20055.0,22417.0,25160.0,28170.0,32954.0,38527.0,44498.0,51945.0,62487.0,73641.0,87305.0,103715.0,121114.0,140520.0,162464.0,188025.0,213500.0,237691.0,260846.0,283771.0,311408.0,332806.0,"TEMP:200,205,210,215,220,225,230,235,240,245,250,255,260,265,270,275,280,285,290,295,300,305,310,315,320,325,330,335,340,345,350,355,360,365,370,375,380,385,390,395,400;HTDR:500;CTDR:50;TRSH:0.002;NEUTR;ENV;;Preheating:300"
36,32.53,47.39,99016.0,11540.0,11279.0,10959.0,10518.0,10424.0,10393.0,10476.0,10270.0,10486.0,10767.0,11040.0,11218.0,11802.0,12396.0,12932.0,13893.0,14987.0,16231.0,17361.0,19477.0,21833.0,24542.0,27415.0,32096.0,37661.0,43618.0,50749.0,60985.0,72493.0,86049.0,102010.0,120244.0,140756.0,162149.0,186852.0,212125.0,235145.0,259817.0,281347.0,307053.0,327511.0,"TEMP:200,205,210,215,220,225,230,235,240,245,250,255,260,265,270,275,280,285,290,295,300,305,310,315,320,325,330,335,340,345,350,355,360,365,370,375,380,385,390,395,400;HTDR:500;CTDR:50;TRSH:0.002;NEUTR;ENV;;Preheating:300"
37,32.68,48.07,99018.0,10043.0,9853.0,9591.0,9235.0,9178.0,9130.0,9162.0,8996.0,9219.0,9435.0,9725.0,9835.0,10351.0,10925.0,11477.0,12404.0,13421.0,14580.0,15684.0,17609.0,19734.0,22086.0,25070.0,29415.0,34386.0,40074.0,46990.0,56539.0,67471.0,80199.0,95279.0,112416.0,131373.0,152689.0,175945.0,199048.0,222741.0,245304.0,267195.0,291817.0,312293.0,"TEMP:200,205,210,215,220,225,230,235,240,245,250,255,260,265,270,275,280,285,290,295,300,305,310,315,320,325,330,335,340,345,350,355,360,365,370,375,380,385,390,395,400;HTDR:500;CTDR:50;TRSH:0.002;NEUTR;ENV;;Preheating:300"
38,32.67,45.63,99018.0,10403.0,10230.0,9985.0,9600.0,9504.0,9513.0,9539.0,9368.0,9582.0,9826.0,10053.0,10210.0,10712.0,11315.0,0.0,12720.0,13739.0,14913.0,16032.0,17834.0,20017.0,22417.0,25343.0,29728.0,34844.0,40382.0,47362.0,57078.0,67908.0,80818.0,95714.0,113099.0,132202.0,153108.0,178191.0,200624.0,223800.0,248075.0,269822.0,297618.0,315888.0,"TEMP:200,205,210,215,220,225,230,235,240,245,250,255,260,265,270,275,280,285,290,295,300,305,310,315,320,325,330,335,340,345,350,355,360,365,370,375,380,385,390,395,400;HTDR:500;CTDR:50;TRSH:0.002;NEUTR;ENV;;Preheating:300"
39,32.74,47.94,99026.0,11703.0,11427.0,11087.0,10668.0,10603.0,10593.0,10668.0,10507.0,10723.0,10994.0,11291.0,11515.0,12138.0,12751.0,13252.0,14341.0,15463.0,16737.0,17895.0,19922.0,22321.0,24774.0,28019.0,32595.0,37493.0,43392.0,50657.0,60024.0,70480.0,83393.0,98645.0,115597.0,134430.0,155093.0,178191.0,201483.0,225640.0,248262.0,270932.0,298969.0,318947.0,"TEMP:200,205,210,215,220,225,230,235,240,245,250,255,260,265,270,275,280,285,290,295,300,305,310,315,320,325,330,335,340,345,350,355,360,365,370,375,380,385,390,395,400;HTDR:500;CTDR:50;TRSH:0.002;NEUTR;ENV;;Preheating:300"
40,32.74,49.07,99030.0,9461.0,9251.0,9020.0,8682.0,8632.0,8625.0,8668.0,8541.0,8777.0,9012.0,9260.0,9435.0,9966.0,10561.0,11087.0,12089.0,13111.0,14234.0,15407.0,17289.0,19495.0,22086.0,24951.0,29477.0,34415.0,40305.0,47389.0,57117.0,67963.0,81289.0,96542.0,113559.0,132621.0,152273.0,177061.0,199409.0,222440.0,245486.0,266762.0,294426.0,314380.0,"TEMP:200,205,210,215,220,225,230,235,240,245,250,255,260,265,270,275,280,285,290,295,300,305,310,315,320,325,330,335,340,345,350,355,360,365,370,375,380,385,390,395,400;HTDR:500;CTDR:50;TRSH:0.002;NEUTR;ENV;;Preheating:300"
41,32.83,50.53,99034.0,9495.0,9293.0,9059.0,8719.0,8668.0,8661.0,8697.0,8597.0,8822.0,9059.0,9293.0,9452.0,9957.0,10507.0,11040.0,11883.0,12798.0,13949.0,14955.0,16657.0,18744.0,20833.0,23578.0,27613.0,31973.0,37627.0,44030.0,52863.0,62721.0,74426.0,89834.0,104426.0,122801.0,142553.0,165514.0,187490.0,211037.0,233976.0,255981.0,282070.0,303096.0,"TEMP:200,205,210,215,220,225,230,235,240,245,250,255,260,265,270,275,280,285,290,295,300,305,310,315,320,325,330,335,340,345,350,355,360,365,370,375,380,385,390,395,400;HTDR:500;CTDR:50;TRSH:0.002;NEUTR;ENV;;Preheating:300"
42,32.9,50.7,99042.0,8852.0,8647.0,8430.0,8116.0,8078.0,8060.0,8116.0,8041.0,8231.0,8437.0,8675.0,8874.0,9334.0,9881.0,10413.0,11242.0,12230.0,13353.0,14360.0,16143.0,18112.0,20407.0,23059.0,27166.0,31876.0,37160.0,43437.0,52302.0,62440.0,74162.0,89354.0,104037.0,122981.0,141829.0,164538.0,186323.0,209827.0,232489.0,253811.0,280150.0,297350.0,"TEMP:200,205,210,215,220,225,230,235,240,245,250,255,260,265,270,275,280,285,290,295,300,305,310,315,320,325,330,335,340,345,350,355,360,365,370,375,380,385,390,395,400;HTDR:500;CTDR:50;TRSH:0.002;NEUTR;ENV;;Preheating:300"
43,32.85,49.69,99046.0,9146.0,8981.0,8755.0,8410.0,8376.0,8363.0,8451.0,8316.0,8534.0,8770.0,9028.0,9243.0,9725.0,10321.0,10801.0,11723.0,12759.0,13848.0,14955.0,16831.0,18863.0,21256.0,24201.0,28322.0,33241.0,38884.0,45562.0,54872.0,65569.0,77742.0,93338.0,109908.0,127668.0,148361.0,172325.0,195736.0,219915.0,244757.0,267412.0,293377.0,312590.0,"TEMP:200,205,210,215,220,225,230,235,240,245,250,255,260,265,270,275,280,285,290,295,300,305,310,315,320,325,330,335,340,345,350,355,360,365,370,375,380,385,390,395,400;HTDR:500;CTDR:50;TRSH:0.002;NEUTR;ENV;;Preheating:300"
44,32.86,48.99,99049.0,8943.0,8733.0,8520.0,8212.0,8154.0,8116.0,8167.0,8053.0,8244.0,8485.0,8697.0,8829.0,9334.0,9900.0,10393.0,11218.0,12173.0,13302.0,14390.0,16205.0,18175.0,20588.0,23161.0,27397.0,32047.0,37259.0,44030.0,52897.0,63290.0,75364.0,91104.0,106484.0,123982.0,144397.0,167836.0,189540.0,214333.0,236836.0,258391.0,282070.0,302818.0,"TEMP:200,205,210,215,220,225,230,235,240,245,250,255,260,265,270,275,280,285,290,295,300,305,310,315,320,325,330,335,340,345,350,355,360,365,370,375,380,385,390,395,400;HTDR:500;CTDR:50;TRSH:0.002;NEUTR;ENV;;Preheating:300"
45,32.96,48.51,99051.0,9090.0,8889.0,8726.0,8417.0,8343.0,8336.0,8396.0,8283.0,8485.0,8697.0,8912.0,9122.0,9574.0,10180.0,10647.0,11515.0,12552.0,13694.0,14797.0,16670.0,18880.0,21430.0,24370.0,28769.0,33886.0,39544.0,46964.0,56425.0,66985.0,79665.0,94419.0,111148.0,130350.0,150090.0,173575.0,196671.0,220356.0,245304.0,264619.0,287989.0,309942.0,"TEMP:200,205,210,215,220,225,230,235,240,245,250,255,260,265,270,275,280,285,290,295,300,305,310,315,320,325,330,335,340,345,350,355,360,365,370,375,380,385,390,395,400;HTDR:500;CTDR:50;TRSH:0.002;NEUTR;ENV;;Preheating:300"
46,32.87,46.74,99047.0,11291.0,11029.0,10790.0,10424.0,10382.0,10372.0,10465.0,10290.0,10571.0,10834.0,11194.0,11402.0,11999.0,12659.0,13243.0,14224.0,15361.0,16564.0,17865.0,20055.0,22465.0,25175.0,28399.0,33215.0,38456.0,44640.0,52499.0,62580.0,74228.0,87855.0,104167.0,121641.0,140402.0,161992.0,185379.0,211579.0,235313.0,258797.0,279912.0,305628.0,326213.0,"TEMP:200,205,210,215,220,225,230,235,240,245,250,255,260,265,270,275,280,285,290,295,300,305,310,315,320,325,330,335,340,345,350,355,360,365,370,375,380,385,390,395,400;HTDR:500;CTDR:50;TRSH:0.002;NEUTR;ENV;;Preheating:300"
47,32.7,48.56,99044.0,10210.0,10004.0,9743.0,9368.0,9309.0,9309.0,9359.0,9203.0,9435.0,9680.0,9900.0,10072.0,10571.0,11182.0,11717.0,12605.0,13578.0,14786.0,15886.0,17774.0,19922.0,22441.0,25404.0,29665.0,34699.0,40382.0,47632.0,57078.0,68352.0,81526.0,97271.0,115199.0,134646.0,156250.0,180886.0,205763.0,229253.0,253225.0,274774.0,301156.0,322697.0,"TEMP:200,205,210,215,220,225,230,235,240,245,250,255,260,265,270,275,280,285,290,295,300,305,310,315,320,325,330,335,340,345,350,355,360,365,370,375,380,385,390,395,400;HTDR:500;CTDR:50;TRSH:0.002;NEUTR;ENV;;Preheating:300"
48,32.67,45.68,99044.0,11999.0,11723.0,11414.0,10936.0,10801.0,10812.0,10846.0,10668.0,10914.0,11206.0,11477.0,11697.0,12266.0,12916.0,13534.0,14500.0,15625.0,16995.0,18238.0,20447.0,22858.0,25512.0,28908.0,33831.0,38884.0,45218.0,52763.0,62957.0,74426.0,88225.0,104492.0,122352.0,142311.0,162938.0,187704.0,214055.0,236666.0,259613.0,280389.0,306481.0,325890.0,"TEMP:200,205,210,215,220,225,230,235,240,245,250,255,260,265,270,275,280,285,290,295,300,305,310,315,320,325,330,335,340,345,350,355,360,365,370,375,380,385,390,395,400;HTDR:500;CTDR:50;TRSH:0.002;NEUTR;ENV;;Preheating:300"
49,32.79,47.16,99051.0,11146.0,10914.0,10603.0,10200.0,10150.0,10150.0,10210.0,10043.0,10270.0,10571.0,10846.0,11087.0,11671.0,12294.0,12908.0,13866.0,14955.0,16231.0,17419.0,19531.0,21855.0,24862.0,27945.0,32595.0,38072.0,44451.0,51657.0,61932.0,73770.0,88411.0,106417.0,126320.0,146930.0,168004.0,194925.0,219183.0,244212.0,268502.0,289254.0,310527.0,333818.0,"TEMP:200,205,210,215,220,225,230,235,240,245,250,255,260,265,270,275,280,285,290,295,300,305,310,315,320,325,330,335,340,345,350,355,360,365,370,375,380,385,390,395,400;HTDR:500;CTDR:50;TRSH:0.002;NEUTR;ENV;;Preheating:300"
50,32.84,49.78,99051.0,8192.0,8035.0,7801.0,7542.0,7488.0,7488.0,7509.0,7408.0,7591.0,7795.0,8004.0,8179.0,8583.0,9075.0,9565.0,10280.0,11255.0,12280.0,13243.0,14902.0,16737.0,18880.0,21365.0,25160.0,29644.0,34642.0,40934.0,49636.0,59512.0,71139.0,86494.0,101886.0,119557.0,139816.0,162938.0,185588.0,209427.0,232489.0,254399.0,280867.0,302540.0,"TEMP:200,205,210,215,220,225,230,235,240,245,250,255,260,265,270,275,280,285,290,295,300,305,310,315,320,325,330,335,340,345,350,355,360,365,370,375,380,385,390,395,400;HTDR:500;CTDR:50;TRSH:0.002;NEUTR;ENV;;Preheating:300"
