series,200,205,210,215,220,225,230,235,240,245,250,255,260,265,270,275,280,285,290,295,300,305,310,315,320,325,330,335,340,345,350,355,360,365,370,375,380,385,390,395,400
1,-0.7587012153972592,-0.7491524633899135,-0.7469487889671497,-0.7367105028153523,-0.7317649296120028,-0.7244593461860855,-0.7198422972813935,-0.7174164920497966,-0.7031632187720244,-0.7035813145076497,-0.6942932669880267,-0.682865221181973,-0.67999698560627,-0.6690131323965497,-0.6629956554086947,-0.6519986629701724,-0.6470674144175721,-0.633828100156944,-0.6260456061727518,-0.6169350388763482,-0.5994579663313702,-0.5963563077786913,-0.5850237158139066,-0.5757932638935815,-0.5687886168922159,-0.5517478111216649,-0.543471092058003,-0.5287275822022854,-0.5225653798256538,-0.5126372079932452,-0.5028100270818717,-0.49631893516898623,-0.48259327285728304,-0.4780927751737514,-0.47150226152360625,-0.46375226604059555,-0.47541622150997154,-0.4641813503140265,-0.44714332626179965,-0.4387824579864442,-0.4430686522953823
2,-0.7954704903683609,-0.785873224833114,-0.7845331338916605,-0.7757212284148485,-0.7700341805916295,-0.7628276054763901,-0.7601388725432505,-0.7565388882041169,-0.7460511587413458,-0.7455314035577109,-0.7385943088166692,-0.7305482901073114,-0.7273648337478125,-0.7182618727861051,-0.7120353445821201,-0.7011050158280737,-0.6985629162285314,-0.6856401366336025,-0.680939296541515,-0.673338349636318,-0.6555584510345547,-1.0,-0.6421737814108386,-0.6330665791429757,-0.6184909670563231,-0.61063827786294,-0.6017147797256709,-0.582636678752848,-0.5795848899958489,-0.5706244220176109,-0.5598780938586764,-0.550438800065695,-0.5408353546541789,-0.5370098593825764,-0.519801036743406,-0.517418051056495,-0.511039886039886,-0.5033474354501046,-0.4990904304948162,-0.4849432081953514,-0.48413885295800657
3,-0.7721614560713068,-0.7632877818811623,-0.7609083362783855,-0.7527942019721566,-0.7480895401384239,-0.739815590947192,-0.7375956219842297,-0.732515715518304,-0.7223650207979216,-0.72212089350471,-0.7142512828487017,-0.7046371214158254,-0.7026049385817278,-0.693285983397478,-0.6846451304755169,-0.6779134469808686,-0.6734236865677454,-0.6597187317283331,-0.6552566741358857,-0.6463506395786306,-0.6300932923333507,-0.6269376541600657,-0.6181249369260269,-0.6076396598160072,-0.5963999887146981,-0.5867322468095512,-0.5804048092262992,-0.564915204652441,-0.5578248235782483,-0.5530859233645611,-0.5401664139528217,-0.5337365485822009,-0.5276348442998752,-0.5253208340067884,-0.5105897748640544,-0.5064935064935064,-0.502754407051282,-0.4951696615491975,-0.49244457880937614,-0.4768964129862895,-0.481503743490366
4,-0.7578726873041433,-0.7476068983460901,-0.7460241795632556,-0.7353004765888645,-0.7315947773257065,-0.7252640402347025,-0.7226550547251971,-0.7189449032417108,-0.706445282810276,-0.7058844566515746,-0.6990592442854922,-0.6888867160445542,-0.6851298282632905,-0.6771611670437235,-0.6681852835006568,-0.6577400263473525,-0.6562195739377653,-0.6405161713869542,-0.6355967432853072,-0.6296563832455481,-0.6125084692760724,-0.6143642087953958,-0.6013321223130488,-0.5935650780473207,-0.5815127947109552,-0.5752494521926401,-0.5686134704681777,-0.5532220459038484,-0.5504441677044417,-0.545912910618793,-0.5354666908064967,-0.5308373976192686,-0.5222929489785904,-0.5207370292548893,-0.5056283986380038,-0.5000980712651193,-0.49850316061253563,-0.48671929518492674,-0.48228554748786806,-0.4750033528313371,-0.4730838955381057
5,-0.7064337879101715,-0.6961100690844274,-0.6959062404970701,-0.6838063187975296,-0.6791878731464661,-0.6723889354568315,-0.669924679298576,-0.66628250955257,-0.6523983251108992,-0.6527977454956405,-0.6461981029388898,-0.6335525190055978,-0.629731970157502,-0.6212606019090197,-0.6117239668966024,-0.6011816984211251,-0.5988627954979164,-0.5814621436704381,-0.5769008486519919,-0.5698720842738901,-0.5521967999166102,-0.5519281288226683,-0.5509234029669997,-0.5440047880607388,-0.5327414819482192,-0.5266098012846435,-0.5235069206156808,-0.5098979618975009,-0.5074553756745538,-0.5073298218809055,-0.49811030393554667,-0.49378396326790014,-0.4884118727479214,-0.4912364635526103,-0.47970981348782843,-0.4777140479657642,-0.47258947649572647,-0.4808149424284717,-0.4672320418662594,-0.4559695872406714,-0.45613360197344693
6,-0.7070418206236678,-0.6977915506522051,-0.6964363498886359,-0.6845630328724114,-0.6791878731464661,-0.6730706901369098,-0.669924679298576,-0.664994453346481,-0.6528129016209941,-0.652998018725547,-0.6465790701290623,-0.6327702950451001,-0.6312810336021167,-0.620512496958007,-0.6132762627329592,-0.6034723451109931,-0.6027378587841259,-0.5854729348528521,-0.5806320784369392,-0.5741961374467017,-0.5562620524313338,-0.5575530912226523,-0.5518619436875568,-0.5465436186541301,-0.5360236238985076,-0.5305314436722373,-0.5276958315879537,-0.5159174120796801,-0.516961394769614,-0.5133368179807808,-0.5028100270818717,-0.49799701515984607,-0.49625646705831217,-0.4987166639728463,-0.48766961427046807,-0.48202918363101427,-0.48075253739316237,-0.4840151779483601,-0.4736120594842819,-0.4650015990426377,-0.46225975062631935
7,-0.7465539244836733,-0.7362287436264858,-0.7341439760669992,-0.72502608548519,-0.7207700892298607,-0.7139312657166806,-0.7123749558667765,-0.705916430420313,-0.6963641640064674,-0.6927236444005751,-0.6899626807650443,-0.6796141028461544,-0.6738007318278111,-0.6681478543809206,-1.0,-0.652873631019092,-0.6497741169139697,-0.6347513001733565,-0.6311963255497988,-0.624068221720592,-0.6080262677854797,-0.6042773778250146,-0.6020789181552124,-0.5947717465803014,-0.5815127947109552,-0.5761522763394242,-0.5698434060302493,-0.5569276868112871,-0.5550103777501038,-0.5516143299425034,-0.5421504062280761,-0.5344577659399747,-0.5291350616210759,-0.5286051398092775,-0.5137025461198353,-0.5093880947427858,-0.502754407051282,-0.496827023726448,-0.48830590724997264,-0.4828025543416587,-0.48017176297478853
8,-0.6135952105730875,-0.6045178652562415,-0.6023768625742769,-0.5869939180868764,-0.5811801562398347,-0.5749203688181056,-0.5742615040602566,-0.5688955996548749,-0.5536669292317897,-0.5500289680921829,-0.5482662105426839,-0.5317411816470703,-0.5306254029658285,-0.5162825493253536,-0.5089325899458993,-0.4991545252561002,-0.49730303384351754,-0.47867920850985257,-0.47746560272542,-0.4693453724604966,-0.45548548496377755,-0.4577576353099244,-0.4580583308103744,-0.45489473023718274,-0.44362521512606623,-0.44284464841582577,-0.4401475922674486,-0.432558222001578,-0.434719800747198,-0.43561577741144303,-0.42976441034693463,-0.43009547204033105,-0.4269520351078895,-0.4330693389364797,-0.4212913553895411,-0.4320485006983863,-0.43738871082621084,-0.4310450104675506,-0.4155507717006604,-0.4193154034229829,-0.4170637763811484
9,-0.7067378042669197,-0.6966692684972681,-0.6953720217303757,-0.6843092281516436,-0.6791878731464661,-0.6726124615814474,-0.6705837354360362,-0.6654258597312954,-0.6515691720907093,-0.649164216895908,-0.6435080080858342,-0.633161407025349,-0.6273958150167047,-0.6189892471179933,-1.0,-0.6027153502821526,-0.5996417026911244,-0.5838727214910706,-0.5789793869832804,-0.5720491597692501,-0.5549173919841559,-0.5561593839613371,-0.5542133414068019,-0.5475475668735701,-0.5381772356653156,-0.5354781676431588,-0.5341396244240247,-0.5190379517912075,-0.521909506019095,-0.5168027019420208,-0.5112137053884627,-0.5094436629272856,-0.5046899317190808,-0.5077614352674964,-0.49633455303145807,-0.49147968736069425,-0.48978365384615385,-0.48671929518492674,-0.4828954021131202,-0.47149577543251525,-0.4751275479537029
10,-0.7534260304818158,-0.7436575524929032,-0.741672351302261,-0.7309951965106551,-0.7261999489543141,-0.7207096954456552,-0.7161586442273744,-0.7133674349808948,-0.7007241269709659,-0.6994471028331509,-0.6945809360908102,-0.6851793003984453,-0.6834384184480896,-0.6710231011203548,-0.6647500252592518,-0.6543188029650603,-0.6527339642481599,-0.6365874424282212,-0.6343496202865341,-0.6280311010785051,-0.6111429613801012,-0.6104638337979024,-0.6050257341810475,-0.5987585794132695,-0.5884532553393584,-0.5797353596719739,-0.5785242555770448,-0.5646581147330254,-0.5614196762141968,-0.5565920147963491,-0.5527719314127081,-0.5446619204375861,-0.5394052409461184,-0.5424406012607079,-0.524063627585506,-0.5260839846652203,-0.5224748486467237,-0.5117814462665736,-0.5077795557964858,-0.49539372556301775,-0.49442443535085906
11,-0.6507019102917889,-0.6360194321795962,-0.6343313635728551,-0.6231046897472293,-0.6196595953378273,-0.6113607152835988,-0.6085030010591974,-0.6043202267964994,-0.5917941489435209,-0.591728715604861,-0.5874747317679988,-0.5714390476423281,-0.5713532115853199,-0.5639809999369068,-0.5531041324135904,-0.543276509565662,-0.5426451688281341,-0.5276088093797122,-0.5247751629878228,-0.5196388261851016,-0.5053942773753062,-0.5041610684420559,-0.5023917650620648,-0.49975383961927194,-0.4868103034805752,-0.4881363264461644,-0.4850045899769164,-0.4759000363471955,-0.47770859277708594,-0.47654698242933535,-0.4696705667579454,-0.46596353924921985,-0.4643172609116274,-0.46946177468886374,-0.4575964323829852,-0.4579571458289994,-0.46768718839031337,-0.4600924633635729,-0.44852983335852675,-0.4387824579864442,-0.4430686522953823
12,-0.7370993498727141,-0.7279067690312259,-0.7255142882973216,-0.7143286865135692,-0.7104308355978601,-0.7034981838502375,-0.698764269742262,-0.6968260815974362,-0.6835261114105274,-0.6840475219764107,-0.6765199813403825,-0.6649474035868228,-0.6606462525224615,-0.6546008454487278,-0.6473716600380267,-0.6377239033406084,-0.6345172722670094,-0.6220008821689046,-0.616676974864895,-0.6102332580887886,-0.5942982227549903,-0.5928569996189865,-0.589817337773741,-0.5852921585852052,-0.5734155906444848,-0.5659578870153198,-0.5671161576100034,-0.5526901357257471,-0.5527438771274388,-0.548928470909895,-0.5414941046009007,-0.5376782513692419,-0.5324860143291785,-0.5354323581703572,-0.519801036743406,-0.5169544414395673,-0.5150796830484331,-0.5086520847871598,-0.5041725523719175,-0.4942228136960581,-0.49189030635551856
13,-0.7366082465271978,-0.7260854876102381,-0.7242075070064846,-0.7132946672808115,-0.708429043994375,-0.7021849678681196,-0.700759091444039,-0.6959447799827437,-0.6824896701352902,-0.6827171355206031,-0.6749183641735345,-0.6639696236362007,-0.6583519639612483,-0.6511217067608859,-0.6425035133322924,-0.6326018993688433,-0.6312458620555361,-0.6173335931970416,-0.6132093645756234,-0.606611487333835,-0.5912753426799395,-0.5885054244289811,-0.5858310626702997,-0.5788630286414843,-0.5701898752033705,-0.5650080407775573,-0.5620805518667391,-0.5497203038980151,-0.5492901618929016,-0.548928470909895,-0.539834491290802,-0.5355360215936762,-0.5317429160298922,-0.5330402456764183,-0.519801036743406,-0.5178816606734227,-0.5150796830484331,-0.5086520847871598,-0.504730282670225,-0.5006035096406797,-0.497554829992162
14,-0.7913846441672291,-0.7821724120523007,-0.7800210400006575,-0.7713219465882065,-0.7672466857837765,-0.7613914501257334,-0.7570907379074968,-0.7537778873413041,-0.7433702306427318,-0.7429350041842799,-0.7371248639402892,-0.7262542064908293,-0.7220142848769541,-0.7157381452405203,-0.7098860118856261,-0.6984997738846616,-0.6979008451143046,-0.6833423943705315,-0.6790331248035528,-0.6708001003260597,-0.6574347214259655,-0.657980227404897,-0.6503885356746392,-0.643347395043971,-0.6319298806579331,-0.6277919366518391,-0.6232475646384613,-0.603833299350183,-0.6065089248650892,-0.6004583651642476,-0.5904677846425419,-0.5831006633771538,-0.576651290607518,-0.5765443672215936,-0.5621601361996239,-0.5562721031828584,-0.5499410167378918,-0.5419247208653175,-0.5282122919587801,-0.5175997854187945,-0.5246320223503446
15,-0.7708652105062708,-0.7605189681217501,-0.7592481487265047,-0.749673343924197,-0.7456623678191981,-0.7372115115954178,-0.7330822643285866,-0.7314125477628497,-0.7202368613794342,-0.718759164288422,-0.712999533509563,-0.7020785972116975,-0.6975139625042913,-0.6882655682442969,-0.6817977239117855,-0.6723293812304607,-0.6705417299528761,-0.655933611661042,-0.6521743538787553,-0.645758715826436,-0.6291551571376452,-0.6301963222170974,-0.6248460995055001,-0.6172254346420056,-0.6071774519669341,-0.6012620729218587,-0.5957255282929742,-0.5807661279598585,-0.5820921544209215,-0.5794057335853001,-0.569405782998016,-0.5634706978670532,-0.5576602218078319,-0.5576531436883788,-0.5427402551201911,-0.5425124075009659,-0.5402477297008547,-0.5349790648988136,-0.515744152953625,-0.5145306551948253,-0.5155533970311741
16,-0.7094572472822274,-0.6986225831129544,-0.6964363498886359,-0.6868049745725271,-0.6820854664925108,-0.6739703827884884,-0.6708014593385901,-0.6664982127449772,-0.6530201898760416,-0.6519966525760145,-0.6450474265277562,-0.6311976989578495,-0.629731970157502,-0.6197463653816687,-1.0,-0.5977113195304666,-0.5976846983681894,-0.582272508129289,-0.5785636793170227,-0.570744920993228,-0.5531036639391255,-0.556620610824794,-0.554677565849228,-0.5505401048353622,-0.5403214430139279,-0.5387132875024686,-0.5392732685091933,-0.5275396494711926,-0.5289829804898298,-0.5272405612962888,-0.522219959113163,-0.5180768489228155,-0.5152475358579981,-0.5164894132859221,-0.5074452406362758,-0.5055187375553508,-0.5058927617521367,-0.496827023726448,-0.4956450124837763,-0.49215437467116463,-0.4928424079514909
17,-0.7877698562771026,-0.778339566076789,-0.7766225867694558,-0.7670260666848403,-0.7628077129030483,-0.7554568315171836,-0.7522478521831234,-0.7495069641316405,-0.7390033580697317,-0.7357394731383531,-0.7324133105271342,-0.7218297522142642,-0.7168898155358504,-0.7101048248262684,-0.7027674954762977,-0.6945083466053206,-0.69155275148966,-0.6764901986931591,-0.6731523822077119,-0.6656132430398796,-0.6506384531192996,-0.6506407042733672,-0.6433646180240186,-0.6369954918863607,-0.6260427148674447,-0.6184909670563231,-0.6151549451430914,-0.60045566971924,-0.5997592361975924,-0.5932773109243697,-0.5859340228272267,-0.5787305146349998,-0.5729848716402843,-0.5712170680459027,-0.5567286679880064,-0.5539065053939196,-0.5469028222934473,-0.5377813154221912,-0.526690261611997,-0.5110952926248027,-0.5187126432359913
18,-0.7085585615683235,-0.6977915506522051,-0.6964363498886359,-0.6848121375057576,-0.6806441765380015,-0.6721598211791003,-0.6703660115334824,-0.6639097744360902,-0.6505258212069704,-0.650587587351315,-0.6427305240242575,-0.6292095463915846,-0.6250261666122401,-0.6166908523889785,-0.6070027831102864,-0.5977113195304666,-0.5972952447715855,-0.5782001702791142,-0.5739503381426992,-0.5681163782292451,-0.5540105279616407,-0.553823169631219,-0.5532748006862448,-0.54855151509301,-0.5376411838281625,-0.5373684557004881,-0.5352893467972656,-0.523018412957332,-0.5267579908675799,-0.5255920550038197,-0.5178747897194499,-0.5141922722631229,-0.51204380073749,-0.518196217876192,-0.5047136250444682,-0.5035632559660019,-0.5011685363247863,-0.49901866713189114,-0.497083643907448,-0.48585620995945655,-0.48674991945605184
19,-0.7124239123898358,-0.701643813273996,-0.70011424062857,-0.6882808020229176,-0.6825658964773472,-0.6764347583123778,-0.6708014593385901,-0.669672131147541,-0.6536351450326825,-0.652597472265734,-0.6465790701290623,-0.6323791830648513,-0.6289616250931531,-0.6212606019090197,-0.6140386328774421,-0.6019485243516388,-0.5996417026911244,-0.5826725614697345,-0.5814533545580824,-0.5750489089541009,-0.556710272580393,-0.5612228527884172,-0.5574528206680796,-0.5544690175787472,-0.5461051602042639,-0.5450612697845448,-0.5442999616759209,-0.5325573354846145,-0.5361560813615608,-0.5359736238993205,-0.528239829210703,-0.5275240822330604,-0.5242137879786324,-0.5281978341684177,-0.5163325202012502,-0.5141430651728135,-0.5130653490028491,-0.5102222173761339,-0.5058457432668401,-0.49888067015361126,-0.4994157558388352
20,-0.7115385900322725,-0.7000050483280326,-0.6988115687128615,-0.6858085560391424,-0.6813648215152561,-0.6744230231908355,-0.6688242909262092,-0.6658511031677554,-0.6532274781310891,-0.6497793418163351,-0.6450474265277562,-0.6303991786648415,-0.629731970157502,-0.6159157074999775,-0.609767523031845,-0.5973180754635364,-0.5972952447715855,-0.5810620903299927,-0.5773165563182495,-0.570744920993228,-0.5562620524313338,-0.5575530912226523,-0.5565243717832273,-0.5534940294040989,-0.5450612697845448,-0.5453245934940235,-0.5420807301182698,-0.5343037739027137,-0.5367704441677045,-0.5347030678300028,-0.5299824231863067,-0.5264101227497662,-0.5238282181063612,-0.5294197510909973,-0.519801036743406,-0.519730155428096,-0.5205272881054132,-0.5138476971388695,-0.5042820134585012,-0.5034508371761939,-0.5055130529281933
21,-0.7759633309502014,-0.7649847967659634,-0.7631972582249144,-0.7530997076545624,-0.7486900776194694,-0.7418105616093881,-0.7364834647522656,-0.7344262295081967,-0.7228970606525434,-0.723143717500304,-0.7157285025656974,-0.704889714569736,-0.699573798219833,-0.6925468917591282,-0.6866842409824471,-0.6756522935960204,-0.6734236865677454,-0.6605188384092238,-0.6549727762174659,-0.6475244544770504,-0.6359097305467244,-0.6340365371889225,-0.6303764254717933,-0.6242820322228765,-0.6140426772497719,-0.6102621011351133,-0.6083457366690136,-0.5943918936888858,-0.595134910751349,-0.5898275099513489,-0.5837689818272342,-0.579316057440321,-0.5739102393337353,-0.5725618231776305,-0.5607308024597245,-0.5593925525275639,-0.5563234508547008,-0.5491102581995813,-0.538605882751539,-0.5244498777506112,-0.5333788546891004
22,-0.7147491363930965,-0.7024554290884661,-0.7011456937858029,-0.6892584202066159,-0.6849330150484684,-0.6766582844369936,-0.672966929504531,-0.66883397017133,-0.6558876774041983,-0.6531982919554535,-0.648095164049137,-0.6358747463883253,-0.6308958610699423,-0.6212606019090197,-0.6140386328774421,-0.6027153502821526,-0.601968687930833,-0.5854729348528521,-0.5838867652873959,-0.5750489089541009,-0.5606921352999427,-0.5630276535584655,-0.5610959733575538,-0.5583303568842853,-0.548174132207311,-0.5507321339565328,-0.5486760367554656,-0.5394633026302958,-0.5419178082191781,-0.5416187527642636,-0.5341088253709613,-0.5308373976192686,-0.5306282685809627,-0.5370098593825764,-0.5270048787924989,-0.5224702071383993,-0.5219907407407407,-0.5184272505233776,-0.5070602400846499,-0.5090526446101946,-0.5108794437418555
23,-0.7779043584586705,-0.7686390095957066,-0.7660697114396785,-0.7555343529389646,-0.7525185040611347,-0.744325230511316,-0.7400670824997058,-0.7373782817699988,-0.7257576385721985,-0.723143717500304,-0.7200979629917587,-0.709134909188687,-0.7055774657322046,-0.6964676827674475,-0.6909277952806533,-0.6798993295188659,-0.6802780698679752,-0.664980971821884,-0.6615227067638679,-0.6563832455480311,-0.6394850680148016,-0.640553873302986,-0.6369865778585124,-0.6317440704308289,-0.622487844789482,-0.6170238778177988,-0.6131763531519326,-0.6013067260042021,-0.601129099211291,-0.5980941658960235,-0.589675696471813,-0.5842503266900407,-0.5793643004360445,-0.578833037013092,-0.5674645525232505,-0.5651222918957473,-0.5612980769230769,-0.553482641311933,-0.539575395232709,-0.5280606191905749,-0.534451171133049
24,-0.7118359247108503,-0.6994536155737037,-0.6969705686553302,-0.6868049745725271,-0.6816050365076743,-0.6744230231908355,-0.6679357420265977,-0.6664982127449772,-0.6526056133659467,-0.6499796150462417,-0.6450474265277562,-0.6327702950451001,-0.6273958150167047,-0.6186106879861556,-0.6105574487237189,-0.6011816984211251,-0.5988627954979164,-0.5846728281719614,-0.5814533545580824,-0.5733433659393027,-0.5615677281492677,-0.5634788537509776,-0.5637904934907659,-0.5588130242974776,-0.5512399725390988,-0.5507321339565328,-0.5478560797140846,-0.5400306734869371,-0.5425155666251557,-0.5416187527642636,-0.5388387233047427,-0.5355360215936762,-0.5321144651795353,-0.540132535962502,-0.5261663363317579,-0.5287527118190734,-0.5296530003561254,-0.5258690247732031,-0.5130649625486711,-0.515990426376982,-0.515264881396031
25,-0.7144618242317741,-0.7024554290884661,-0.7011456937858029,-0.6902266382154708,-0.6844625940216493,-0.6762112321877619,-0.6723196422266683,-0.6675644028103045,-0.6550723436010115,-0.6535988384152666,-0.6473332296687918,-0.6343265947998403,-0.6285680792450619,-0.6220177201726951,-0.612495522223549,-0.6023319373168957,-0.5992522490945204,-0.5838727214910706,-0.5806320784369392,-0.5767444193629295,-0.5611299317246052,-0.5639300539434897,-0.5619941467352911,-0.5602417198405267,-0.5535158417424506,-0.5532619224511676,-0.5519023894617695,-0.5425661120025531,-0.5501535907015359,-0.5477222467934543,-0.5428067078552515,-0.5425910983212059,-0.5379611065154298,-0.5454921609827057,-0.5356062916094934,-0.5331391720407739,-0.5366141381766382,-0.5307102669225401,-0.5189237368972474,-0.5143655927289984,-0.5218334206894562
26,-0.682743897957411,-0.6680957318328149,-0.6669926770935212,-0.6558172982017465,-0.651377983295049,-0.6414976250349259,-0.6387018947863952,-0.6356526562307407,-0.6214778270663184,-0.6202461930204779,-0.6168636292955995,-0.6042435649857,-0.5990856339018815,-0.5876139057387761,-0.5806596798045394,-0.571550757977939,-0.5703645285664213,-0.5557048632125309,-0.552120616058483,-0.548803611738149,-0.5312138427059988,-0.5316140934886799,-0.5342315067110708,-0.5362145360118157,-0.5280204640139938,-0.5282931921416681,-0.5271076015365282,-0.518417389916756,-0.5248318804483189,-0.526910860037795,-0.5229366103152511,-0.5180768489228155,-0.5160397066864826,-0.5207370292548893,-0.5137025461198353,-0.5127284614698803,-0.5150796830484331,-0.5096988398464759,-0.5080558147292923,-0.5020323316104939,-0.5000312558604738
27,-0.8258053092614741,-0.8169709255138615,-0.8145973223311663,-0.8067324052227371,-0.8019327297931649,-0.7965632858340318,-0.7925738495939744,-0.7902810304449649,-0.779445296629493,-0.7770815898833409,-0.7738765355310216,-0.7654468861782656,-0.7596188466594657,-0.7545945361298638,-0.7473064452425348,-0.7400361784541576,-0.7369435681738521,-0.7246094351041678,-0.7205126385269753,-0.7143115124153498,-0.7007557200187627,-0.7005534722361482,-0.6936219598344939,-0.6881003175951579,-0.6768547863786407,-0.6725945849360029,-0.6689779948485307,-0.6530349908245494,-0.6521793275217933,-0.6444051304732419,-0.6371557245343653,-0.6317649831120886,-0.6242516439297281,-0.622285437207047,-0.6102365706154393,-0.6033047044488692,-0.5994702635327636,-0.5908223569434752,-0.5763855949210056,-0.5674589665026358,-0.5590904063742721
28,-0.7927644107093937,-0.7830383944763525,-0.7811346806604588,-0.7701328244705351,-0.7669914573543322,-0.760905280804694,-0.7556549370366011,-0.7535436953038334,-0.7429141964816274,-0.7400596528120508,-0.7352200279894262,-0.7275579130916587,-0.7222319910907918,-0.716161770935672,-0.7076999384592775,-0.6989421734599579,-0.6961093585699264,-0.6817216654528296,-0.679266326665112,-0.672836719337848,-0.6595611612028978,-0.6599053482262819,-0.654919769906146,-0.6506742863762296,-0.6376383625027038,-0.6329549622412609,-0.6291833406119375,-0.6175920426237356,-0.6193275217932752,-0.6145309798560572,-0.6052006246181003,-0.601573824808449,-0.5918427435750039,-0.5944852109261355,-0.5832698073893378,-0.5793455971945675,-0.5767227564102564,-0.5685624563852059,-0.555848610104822,-0.5438859831017301,-0.5432076206596429
29,-0.7582902921897864,-0.7472185654205064,-0.7454653045457907,-0.7342382568315771,-0.7297080887394218,-0.7230064263760827,-0.7193656584676945,-0.7152532971773696,-0.7025551732238852,-0.7006415895972362,-0.6962758513450474,-0.6857578202025634,-0.6811525032027933,-0.6729970165935086,-0.6653286917544617,-0.6548890068621089,-0.6521497838532538,-0.639018535804774,-0.635282427732771,-0.6306195134186104,-0.6155521967999166,-0.6154170092445906,-0.6115046927036027,-0.6076396598160072,-0.5963999887146981,-0.5926664346910179,-0.589112396502705,-0.5802962739692024,-0.5825902864259028,-0.5817377668770858,-0.5737358649980009,-0.5678479873751259,-0.5683089606438316,-0.5678163892031679,-0.5552612186817096,-0.5539065053939196,-0.5516604344729344,-0.5441926901605024,-0.5332214397781588,-0.5234079209350788,-0.5306812335005121
30,-0.8189799750105237,-0.8110604983864766,-0.8078209627444051,-0.7997151747022495,-0.7954118936448121,-0.7891086895780944,-0.7852241967753325,-0.7832984099593245,-0.7731022760250404,-0.7706513886802709,-0.7658140258124708,-0.7571683492629984,-0.7532467532467533,-0.747086446681749,-0.7407206694160979,-0.732839812029336,-0.7296802585971881,-0.7177982705386359,-0.714743427256228,-0.7084123401053424,-0.6940949601292542,-0.6933944291816231,-0.6875567665758402,-0.6817677211340754,-0.6712403487158267,-0.6659832789444481,-0.6612240532615574,-0.6464836304642689,-0.6455043586550436,-0.6375779019741868,-0.6306304267469316,-0.6246527802572104,-0.6164561221485355,-0.6175141425569743,-0.6024355846927886,-0.5966061398555678,-0.5946291844729344,-0.5826554867411026,-0.5697501681009544,-0.5595772337594008,-0.5547338202836108
31,-0.7118359247108503,-0.7008244308010143,-0.6990745687210803,-0.68531034677245,-0.6816050365076743,-0.6741994970662196,-0.6694833470636695,-0.6671391593738445,-0.6530201898760416,-0.6499796150462417,-0.6454361685585446,-0.6335525190055978,-0.6273958150167047,-0.6189892471179933,-0.6109432263871922,-0.6004148724906113,-0.5996417026911244,-0.584272774831516,-0.5798108023157958,-0.5750489089541009,-0.563735862823787,-0.5648224276575692,-0.5610959733575538,-0.5611877479703835,-0.5542681951981041,-0.5527540838686015,-0.5508328802773593,-0.5431246176895594,-0.5457783312577833,-0.5437738731856379,-0.5408302592768612,-0.5404988539070701,-0.5379611065154298,-0.5424406012607079,-0.5323664684657214,-0.5322713899372938,-0.532463051994302,-0.527815334961619,-0.5168127016559899,-0.5099965955866423,-0.5195685729535826
32,-0.6614026178815071,-0.645471455588305,-0.6429898169684318,-0.6308222332935393,-0.6257300283753959,-0.6204302877898854,-0.613981405201836,-0.612868236164181,-0.5988143111811285,-0.597715454655995,-0.5920929870937646,-0.5803286970267342,-0.5754728830164033,-0.5689293085887857,-0.5597082786049545,-0.5487327709943176,-0.5481754098999104,-0.5306758849897935,-0.5340829590274468,-0.5287283671933785,-0.5114400375254078,-0.5188300880341709,-0.5170753860127157,-0.5178152542209266,-0.5072084865469798,-0.510547055006442,-0.5072771187422572,-0.5007313764948892,-0.5081444582814446,-0.509115033573238,-0.5035870278588725,-0.5021458001585251,-0.49966350265692694,-0.5077614352674964,-0.49633455303145807,-0.49709055246812683,-0.49903734864672367,-0.4912606856245639,-0.4877116899228039,-0.48402504822918924,-0.48413885295800657
33,-0.6291000447672438,-0.6185599838453503,-0.6126790660212208,-0.6003139658397646,-0.5948423839336205,-0.58756077116513,-0.5831940684947629,-0.5810489338099347,-0.5662838743556791,-0.5649493237202183,-0.5627196392473954,-0.5498301107335795,-0.5451363594497057,-0.538311085473244,-0.5300768799772207,-0.521677579189524,-0.5246524126650309,-0.5054827823196939,-0.5075385036551857,-0.5027037873087534,-0.4904987752123834,-0.4946858643993021,-0.49976788777878695,-0.49728258246372753,-0.48713945811742354,-0.4887946357198612,-0.49161772176718566,-0.4842067002952101,-0.49209630552096306,-0.4929757548952595,-0.48842419716206126,-0.48862833027470526,-0.48663825133547384,-0.49686762566672055,-0.4852111602378411,-0.4894112752236322,-0.4908909811253561,-0.48671929518492674,-0.48410468649823557,-0.4784645064116452,-0.4785031808848775
34,-0.7472354556570429,-0.7387529076427803,-0.7365685073927658,-0.7254067925663418,-0.7215057476441415,-0.7139312657166806,-0.7096857714487467,-0.7069086651053864,-0.6925293312880892,-0.6914647840983056,-0.687599129217851,-0.6765992813317363,-0.6722851616468638,-0.6664082850369997,-0.6570436571722498,-0.6472699030653375,-0.6458503719281847,-0.6300737534235334,-0.6279923347562026,-0.6220617005267118,-0.6080262677854797,-0.606844205586861,-0.6017055202341306,-0.5999459412497224,-0.5875974532835526,-0.5832714209135452,-0.5804048092262992,-0.5709080593257152,-0.5734412619344126,-0.5703510112178842,-0.5610926290537941,-0.5583507687034511,-0.5526408031069922,-0.5522094714724423,-0.5411711643035015,-0.5361645219768789,-0.5352397168803419,-0.5263596912072575,-0.5114438959806932,-0.5112603550906296,-0.5085088069397627
35,-0.6868664933884795,-0.6759750068929095,-0.6735758960492467,-0.6625525234769367,-0.659255033254763,-0.6518245319921766,-0.6459162057196658,-0.6446135831381733,-0.629886820612744,-0.6302527019004499,-0.6254004042917121,-0.6155369234153854,-0.6101384109121053,-0.6030987768934717,-0.5946854534265323,-0.5881259953990444,-0.5855240098142306,-0.5715326146050242,-0.5688097579770246,-0.56050163029847,-0.5485172252045656,-0.5490705276034251,-0.5480674134625089,-0.5455300170864265,-0.5365596757356607,-0.5352054395154844,-0.5318134419479327,-0.5214936037801083,-0.5202739726027398,-0.5219090507016204,-0.5160416713814772,-0.5134067880120822,-0.5055171543541355,-0.5112914174882819,-0.49822127356812523,-0.5000980712651193,-0.4974292200854701,-0.4895706123517097,-0.48228554748786806,-0.47721106331177204,-0.4737667158746111
36,-0.7115385900322725,-0.6989021828193747,-0.6964363498886359,-0.6845630328724114,-0.6806441765380015,-0.6737468566638726,-0.6690420148287631,-0.664994453346481,-0.6513618838356618,-0.6479411196704075,-0.6458171357487171,-0.6315888109380984,-0.6281745333969705,-0.6212606019090197,-0.6132762627329592,-0.604976503667001,-0.6027378587841259,-0.5878322237836839,-0.5854988998955661,-0.5809380486581389,-0.563735862823787,-0.566607175085728,-0.5682107175295186,-0.5658599685300847,-0.5562619318555857,-0.557249395766131,-0.5576955642106577,-0.5461742360440067,-0.552453300124533,-0.5530859233645611,-0.5454243706670892,-0.5425910983212059,-0.5429594941323276,-0.5470050105058994,-0.5392018600396402,-0.5382983149573538,-0.5397970085470085,-0.534504754012561,-0.523098895485512,-0.5154488151609875,-0.5251898192449546
37,-0.7014592785123912,-0.6897802423974122,-0.6901983184436975,-0.6773765992047452,-0.6737329910269692,-0.6649399273540095,-0.6632105448981994,-0.6601750277332676,-0.6458549258599008,-0.6431488673833587,-0.6423417819934691,-0.6296088065380886,-0.6250261666122401,-0.6170694115208163,-0.612890485069486,-0.6015651113863819,-0.6035070296374188,-0.5890118682490999,-0.5862998975939652,-0.5788512666165037,-0.5671652681503101,-0.5661660015641606,-0.5664547381168634,-0.5621241227519765,-0.552255649704231,-0.5532619224511676,-0.5508328802773593,-0.5400306734869371,-0.5416189290161892,-0.5434682964094729,-0.5374959452629355,-0.5301018987296577,-0.5280063934495184,-0.5338419266203329,-0.5215162372312853,-0.5183452702903504,-0.5185574697293447,-0.5128172976273552,-0.5077795557964858,-0.4971423560603716,-0.4941070681522016
38,-0.6438632126844979,-0.6312274038778926,-0.6256441445513795,-0.6135541121064851,-0.6087348176618074,-0.6004917574741548,-0.5970636695304224,-0.5912609392333292,-0.57698685792463,-0.5738614824510583,-0.5718550769709221,-0.5573671645196249,-0.5537525015281302,-0.5435748600683209,-0.5348715452232459,-0.5244204565563617,-0.5262881177707676,-0.5088575912685794,-0.5083901974104454,-0.5044494607474291,-0.4940115703340804,-0.4964906651693505,-0.496215561610657,-0.49790039675261366,-0.48945294499355796,-0.49206737325195377,-0.49536991648915785,-0.486688947793016,-0.4982814445828144,-0.5022717220859636,-0.49811030393554667,-0.4971615455473754,-0.4988152489379303,-0.5068692419589462,-0.49916145753925906,-0.5000980712651193,-0.5032774661680912,-0.5011939549895325,-0.5005134246204046,-0.4983029515232171,-0.4981751386077197
39,-0.7752483913859805,-0.7636295148556761,-0.7618945863092058,-0.7509282672657711,-0.7471837294378468,-0.7401005867560772,-0.7364834647522656,-0.7330642179218538,-0.7228970606525434,-0.723143717500304,-0.7157285025656974,-0.7043845282619147,-0.7021025396267175,-0.6952508855579691,-0.6896877956480606,-0.6798993295188659,-0.6790318183588425,-0.6652374162708874,-0.6620600849665913,-0.6552696262854276,-0.6447177776619586,-0.6456674754847895,-0.6418710263396912,-0.6376326128717745,-0.6270960097053596,-0.622487844789482,-0.6209748576215898,-0.6112445811650606,-1.0,-0.611885328293997,-0.6056909649142659,-0.6007811997914896,-0.5951936962831065,-0.5980733796670438,-0.5868018498754891,-0.5835418585990668,-0.5823706819800569,-0.5733655355896721,-0.5624736120594843,-0.552329959869188,-0.5522766287909753
40,-0.850704582963057,-0.8424649820784355,-0.8402028387563387,-0.8316522687321984,-0.8288768447760746,-0.8214920368818106,-0.8190125926797693,-0.815807962529274,-0.8063789505686608,-0.8025806636196525,-0.7994324366350489,-0.7909506465569923,-0.7871168161303558,-0.7803635970328174,-0.7747425852614562,-0.7653119408560923,-0.7628811777076762,-0.7509001200160021,-0.7467934744035609,-0.7414998745924254,-0.727774013655079,-0.7268233501112961,-0.7220002018367141,-0.7172920427450261,-0.7081997122248032,-0.7016166194878354,-0.6972041247404213,-0.6867137702679941,-0.685280199252802,-0.6784206505568735,-0.6725884687049736,-0.66826143772181,-0.6614556314232436,-0.6612251495070308,-0.6506327184021955,-0.6451306130939998,-0.6397346866096866,-0.6320601448011165,-0.6196175116888804,-0.6121702619335004,-0.607690865114132
41,-0.7959148219666852,-0.7861528245395343,-0.7839948057498377,-0.7741889999153985,-0.7690282803108782,-0.7633025984911986,-0.7580322466752971,-0.7572229754714656,-0.7464864640769454,-0.7438076232574441,-0.7398305084745763,-0.730751994263691,-0.7256734239326116,-0.7186764851685941,-0.7126783073545756,-0.7045065770070194,-0.7027008606924485,-0.6885841189081621,-0.6874588094538007,-0.6831201404564836,-0.6682858185229582,-0.6684280185292879,-0.6657483096175194,-0.6630884922435347,-0.6531462481073609,-0.648857833410136,-0.6498872559068101,-0.6354642246079378,-0.6374346201743462,-0.6344578022596599,-0.6291216873741146,-0.6248884255325227,-0.620395945207016,-0.6196476482948117,-0.609957056461859,-0.608261761122173,-0.6028590188746439,-0.5955000436147941,-0.586346553800124,-0.5733960570703476,-0.5734584850043999
42,-0.8391252346939457,-0.8311101273343663,-0.8286883696465116,-0.8203767590077176,-0.8173415206609916,-0.810757194747136,-0.8073673061080381,-0.8051953654628374,-0.7956621477827066,-0.7936828101195202,-0.790607992536153,-0.7819387746787585,-0.777747075619416,-0.7724859617655276,-1.0,-0.7594624353605065,-0.7574288273552207,-0.745032671022803,-0.7419063745221897,-0.736353147730123,-0.7250534215875333,-0.7223414281990094,-0.7179533757190433,-0.7131217962950449,-0.7029614512898159,-0.6984473305558951,-0.6937549576206986,-0.6800205671935532,-0.6786467413864674,-0.6712556793052149,-0.665369150806044,-0.6590641312187145,-0.6523071099084446,-0.6499175690964927,-0.6366570107231794,-0.6315730036553835,-0.6277321492165242,-0.6186376919050942,-0.60598700019286,-0.5970876791185664,-0.591086790311645
43,-0.8188630456425435,-0.8088586506984168,-0.8071799002243719,-0.7982910482134967,-0.7946161814824267,-0.7875887119307069,-0.7855949158526538,-0.7818439541476643,-0.7718585464947556,-0.768898997918589,-0.765642979318924,-0.7568261262802807,-0.7535900591993435,-0.7464194615447015,-0.7405461509492887,-0.733695117874909,-0.7305662655294621,-0.7192548750089756,-0.7149259330609266,-0.7108001003260597,-0.6976702975973316,-0.69560029678946,-0.6916237763649208,-0.6883319979534902,-0.6789425672180791,-0.6747387922846153,-0.6718567570699013,-0.6596572725419101,-1.0,-0.6538297615696996,-0.6472114724541909,-0.6426832142015553,-0.6382723665577724,-0.6387910134152255,-0.6257496061391472,-0.6224196855775803,-0.6195913461538461,-0.6122099616189811,-0.5987990555071958,-0.5914188150578235,-0.5906732512346065
44,-0.7777306348262429,-0.7673225609779777,-0.7648040239001257,-0.7549327417489965,-0.7513524604521047,-0.7451578653255099,-0.7392491467576792,-0.7373782817699988,-0.7255019830576399,-0.723143717500304,-0.7191338827554035,-0.7096237991639981,-0.7045894144540179,-0.6967110422093432,-0.6909277952806533,-0.6808922707878645,-0.6810180317015228,-0.667801860760922,-0.6633883216563415,-0.6566641585151743,-0.6447177776619586,-0.6426795275432651,-0.6400544959128065,-0.6363487175526832,-0.6267386418139241,-0.6214063366969802,-0.6213491858361334,-0.6083988617122189,-0.6108758821087589,-0.6060230790880946,-0.5997389880885027,-0.5943259474011182,-0.5904336609508855,-0.5917569096492646,-0.5800045738679677,-0.5786442390561384,-0.5763388087606838,-0.5677501308443824,-0.5535916267481196,-0.5457893596607967,-0.549944460740235
45,-0.6402250389207753,-0.6285090733988062,-0.6211443787857618,-0.6105178556321148,-0.6065478603349999,-0.5977647387538418,-0.593103448275862,-0.5938123998520892,-0.5782098586294101,-0.5780314572023261,-0.5768309749650132,-0.5638205121937307,-0.5634069347802423,-0.554273662199068,-0.5463070973904897,-0.5402386991486265,-0.5416228531370487,-0.5276088093797122,-0.5247751629878228,-0.5231502382743918,-0.5119820711940376,-0.5180079010167045,-0.518710263396912,-0.5186744022164088,-0.5126536446822717,-0.5168103975247571,-0.5173928931114696,-0.5098979618975009,-0.5192860107928601,-0.5209038639379197,-0.5186065283152662,-0.5173056462036117,-0.5180096182157229,-0.5240795215775013,-0.5145792041469737,-0.5169544414395673,-0.5175669960826211,-0.5148726448011165,-0.5059552043534238,-0.5079436311679201,-0.5149715571669689
46,-0.4334003728376419,-0.4221217734388046,-0.4264216383256762,-0.4076620825147348,-0.40485734732585665,-0.39859737356803576,-0.39451571142756264,-0.3971034142733884,-0.3719027679891657,-0.37213627162772067,-0.3771341937490281,-0.35939116901741264,-0.3624808460398402,-0.35397982820626067,-0.3460976752303184,-0.33862246603354373,-0.3460392569225377,-0.3239303702032066,-0.33278919565636184,-0.33146726862302484,-0.3214780841194559,-0.331331341368039,-0.3420627712180846,-0.34693168325433676,-0.3432424553055025,-0.3570763544713306,-0.3633568328268019,-0.3618850896711909,-0.37689497716894976,-0.38385267982791205,-0.3886889809219906,-0.39398461879021146,-0.4014343199248489,-0.4148246322935187,-0.40981856990394877,-0.43107967547326814,-0.43297053062678065,-0.43627333391486395,-0.42920213292745857,-0.4250667987166393,-0.4325522573944153
47,-0.7512511442373867,-0.7416382212798677,-0.7385533355797917,-0.7297120726445512,-0.7240530274595763,-0.716848281642917,-0.7148523008120513,-0.7098545544188339,-0.6969998479886129,-0.6973442339191326,-0.6928626963147255,-0.6822785532115997,-0.6773677644083833,-0.6701668364173885,-0.6638774329252051,-0.6531587329676164,-0.6539023250379717,-0.639018535804774,-0.6349782513916068,-0.6306195134186104,-0.6162193151613071,-0.6188762107205166,-0.6107982642042588,-0.6068866986514272,-0.5984407474631582,-0.5943310167116511,-0.5931052307911694,-0.5802962739692024,-0.5840763802407638,-0.5791484057737928,-0.5748749632244778,-0.5718468162895152,-0.5679934943847006,-0.5698658477452724,-0.5570971184631803,-0.5562721031828584,-0.5550603187321937,-0.5482216067690161,-0.5361768891159193,-0.5244498777506112,-0.531224604613365
48,-0.6611988266973133,-0.645471455588305,-0.643355551354861,-0.6325330651150112,-0.6270512108336962,-0.6198211791003073,-0.61754736965988,-0.6137310489338099,-0.5990906955211918,-0.60300839001781,-0.5961048048515005,-0.5818605522827088,-0.5812588443149371,-0.5728050330337909,-0.5651459066234351,-0.5550246760651999,-0.555497137516065,-0.5411183029532143,-0.5420625183773206,-0.5354401805869075,-0.5230833376765518,-0.5290071590430545,-0.5285699868806136,-0.5284242839628925,-0.5208919150216772,-0.5206003780576115,-0.5225978378089322,-0.5143482770542814,-0.519618098796181,-0.5209038639379197,-0.5178747897194499,-0.5173056462036117,-0.5164322869200678,-0.5257346048165509,-0.5132578645118666,-0.5141430651728135,-0.5150796830484331,-0.5107401430565248,-0.5083320736620989,-0.5028834349499138,-0.5061189357619938
49,-0.6654216473009361,-0.6503877504261953,-0.6505469578295925,-0.6382342711574436,-0.6347931398601748,-0.6267393126571668,-0.6222019536306932,-0.6204918032786885,-0.6061384961928057,-0.605604789391241,-0.6002876691027834,-0.588370937120601,-0.5866512597653797,-0.5766086509774938,-0.5699681274168511,-0.5597436048683615,-0.5621275849982474,-0.5449752274662263,-0.5420625183773206,-0.5379784298971658,-0.5241152863918278,-0.5274229450337898,-0.5254213341406802,-0.5242926509059668,-0.5150329624857758,-0.5144404841394488,-0.5136496109660341,-0.5047029724913786,-0.5095226234952263,-0.5084073820915926,-0.502033026304871,-0.4967402403581808,-0.49668409909846756,-0.5023759495716825,-0.49299944097169285,-0.4904454812921632,-0.4886707621082621,-0.4855744068387997,-0.47891310353455063,-0.4756326534823022,-0.4703333798164079
50,-0.2016563880184147,-0.1924189646267538,-0.19770614680331708,-0.17381393293915268,-0.17367543951836895,-0.1706230790723666,-0.16764740496645875,-0.16999260446197462,-0.15138261266116662,-0.16121995007474482,-0.16379256725237132,-0.14008327425912798,-0.14259757006372092,-0.14694403634167666,-0.12842722120674926,-0.12518924870721013,-0.1354422245589438,-0.11791315765178947,-0.13778174333600332,-0.14338600451467268,-0.14128316047323708,-0.1600457216195079,-0.18297507316580885,-0.2000559894199303,-0.1921228593193082,-0.22221699754544685,-0.2397928717212859,-0.2445988953998635,-0.26817766708177665,-0.28893088335812794,-0.29761392868188985,-0.3199777208103341,-0.34241408802209666,-0.35710360433166316,-0.3577018854500178,-0.3699723617343755,-0.3818275908119658,-0.3829651517794836,-0.3814353997154012,-0.38134587808073617,-0.39217449425613454
