series,Temp,Humi,Pres,200,205,210,215,220,225,230,235,240,245,250,255,260,265,270,275,280,285,290,295,300,305,310,315,320,325,330,335,340,345,350,355,360,365,370,375,380,385,390,395,400,configuration
0,29.45,31.7,99829.0,373441.0,317059.0,295592.0,259322.0,243704.0,216088.0,204627.0,193866.0,177819.0,168413.0,155244.0,150267.0,144108.0,134462.0,132769.0,124172.0,123990.0,118922.0,119258.0,120968.0,117596.0,119090.0,117350.0,122371.0,126027.0,123355.0,128522.0,129908.0,135542.0,137531.0,146739.0,154675.0,155530.0,166914.0,170455.0,182630.0,192182.0,194434.0,206409.0,206924.0,222164.0,"TEMP:200,205,210,215,220,225,230,235,240,245,250,255,260,265,270,275,280,285,290,295,300,305,310,315,320,325,330,335,340,345,350,355,360,365,370,375,380,385,390,395,400;HTDR:100;CTDR:0;TRSH:0.002;NEUTR;ENV;;Preheating:300"
1,30.86,51.06,99876.0,6133.0,5689.0,5464.0,5153.0,4996.0,4786.0,4722.0,4680.0,4586.0,4594.0,4578.0,4692.0,4813.0,4822.0,5025.0,5118.0,5386.0,5628.0,5952.0,6390.0,6763.0,7380.0,7942.0,8784.0,9734.0,10439.0,11732.0,12941.0,14578.0,16189.0,18390.0,20519.0,22512.0,25302.0,28022.0,31258.0,34361.0,37174.0,40645.0,43357.0,46974.0,"TEMP:200,205,210,215,220,225,230,235,240,245,250,255,260,265,270,275,280,285,290,295,300,305,310,315,320,325,330,335,340,345,350,355,360,365,370,375,380,385,390,395,400;HTDR:100;CTDR:0;TRSH:0.002;NEUTR;ENV;;Preheating:300"
2,31.5,49.75,99861.0,6249.0,5803.0,5563.0,5246.0,5083.0,4866.0,4804.0,4752.0,4630.0,4642.0,4594.0,4684.0,4786.0,4795.0,4996.0,5073.0,5342.0,5581.0,5894.0,6287.0,6610.0,7188.0,7676.0,8480.0,9280.0,9965.0,11135.0,12186.0,13539.0,15099.0,16943.0,18884.0,20660.0,23231.0,25766.0,28399.0,31585.0,33865.0,36946.0,38993.0,42103.0,"TEMP:200,205,210,215,220,225,230,235,240,245,250,255,260,265,270,275,280,285,290,295,300,305,310,315,320,325,330,335,340,345,350,355,360,365,370,375,380,385,390,395,400;HTDR:100;CTDR:0;TRSH:0.002;NEUTR;ENV;;Preheating:300"
3,31.82,49.9,99861.0,6332.0,5881.0,5640.0,5309.0,5163.0,4940.0,4871.0,4813.0,4684.0,4718.0,4626.0,4718.0,4822.0,4817.0,5006.0,5083.0,5353.0,5569.0,5881.0,6220.0,6553.0,7111.0,7571.0,8365.0,9135.0,9798.0,10927.0,12012.0,13342.0,14699.0,16609.0,18585.0,20089.0,22609.0,0.0,27692.0,30579.0,32736.0,35788.0,37671.0,40841.0,"TEMP:200,205,210,215,220,225,230,235,240,245,250,255,260,265,270,275,280,285,290,295,300,305,310,315,320,325,330,335,340,345,350,355,360,365,370,375,380,385,390,395,400;HTDR:100;CTDR:0;TRSH:0.002;NEUTR;ENV;;Preheating:300"
4,31.97,49.78,99859.0,6652.0,6133.0,5863.0,5557.0,5391.0,5158.0,5093.0,5015.0,4898.0,4894.0,4839.0,4916.0,5006.0,5025.0,5199.0,5288.0,5557.0,5790.0,6062.0,6437.0,6772.0,7344.0,7766.0,8542.0,9337.0,10022.0,11111.0,12109.0,13342.0,14699.0,16467.0,18295.0,19695.0,22088.0,24242.0,26915.0,29205.0,31212.0,33892.0,35697.0,38113.0,"TEMP:200,205,210,215,220,225,230,235,240,245,250,255,260,265,270,275,280,285,290,295,300,305,310,315,320,325,330,335,340,345,350,355,360,365,370,375,380,385,390,395,400;HTDR:100;CTDR:0;TRSH:0.002;NEUTR;ENV;;Preheating:300"
5,32.01,49.87,99859.0,7339.0,6746.0,6433.0,6027.0,5868.0,5610.0,5533.0,5453.0,5299.0,5299.0,5230.0,5315.0,5408.0,5430.0,5628.0,5702.0,5932.0,6169.0,6524.0,6951.0,7258.0,7859.0,8339.0,9095.0,9881.0,10523.0,11640.0,12654.0,13905.0,15186.0,17025.0,18700.0,20108.0,22512.0,24552.0,27192.0,29511.0,31304.0,33919.0,35910.0,38217.0,"TEMP:200,205,210,215,220,225,230,235,240,245,250,255,260,265,270,275,280,285,290,295,300,305,310,315,320,325,330,335,340,345,350,355,360,365,370,375,380,385,390,395,400;HTDR:100;CTDR:0;TRSH:0.002;NEUTR;ENV;;Preheating:300"
6,32.07,47.99,99855.0,7824.0,7213.0,6860.0,6421.0,6191.0,5906.0,5828.0,5758.0,5592.0,5581.0,5499.0,5586.0,5683.0,5683.0,5854.0,5883.0,6191.0,6409.0,6772.0,7198.0,7555.0,8145.0,8668.0,9446.0,10337.0,11123.0,12343.0,13539.0,15099.0,16518.0,18750.0,20906.0,22853.0,25876.0,28476.0,31823.0,34558.0,37011.0,40567.0,42442.0,45457.0,"TEMP:200,205,210,215,220,225,230,235,240,245,250,255,260,265,270,275,280,285,290,295,300,305,310,315,320,325,330,335,340,345,350,355,360,365,370,375,380,385,390,395,400;HTDR:100;CTDR:0;TRSH:0.002;NEUTR;ENV;;Preheating:300"
7,32.08,45.14,99847.0,11007.0,10003.0,9472.0,8799.0,8439.0,7978.0,0.0,7631.0,7385.0,7390.0,7203.0,7334.0,7485.0,7406.0,7659.0,7726.0,8158.0,8378.0,8903.0,9362.0,9743.0,10502.0,10938.0,11978.0,12941.0,13814.0,15121.0,16364.0,18029.0,19622.0,21769.0,24159.0,25829.0,28553.0,31028.0,33974.0,36722.0,38707.0,42020.0,43626.0,46305.0,"TEMP:200,205,210,215,220,225,230,235,240,245,250,255,260,265,270,275,280,285,290,295,300,305,310,315,320,325,330,335,340,345,350,355,360,365,370,375,380,385,390,395,400;HTDR:100;CTDR:0;TRSH:0.002;NEUTR;ENV;;Preheating:300"
8,31.94,45.07,99851.0,8597.0,7948.0,7517.0,7016.0,6785.0,6433.0,6309.0,6212.0,6007.0,5980.0,5887.0,5946.0,6034.0,6014.0,6212.0,6279.0,6610.0,6874.0,7318.0,7749.0,8107.0,8799.0,9329.0,10276.0,11242.0,11992.0,13350.0,14537.0,16326.0,17681.0,19844.0,22157.0,24076.0,26745.0,29245.0,32484.0,35191.0,37538.0,40645.0,42613.0,45555.0,"TEMP:200,205,210,215,220,225,230,235,240,245,250,255,260,265,270,275,280,285,290,295,300,305,310,315,320,325,330,335,340,345,350,355,360,365,370,375,380,385,390,395,400;HTDR:100;CTDR:0;TRSH:0.002;NEUTR;ENV;;Preheating:300"
9,31.71,42.98,99853.0,12504.0,11437.0,10826.0,10060.0,9681.0,9166.0,9025.0,8865.0,8528.0,8528.0,8299.0,8480.0,8619.0,8555.0,8858.0,8933.0,9421.0,9761.0,10306.0,11007.0,11437.0,12343.0,13085.0,14195.0,15442.0,16377.0,18075.0,19659.0,21546.0,23308.0,26181.0,28885.0,30668.0,33865.0,36405.0,39283.0,42613.0,44688.0,47503.0,48879.0,51442.0,"TEMP:200,205,210,215,220,225,230,235,240,245,250,255,260,265,270,275,280,285,290,295,300,305,310,315,320,325,330,335,340,345,350,355,360,365,370,375,380,385,390,395,400;HTDR:100;CTDR:0;TRSH:0.002;NEUTR;ENV;;Preheating:300"
10,31.63,46.59,99864.0,9780.0,8933.0,8542.0,7912.0,7615.0,7223.0,7077.0,6905.0,6678.0,6669.0,6528.0,6631.0,6712.0,6720.0,6933.0,6997.0,7349.0,7637.0,8082.0,8549.0,8941.0,9628.0,10118.0,11123.0,12130.0,12886.0,14214.0,15442.0,17135.0,18667.0,20947.0,23205.0,25152.0,28097.0,0.0,33304.0,36125.0,38356.0,41120.0,43224.0,45852.0,"TEMP:200,205,210,215,220,225,230,235,240,245,250,255,260,265,270,275,280,285,290,295,300,305,310,315,320,325,330,335,340,345,350,355,360,365,370,375,380,385,390,395,400;HTDR:100;CTDR:0;TRSH:0.002;NEUTR;ENV;;Preheating:300"
11,31.63,47.92,99864.0,9009.0,8254.0,7877.0,7385.0,7082.0,6737.0,6635.0,6496.0,6287.0,6264.0,6115.0,6205.0,6290.0,6272.0,6500.0,6561.0,6878.0,7149.0,7560.0,8033.0,8378.0,9048.0,9566.0,10502.0,11437.0,12137.0,13393.0,14527.0,16017.0,17505.0,19586.0,21590.0,23360.0,25924.0,0.0,30983.0,33649.0,35457.0,38286.0,39839.0,42272.0,"TEMP:200,205,210,215,220,225,230,235,240,245,250,255,260,265,270,275,280,285,290,295,300,305,310,315,320,325,330,335,340,345,350,355,360,365,370,375,380,385,390,395,400;HTDR:100;CTDR:0;TRSH:0.002;NEUTR;ENV;;Preheating:300"
12,31.6,48.2,99868.0,8711.0,7972.0,7626.0,7101.0,6851.0,6512.0,6397.0,6287.0,6062.0,6052.0,5912.0,6024.0,6076.0,6069.0,6261.0,6302.0,6635.0,6883.0,7253.0,7665.0,8058.0,8682.0,9182.0,10079.0,10984.0,11719.0,12949.0,14072.0,15660.0,17122.0,19194.0,21200.0,22978.0,25766.0,27967.0,30623.0,33226.0,35104.0,37705.0,39430.0,41812.0,"TEMP:200,205,210,215,220,225,230,235,240,245,250,255,260,265,270,275,280,285,290,295,300,305,310,315,320,325,330,335,340,345,350,355,360,365,370,375,380,385,390,395,400;HTDR:100;CTDR:0;TRSH:0.002;NEUTR;ENV;;Preheating:300"
13,31.41,47.9,99866.0,8704.0,8003.0,7648.0,7154.0,6901.0,6549.0,6401.0,6294.0,6083.0,6076.0,5912.0,5993.0,6108.0,6055.0,6231.0,6272.0,6598.0,6851.0,7228.0,7738.0,8114.0,8755.0,9263.0,10256.0,11218.0,11992.0,13342.0,14527.0,16238.0,17952.0,20263.0,22416.0,24595.0,27458.0,0.0,33121.0,36094.0,38496.0,41524.0,43671.0,46663.0,"TEMP:200,205,210,215,220,225,230,235,240,245,250,255,260,265,270,275,280,285,290,295,300,305,310,315,320,325,330,335,340,345,350,355,360,365,370,375,380,385,390,395,400;HTDR:100;CTDR:0;TRSH:0.002;NEUTR;ENV;;Preheating:300"
14,31.34,47.37,99874.0,9280.0,8500.0,8151.0,7587.0,7308.0,6910.0,6763.0,6652.0,6417.0,6405.0,6227.0,6332.0,6382.0,6359.0,6569.0,6619.0,6956.0,7208.0,7593.0,8089.0,8432.0,9056.0,9566.0,10460.0,11425.0,12102.0,13334.0,14497.0,15920.0,17418.0,19567.0,21502.0,23257.0,25734.0,27911.0,30713.0,33436.0,35221.0,37671.0,38814.0,41402.0,"TEMP:200,205,210,215,220,225,230,235,240,245,250,255,260,265,270,275,280,285,290,295,300,305,310,315,320,325,330,335,340,345,350,355,360,365,370,375,380,385,390,395,400;HTDR:100;CTDR:0;TRSH:0.002;NEUTR;ENV;;Preheating:300"
15,31.28,48.43,99884.0,8918.0,8183.0,7847.0,7328.0,7082.0,6695.0,6569.0,6429.0,6201.0,6191.0,6041.0,6133.0,6212.0,6162.0,6355.0,6409.0,6742.0,6983.0,7385.0,7818.0,8189.0,8843.0,9329.0,10326.0,11302.0,11985.0,13267.0,14458.0,16065.0,17593.0,19806.0,21996.0,23981.0,26576.0,28905.0,31680.0,34586.0,36785.0,39430.0,0.0,43852.0,"TEMP:200,205,210,215,220,225,230,235,240,245,250,255,260,265,270,275,280,285,290,295,300,305,310,315,320,325,330,335,340,345,350,355,360,365,370,375,380,385,390,395,400;HTDR:100;CTDR:0;TRSH:0.002;NEUTR;ENV;;Preheating:300"
16,31.3,47.87,99886.0,11182.0,10187.0,9690.0,9009.0,8668.0,8196.0,8045.0,7842.0,7582.0,7549.0,7349.0,7474.0,7593.0,7549.0,7772.0,7842.0,8196.0,8459.0,8933.0,9421.0,9752.0,10481.0,11053.0,12033.0,13045.0,13671.0,15078.0,16289.0,17983.0,19567.0,21859.0,24131.0,25892.0,28650.0,31097.0,33974.0,36818.0,38778.0,41524.0,42873.0,45360.0,"TEMP:200,205,210,215,220,225,230,235,240,245,250,255,260,265,270,275,280,285,290,295,300,305,310,315,320,325,330,335,340,345,350,355,360,365,370,375,380,385,390,395,400;HTDR:100;CTDR:0;TRSH:0.002;NEUTR;ENV;;Preheating:300"
17,31.21,49.86,99892.0,8784.0,8070.0,7681.0,7174.0,6933.0,0.0,6441.0,6328.0,6097.0,6034.0,5946.0,6000.0,6087.0,6041.0,6235.0,6287.0,6573.0,6807.0,7198.0,7604.0,7966.0,8583.0,9056.0,9946.0,10759.0,11339.0,12722.0,13796.0,15197.0,16544.0,18601.0,20660.0,22464.0,24988.0,27440.0,30078.0,32992.0,34987.0,37739.0,39578.0,42188.0,"TEMP:200,205,210,215,220,225,230,235,240,245,250,255,260,265,270,275,280,285,290,295,300,305,310,315,320,325,330,335,340,345,350,355,360,365,370,375,380,385,390,395,400;HTDR:100;CTDR:0;TRSH:0.002;NEUTR;ENV;;Preheating:300"
18,31.1,47.63,99892.0,10408.0,9549.0,9119.0,8486.0,8170.0,7704.0,7506.0,7375.0,7111.0,7058.0,6896.0,6988.0,7053.0,7030.0,7268.0,7313.0,7693.0,7954.0,8392.0,8903.0,9263.0,10003.0,10533.0,11512.0,12548.0,13267.0,14618.0,15848.0,17462.0,19159.0,21437.0,23645.0,25578.0,28153.0,30513.0,33304.0,36187.0,37942.0,40802.0,42357.0,44640.0,"TEMP:200,205,210,215,220,225,230,235,240,245,250,255,260,265,270,275,280,285,290,295,300,305,310,315,320,325,330,335,340,345,350,355,360,365,370,375,380,385,390,395,400;HTDR:100;CTDR:0;TRSH:0.002;NEUTR;ENV;;Preheating:300"
19,31.05,48.24,99892.0,10759.0,9834.0,9404.0,8784.0,8486.0,8027.0,7883.0,7738.0,7479.0,7506.0,7298.0,7442.0,7528.0,7522.0,7830.0,7912.0,8325.0,8640.0,9182.0,9844.0,10286.0,11170.0,11804.0,13013.0,14214.0,15274.0,16781.0,18326.0,20460.0,22584.0,25363.0,28323.0,30403.0,34305.0,37141.0,40920.0,44499.0,47079.0,50700.0,52433.0,55722.0,"TEMP:200,205,210,215,220,225,230,235,240,245,250,255,260,265,270,275,280,285,290,295,300,305,310,315,320,325,330,335,340,345,350,355,360,365,370,375,380,385,390,395,400;HTDR:100;CTDR:0;TRSH:0.002;NEUTR;ENV;;Preheating:300"
20,31.07,48.85,99888.0,9231.0,8500.0,8151.0,7587.0,7328.0,6951.0,6790.0,6661.0,6460.0,6433.0,6249.0,6340.0,6405.0,6378.0,6586.0,6635.0,6960.0,7203.0,7670.0,8114.0,8500.0,9215.0,9743.0,10705.0,11751.0,12504.0,13868.0,15099.0,16808.0,18552.0,20782.0,23003.0,25032.0,28097.0,30447.0,33703.0,36626.0,38778.0,41729.0,0.0,46002.0,"TEMP:200,205,210,215,220,225,230,235,240,245,250,255,260,265,270,275,280,285,290,295,300,305,310,315,320,325,330,335,340,345,350,355,360,365,370,375,380,385,390,395,400;HTDR:100;CTDR:0;TRSH:0.002;NEUTR;ENV;;Preheating:300"
21,31.03,48.69,99890.0,10256.0,9396.0,8948.0,8378.0,8058.0,7609.0,7464.0,7313.0,7053.0,6997.0,6834.0,6942.0,7058.0,6979.0,7203.0,7258.0,7631.0,7877.0,8365.0,8836.0,9215.0,9946.0,10523.0,11550.0,12608.0,13376.0,14792.0,16065.0,17891.0,19549.0,22042.0,24552.0,26443.0,29387.0,31847.0,35045.0,38079.0,40567.0,43671.0,45408.0,47772.0,"TEMP:200,205,210,215,220,225,230,235,240,245,250,255,260,265,270,275,280,285,290,295,300,305,310,315,320,325,330,335,340,345,350,355,360,365,370,375,380,385,390,395,400;HTDR:100;CTDR:0;TRSH:0.002;NEUTR;ENV;;Preheating:300"
22,30.97,50.79,99898.0,8473.0,7778.0,7453.0,6988.0,6759.0,0.0,6279.0,6165.0,5963.0,5912.0,5848.0,5883.0,5966.0,5899.0,6083.0,6154.0,6425.0,6665.0,7101.0,7549.0,7883.0,8452.0,9040.0,9927.0,10859.0,11563.0,12792.0,13942.0,15567.0,17080.0,19264.0,21307.0,23360.0,25924.0,28285.0,31374.0,34305.0,36187.0,39320.0,0.0,43626.0,"TEMP:200,205,210,215,220,225,230,235,240,245,250,255,260,265,270,275,280,285,290,295,300,305,310,315,320,325,330,335,340,345,350,355,360,365,370,375,380,385,390,395,400;HTDR:100;CTDR:0;TRSH:0.002;NEUTR;ENV;;Preheating:300"
23,30.89,47.3,99896.0,11030.0,10079.0,9636.0,8963.0,8611.0,8170.0,7936.0,7818.0,7538.0,7453.0,7303.0,7442.0,7501.0,7479.0,7749.0,7772.0,8215.0,8486.0,8994.0,9610.0,9993.0,10737.0,11500.0,12608.0,13760.0,14628.0,16114.0,17696.0,19531.0,21264.0,24214.0,26745.0,29064.0,32509.0,35104.0,38707.0,42103.0,44220.0,47396.0,48879.0,52013.0,"TEMP:200,205,210,215,220,225,230,235,240,245,250,255,260,265,270,275,280,285,290,295,300,305,310,315,320,325,330,335,340,345,350,355,360,365,370,375,380,385,390,395,400;HTDR:100;CTDR:0;TRSH:0.002;NEUTR;ENV;;Preheating:300"
24,30.87,48.18,99906.0,10031.0,9182.0,8762.0,8170.0,7900.0,0.0,7283.0,7159.0,6892.0,6892.0,6652.0,6759.0,6820.0,6794.0,7006.0,7049.0,7427.0,7676.0,8126.0,8675.0,9025.0,9798.0,10337.0,11363.0,12408.0,13159.0,14557.0,15944.0,17652.0,19423.0,21859.0,24256.0,26311.0,29387.0,32041.0,35045.0,38321.0,40450.0,43536.0,45360.0,48099.0,"TEMP:200,205,210,215,220,225,230,235,240,245,250,255,260,265,270,275,280,285,290,295,300,305,310,315,320,325,330,335,340,345,350,355,360,365,370,375,380,385,390,395,400;HTDR:100;CTDR:0;TRSH:0.002;NEUTR;ENV;;Preheating:300"
25,30.73,47.29,99908.0,11030.0,10022.0,9558.0,8918.0,8583.0,8132.0,7918.0,7795.0,7501.0,7458.0,7258.0,7364.0,7453.0,7390.0,7665.0,7693.0,8076.0,8372.0,8865.0,9438.0,9844.0,10672.0,11266.0,12321.0,13513.0,14281.0,15730.0,17080.0,19055.0,20906.0,23516.0,26213.0,28266.0,31562.0,34333.0,37773.0,41442.0,43852.0,47290.0,48993.0,52045.0,"TEMP:200,205,210,215,220,225,230,235,240,245,250,255,260,265,270,275,280,285,290,295,300,305,310,315,320,325,330,335,340,345,350,355,360,365,370,375,380,385,390,395,400;HTDR:100;CTDR:0;TRSH:0.002;NEUTR;ENV;;Preheating:300"
26,30.57,47.24,99910.0,11614.0,10523.0,10060.0,9362.0,8994.0,0.0,8286.0,8196.0,7853.0,7836.0,7626.0,7726.0,7807.0,7807.0,8064.0,8145.0,8535.0,8828.0,9345.0,9984.0,10460.0,11218.0,11911.0,13069.0,14320.0,15099.0,16622.0,18137.0,20147.0,21996.0,24797.0,27440.0,29408.0,32610.0,35250.0,38356.0,42103.0,43807.0,47131.0,48430.0,50883.0,"TEMP:200,205,210,215,220,225,230,235,240,245,250,255,260,265,270,275,280,285,290,295,300,305,310,315,320,325,330,335,340,345,350,355,360,365,370,375,380,385,390,395,400;HTDR:100;CTDR:0;TRSH:0.002;NEUTR;ENV;;Preheating:300"
27,30.46,47.93,99911.0,11030.0,10041.0,9566.0,8903.0,8569.0,8120.0,7895.0,7778.0,7453.0,7390.0,7228.0,7328.0,7390.0,7359.0,7598.0,7648.0,8009.0,8319.0,8799.0,9345.0,9780.0,10460.0,11123.0,12214.0,13267.0,14185.0,15544.0,16902.0,18700.0,20499.0,22878.0,25532.0,27475.0,30535.0,32992.0,36311.0,39393.0,41729.0,44593.0,46203.0,48710.0,"TEMP:200,205,210,215,220,225,230,235,240,245,250,255,260,265,270,275,280,285,290,295,300,305,310,315,320,325,330,335,340,345,350,355,360,365,370,375,380,385,390,395,400;HTDR:100;CTDR:0;TRSH:0.002;NEUTR;ENV;;Preheating:300"
28,30.42,49.8,99921.0,9752.0,8956.0,8562.0,7924.0,7726.0,7283.0,7111.0,6988.0,6746.0,6703.0,6561.0,6631.0,6695.0,6690.0,6887.0,6946.0,7298.0,7528.0,7984.0,8514.0,8918.0,9592.0,10167.0,11218.0,12228.0,13045.0,14497.0,15872.0,17534.0,19229.0,21590.0,23981.0,26100.0,29024.0,31538.0,34757.0,37874.0,40028.0,43136.0,44782.0,47290.0,"TEMP:200,205,210,215,220,225,230,235,240,245,250,255,260,265,270,275,280,285,290,295,300,305,310,315,320,325,330,335,340,345,350,355,360,365,370,375,380,385,390,395,400;HTDR:100;CTDR:0;TRSH:0.002;NEUTR;ENV;;Preheating:300"
29,30.38,48.58,99921.0,10533.0,9619.0,9198.0,8500.0,8247.0,7789.0,7582.0,7485.0,7213.0,7140.0,6979.0,7049.0,7130.0,7082.0,7308.0,7380.0,7715.0,7972.0,8459.0,8979.0,9412.0,10099.0,10694.0,11778.0,12839.0,13706.0,15067.0,16364.0,0.0,19956.0,22274.0,24768.0,26813.0,29844.0,32660.0,35818.0,38778.0,41200.0,44127.0,46102.0,48879.0,"TEMP:200,205,210,215,220,225,230,235,240,245,250,255,260,265,270,275,280,285,290,295,300,305,310,315,320,325,330,335,340,345,350,355,360,365,370,375,380,385,390,395,400;HTDR:100;CTDR:0;TRSH:0.002;NEUTR;ENV;;Preheating:300"
30,30.34,49.73,99933.0,10099.0,9198.0,8799.0,8202.0,7924.0,7501.0,7308.0,7183.0,6942.0,6874.0,6720.0,6785.0,6878.0,6860.0,0.0,7120.0,7474.0,7738.0,8209.0,8726.0,9103.0,9853.0,10408.0,11487.0,12504.0,13342.0,14669.0,15944.0,17771.0,19441.0,21724.0,24187.0,26213.0,29024.0,31871.0,34643.0,37604.0,39615.0,42613.0,44035.0,46611.0,"TEMP:200,205,210,215,220,225,230,235,240,245,250,255,260,265,270,275,280,285,290,295,300,305,310,315,320,325,330,335,340,345,350,355,360,365,370,375,380,385,390,395,400;HTDR:100;CTDR:0;TRSH:0.002;NEUTR;ENV;;Preheating:300"
31,30.36,49.19,99937.0,11076.0,10089.0,9636.0,8986.0,8611.0,8132.0,7936.0,7818.0,7528.0,7474.0,7318.0,7406.0,7464.0,7442.0,7704.0,7761.0,8107.0,8352.0,8873.0,9404.0,9862.0,10533.0,11123.0,12221.0,13283.0,14176.0,15533.0,16916.0,18700.0,20361.0,22903.0,25333.0,27280.0,30381.0,33147.0,36187.0,39211.0,41361.0,44312.0,46052.0,48375.0,"TEMP:200,205,210,215,220,225,230,235,240,245,250,255,260,265,270,275,280,285,290,295,300,305,310,315,320,325,330,335,340,345,350,355,360,365,370,375,380,385,390,395,400;HTDR:100;CTDR:0;TRSH:0.002;NEUTR;ENV;;Preheating:300"
32,30.33,48.37,99939.0,11413.0,10388.0,9899.0,9215.0,8888.0,8405.0,8183.0,8058.0,7778.0,7721.0,7528.0,7637.0,7710.0,7704.0,7960.0,8021.0,8432.0,8718.0,9231.0,9844.0,10337.0,11041.0,11797.0,13021.0,14185.0,15154.0,16583.0,18153.0,20128.0,21950.0,24797.0,27404.0,29490.0,32838.0,35637.0,39065.0,42570.0,44973.0,47989.0,50068.0,52531.0,"TEMP:200,205,210,215,220,225,230,235,240,245,250,255,260,265,270,275,280,285,290,295,300,305,310,315,320,325,330,335,340,345,350,355,360,365,370,375,380,385,390,395,400;HTDR:100;CTDR:0;TRSH:0.002;NEUTR;ENV;;Preheating:300"
33,30.25,47.71,99943.0,11487.0,10460.0,9946.0,9255.0,8918.0,8398.0,8189.0,8058.0,7738.0,7653.0,7517.0,7587.0,7637.0,7598.0,7865.0,7912.0,8260.0,8514.0,9025.0,9549.0,10022.0,10737.0,11339.0,12496.0,13609.0,14527.0,15872.0,17248.0,19176.0,20947.0,23516.0,26036.0,28191.0,31351.0,34056.0,37207.0,40411.0,42873.0,45952.0,47396.0,49861.0,"TEMP:200,205,210,215,220,225,230,235,240,245,250,255,260,265,270,275,280,285,290,295,300,305,310,315,320,325,330,335,340,345,350,355,360,365,370,375,380,385,390,395,400;HTDR:100;CTDR:0;TRSH:0.002;NEUTR;ENV;;Preheating:300"
34,30.16,45.21,99941.0,12006.0,10870.0,10377.0,9584.0,9263.0,8769.0,8542.0,8392.0,8095.0,8015.0,7795.0,7853.0,7936.0,7900.0,8158.0,8164.0,8597.0,8843.0,9396.0,10041.0,10460.0,11302.0,11951.0,13208.0,14418.0,15386.0,17108.0,18585.0,20741.0,22779.0,25813.0,28572.0,31006.0,34586.0,37773.0,41361.0,45021.0,47530.0,50914.0,52860.0,55722.0,"TEMP:200,205,210,215,220,225,230,235,240,245,250,255,260,265,270,275,280,285,290,295,300,305,310,315,320,325,330,335,340,345,350,355,360,365,370,375,380,385,390,395,400;HTDR:100;CTDR:0;TRSH:0.002;NEUTR;ENV;;Preheating:300"
35,30.27,49.4,99949.0,9610.0,8784.0,8412.0,7813.0,7587.0,7188.0,6988.0,6905.0,6665.0,6590.0,6460.0,6516.0,6594.0,6561.0,6790.0,6798.0,7149.0,7369.0,7824.0,8325.0,8755.0,9396.0,9984.0,10950.0,12047.0,12815.0,14243.0,15544.0,17219.0,18918.0,21221.0,23645.0,25687.0,28767.0,31351.0,34501.0,37739.0,40066.0,43180.0,45262.0,47503.0,"TEMP:200,205,210,215,220,225,230,235,240,245,250,255,260,265,270,275,280,285,290,295,300,305,310,315,320,325,330,335,340,345,350,355,360,365,370,375,380,385,390,395,400;HTDR:100;CTDR:0;TRSH:0.002;NEUTR;ENV;;Preheating:300"
36,30.23,47.55,99945.0,11437.0,10398.0,9881.0,9158.0,8873.0,8365.0,8145.0,8021.0,7749.0,7670.0,7474.0,7560.0,7665.0,7587.0,7842.0,7889.0,8286.0,8542.0,9072.0,9619.0,10128.0,10870.0,11512.0,12631.0,13760.0,14638.0,16213.0,17741.0,19659.0,21393.0,23899.0,26543.0,28514.0,31585.0,34586.0,37604.0,40645.0,42786.0,46052.0,47370.0,49773.0,"TEMP:200,205,210,215,220,225,230,235,240,245,250,255,260,265,270,275,280,285,290,295,300,305,310,315,320,325,330,335,340,345,350,355,360,365,370,375,380,385,390,395,400;HTDR:100;CTDR:0;TRSH:0.002;NEUTR;ENV;;Preheating:300"
37,30.13,45.97,99941.0,13258.0,12006.0,11388.0,10565.0,10177.0,9566.0,9312.0,9143.0,8784.0,8675.0,8514.0,8590.0,8668.0,8611.0,8888.0,8956.0,9396.0,9654.0,10216.0,10848.0,11363.0,12116.0,12776.0,14016.0,15263.0,16213.0,17801.0,19159.0,21328.0,23257.0,26020.0,28708.0,30802.0,34111.0,37174.0,40528.0,43491.0,46052.0,48879.0,50518.0,52695.0,"TEMP:200,205,210,215,220,225,230,235,240,245,250,255,260,265,270,275,280,285,290,295,300,305,310,315,320,325,330,335,340,345,350,355,360,365,370,375,380,385,390,395,400;HTDR:100;CTDR:0;TRSH:0.002;NEUTR;ENV;;Preheating:300"
38,30.06,48.43,99947.0,10848.0,9881.0,9429.0,8784.0,8486.0,7978.0,7789.0,7659.0,7395.0,7318.0,7159.0,7258.0,7288.0,7283.0,7479.0,7522.0,7889.0,8126.0,8597.0,9150.0,9566.0,10276.0,10984.0,12026.0,13126.0,13979.0,15341.0,16649.0,18439.0,20205.0,22609.0,25197.0,27122.0,30186.0,32966.0,35940.0,39138.0,41080.0,44266.0,45952.0,48542.0,"TEMP:200,205,210,215,220,225,230,235,240,245,250,255,260,265,270,275,280,285,290,295,300,305,310,315,320,325,330,335,340,345,350,355,360,365,370,375,380,385,390,395,400;HTDR:100;CTDR:0;TRSH:0.002;NEUTR;ENV;;Preheating:300"
39,30.05,47.92,99943.0,12109.0,10984.0,10481.0,9725.0,9329.0,8828.0,8640.0,8480.0,8158.0,8114.0,7948.0,8021.0,8095.0,8082.0,8345.0,8378.0,8784.0,9009.0,9575.0,10138.0,10607.0,11487.0,12033.0,13242.0,14359.0,15308.0,16916.0,18200.0,20302.0,22088.0,24652.0,27263.0,29265.0,32560.0,35339.0,38566.0,41853.0,43989.0,47237.0,48682.0,51223.0,"TEMP:200,205,210,215,220,225,230,235,240,245,250,255,260,265,270,275,280,285,290,295,300,305,310,315,320,325,330,335,340,345,350,355,360,365,370,375,380,385,390,395,400;HTDR:100;CTDR:0;TRSH:0.002;NEUTR;ENV;;Preheating:300"
40,29.96,47.76,99943.0,11400.0,10357.0,9871.0,9135.0,8858.0,8325.0,8126.0,8009.0,7761.0,7637.0,7485.0,7565.0,7648.0,7604.0,7836.0,7877.0,8273.0,8542.0,9048.0,9584.0,10060.0,10826.0,11475.0,12639.0,13742.0,14669.0,16238.0,17801.0,19677.0,21546.0,24256.0,26593.0,28826.0,32163.0,34987.0,38356.0,41240.0,44035.0,47079.0,48542.0,51007.0,"TEMP:200,205,210,215,220,225,230,235,240,245,250,255,260,265,270,275,280,285,290,295,300,305,310,315,320,325,330,335,340,345,350,355,360,365,370,375,380,385,390,395,400;HTDR:100;CTDR:0;TRSH:0.002;NEUTR;ENV;;Preheating:300"
41,29.94,45.59,99945.0,10523.0,9619.0,9174.0,8542.0,8273.0,7778.0,7593.0,7490.0,7208.0,7111.0,6960.0,7016.0,7077.0,7044.0,7243.0,7268.0,7665.0,7889.0,8392.0,8933.0,9345.0,10118.0,10803.0,11938.0,13061.0,13969.0,15544.0,17052.0,0.0,20864.0,23516.0,26213.0,28495.0,31847.0,34728.0,38079.0,41402.0,44266.0,47396.0,48907.0,51917.0,"TEMP:200,205,210,215,220,225,230,235,240,245,250,255,260,265,270,275,280,285,290,295,300,305,310,315,320,325,330,335,340,345,350,355,360,365,370,375,380,385,390,395,400;HTDR:100;CTDR:0;TRSH:0.002;NEUTR;ENV;;Preheating:300"
42,29.89,47.37,99947.0,12459.0,11302.0,10748.0,9974.0,9654.0,9103.0,8858.0,8726.0,8419.0,8325.0,8164.0,8228.0,8345.0,8299.0,0.0,8619.0,9072.0,9362.0,9955.0,10512.0,10984.0,11884.0,12639.0,13868.0,15186.0,16102.0,17831.0,19405.0,21546.0,23698.0,26543.0,28984.0,31166.0,34987.0,37942.0,41280.0,44782.0,47237.0,50427.0,52206.0,55503.0,"TEMP:200,205,210,215,220,225,230,235,240,245,250,255,260,265,270,275,280,285,290,295,300,305,310,315,320,325,330,335,340,345,350,355,360,365,370,375,380,385,390,395,400;HTDR:100;CTDR:0;TRSH:0.002;NEUTR;ENV;;Preheating:300"
43,29.86,49.47,99945.0,10803.0,9834.0,9396.0,8690.0,8446.0,7960.0,7761.0,7670.0,7375.0,7339.0,7203.0,7268.0,7339.0,7339.0,7560.0,7582.0,7984.0,8177.0,8755.0,9271.0,9672.0,10418.0,11053.0,12102.0,13184.0,14053.0,15499.0,16701.0,18552.0,20263.0,22657.0,24812.0,26967.0,29929.0,32310.0,35517.0,38391.0,40567.0,43446.0,45165.0,47503.0,"TEMP:200,205,210,215,220,225,230,235,240,245,250,255,260,265,270,275,280,285,290,295,300,305,310,315,320,325,330,335,340,345,350,355,360,365,370,375,380,385,390,395,400;HTDR:100;CTDR:0;TRSH:0.002;NEUTR;ENV;;Preheating:300"
44,29.82,48.08,99943.0,11425.0,10388.0,9871.0,9150.0,8880.0,8365.0,8196.0,8003.0,7693.0,7648.0,7474.0,7582.0,7648.0,7626.0,0.0,7889.0,8299.0,8555.0,9040.0,9610.0,10089.0,10848.0,11487.0,12616.0,13742.0,14598.0,16213.0,17741.0,19549.0,21459.0,24214.0,26813.0,28905.0,32065.0,34757.0,38148.0,41080.0,43581.0,46406.0,48181.0,50277.0,"TEMP:200,205,210,215,220,225,230,235,240,245,250,255,260,265,270,275,280,285,290,295,300,305,310,315,320,325,330,335,340,345,350,355,360,365,370,375,380,385,390,395,400;HTDR:100;CTDR:0;TRSH:0.002;NEUTR;ENV;;Preheating:300"
45,29.93,49.05,99947.0,11978.0,10848.0,10337.0,9566.0,9263.0,8726.0,8549.0,8378.0,8070.0,8033.0,7853.0,7960.0,8045.0,8009.0,0.0,8286.0,8718.0,8941.0,9463.0,9984.0,10418.0,11218.0,11765.0,12886.0,14016.0,14823.0,16289.0,17741.0,19567.0,21200.0,23751.0,26052.0,28022.0,31212.0,33947.0,36979.0,39952.0,42485.0,45360.0,47079.0,49423.0,"TEMP:200,205,210,215,220,225,230,235,240,245,250,255,260,265,270,275,280,285,290,295,300,305,310,315,320,325,330,335,340,345,350,355,360,365,370,375,380,385,390,395,400;HTDR:100;CTDR:0;TRSH:0.002;NEUTR;ENV;;Preheating:300"
46,29.96,46.78,99945.0,12707.0,11500.0,10915.0,10118.0,9798.0,9215.0,8971.0,8828.0,8528.0,8405.0,8247.0,8339.0,8446.0,8405.0,8654.0,8661.0,9135.0,9412.0,9927.0,10575.0,10984.0,11884.0,12496.0,13724.0,14907.0,15801.0,17476.0,18851.0,21031.0,22853.0,25578.0,27893.0,30425.0,33542.0,36249.0,39430.0,42699.0,44782.0,47557.0,49107.0,51568.0,"TEMP:200,205,210,215,220,225,230,235,240,245,250,255,260,265,270,275,280,285,290,295,300,305,310,315,320,325,330,335,340,345,350,355,360,365,370,375,380,385,390,395,400;HTDR:100;CTDR:0;TRSH:0.002;NEUTR;ENV;;Preheating:300"
47,29.83,46.89,99941.0,14418.0,13069.0,12386.0,11400.0,10984.0,10377.0,10070.0,9899.0,9480.0,9455.0,9263.0,9345.0,9429.0,9412.0,9690.0,9707.0,10147.0,10398.0,11065.0,11699.0,12158.0,12997.0,13671.0,15003.0,16189.0,17094.0,18750.0,20341.0,22274.0,24228.0,26984.0,29265.0,31538.0,34757.0,37538.0,40450.0,43626.0,45952.0,48710.0,50247.0,52400.0,"TEMP:200,205,210,215,220,225,230,235,240,245,250,255,260,265,270,275,280,285,290,295,300,305,310,315,320,325,330,335,340,345,350,355,360,365,370,375,380,385,390,395,400;HTDR:100;CTDR:0;TRSH:0.002;NEUTR;ENV;;Preheating:300"
48,29.76,47.21,99943.0,12186.0,11030.0,10481.0,9698.0,9370.0,8850.0,8647.0,8500.0,8158.0,8120.0,7924.0,8009.0,8120.0,8070.0,0.0,8325.0,8755.0,8986.0,9549.0,10167.0,10650.0,11437.0,12172.0,13317.0,14497.0,15499.0,17135.0,18471.0,20700.0,22560.0,25486.0,28228.0,30229.0,33596.0,36001.0,39877.0,43224.0,45360.0,48264.0,50277.0,52531.0,"TEMP:200,205,210,215,220,225,230,235,240,245,250,255,260,265,270,275,280,285,290,295,300,305,310,315,320,325,330,335,340,345,350,355,360,365,370,375,380,385,390,395,400;HTDR:100;CTDR:0;TRSH:0.002;NEUTR;ENV;;Preheating:300"
49,29.75,48.16,99947.0,10439.0,9532.0,9127.0,8459.0,8221.0,7738.0,7582.0,7432.0,7178.0,7111.0,6942.0,7006.0,7077.0,7072.0,7263.0,7308.0,7681.0,7877.0,8378.0,8933.0,9379.0,10012.0,10683.0,11817.0,12839.0,13742.0,15319.0,16518.0,18552.0,20341.0,22953.0,25516.0,27565.0,30938.0,33622.0,36946.0,39952.0,42613.0,45654.0,47370.0,49979.0,"TEMP:200,205,210,215,220,225,230,235,240,245,250,255,260,265,270,275,280,285,290,295,300,305,310,315,320,325,330,335,340,345,350,355,360,365,370,375,380,385,390,395,400;HTDR:100;CTDR:0;TRSH:0.002;NEUTR;ENV;;Preheating:300"
50,29.76,50.45,99949.0,10147.0,9280.0,8888.0,8260.0,7978.0,7582.0,7411.0,7258.0,7030.0,6946.0,6834.0,6914.0,6988.0,6969.0,7169.0,7228.0,7571.0,7749.0,8260.0,8755.0,9150.0,9834.0,10449.0,11413.0,12459.0,13250.0,14628.0,15956.0,17622.0,19194.0,21546.0,23913.0,25734.0,28630.0,30847.0,34194.0,37044.0,39283.0,42103.0,43716.0,46203.0,"TEMP:200,205,210,215,220,225,230,235,240,245,250,255,260,265,270,275,280,285,290,295,300,305,310,315,320,325,330,335,340,345,350,355,360,365,370,375,380,385,390,395,400;HTDR:100;CTDR:0;TRSH:0.002;NEUTR;ENV;;Preheating:300"
