series,200,205,210,215,220,225,230,235,240,245,250,255,260,265,270,275,280,285,290,295,300,305,310,315,320,325,330,335,340,345,350,355,360,365,370,375,380,385,390,395,400
1,-0.9835770576878275,-0.9820569673152315,-0.9815150613007118,-0.9801289516508433,-0.9794997209729837,-0.977851616008293,-0.9769238663519477,-0.9758596143728142,-0.9742097301188287,-0.9727218207620552,-0.9705109376207777,-0.968775579468546,-0.966601437810531,-0.9641385670300903,-0.9621523096505962,-0.9587829784492479,-0.9565610129849181,-0.9526748625149257,-0.9500913984806051,-0.9471761126909596,-0.9424895404605599,-0.9380300612981779,-0.9323221133361739,-0.9282182870124458,-0.9227625826211844,-0.9153743261318957,-0.9087160174911688,-0.9003833482156604,-0.8924466217113515,-0.882288356806829,-0.8746754441559503,-0.8673411992888315,-0.8552562206648235,-0.848412955174521,-0.8356047050541199,-0.8288452061545201,-0.8212059402025164,-0.8088091588919634,-0.8030851367915158,-0.7904689644507162,-0.7885616031400227
2,-0.983266432984059,-0.9816974127843714,-0.9811801401932393,-0.9797703241529836,-0.9791427305255556,-0.9774813964681056,-0.976523137220406,-0.9754882238247037,-0.9739622874945872,-0.9724368071348412,-0.9704078740563242,-0.9688288180372271,-0.9667887972909207,-0.9643393672561764,-0.9623707341322146,-0.9591453789904326,-0.9569158803129285,-0.953070079547939,-0.9505777390196045,-0.948027577541168,-0.9437906051226232,-0.9396422873457049,-0.9345888368129527,-0.930702535731505,-0.9263649852809319,-0.9192168943293746,-0.913361136614743,-0.9061951534932414,-0.9001121423617772,-0.8902138426972828,-0.8845364899583614,-0.8779117504444803,-0.8671638912106989,-0.8608205423152042,-0.8488398697603473,-0.8444998083556918,-0.8356505812198853,-0.8258277873211476,-0.8210058669922339,-0.8115588331947962,-0.8104868475540592
3,-0.9830441756529144,-0.9814514017895722,-0.9809196459985385,-0.9795273829447559,-0.9788144634474608,-0.9771389433934323,-0.9761957121982925,-0.9751735734992211,-0.9736586079102908,-0.9719855355584189,-0.9702017469274175,-0.9686025541203325,-0.9665389846504011,-0.9641757522571432,-0.9622954153454496,-0.959064845536836,-0.9568271634809259,-0.953170986024453,-0.9506867463817941,-0.9485814430262549,-0.9442753154869213,-0.9402888571668486,-0.9354835960801022,-0.9316423008719387,-0.9275155323859173,-0.9205707105508492,-0.9149795365773953,-0.9075345629214521,-0.9015655663927048,-0.8931222778864402,-0.8868126401297541,-0.8798448359463391,-0.8708352086414196,-0.864547012233845,-1.0,-0.8483710233806055,-0.8408852025683987,-0.8316343849326764,-0.8266160874768057,-0.8179476522781312,-0.8161673358419906
4,-0.9821872799183807,-0.9806565970371445,-0.9801652277463531,-0.9785710429504632,-0.9778789022748908,-0.9761300951464218,-0.9751108113787526,-0.9741316166836888,-0.9724551369651162,-0.9709404855919673,-0.9688297132256319,-0.9672848995454757,-0.9652621644877453,-0.9626288468117387,-0.9608417627608854,-0.9574139097381053,-0.9551818695056052,-0.9513126250819866,-0.9491690284928475,-0.9467875801864956,-0.9424130072451444,-0.9383323536820892,-0.9338219002982531,-0.9301958797427495,-0.9259127012465582,-0.9187548133436018,-0.9135478750719721,-0.9067878806540013,-0.9015655663927048,-0.8931222778864402,-0.8877803446936398,-0.881719734928075,-0.8733684819648942,-0.8676683801238961,-0.8577806459182775,-0.8526255270218475,-0.8480346754638832,-0.8394725202382299,-0.8358017334515452,-0.827487386673368,-0.8284465529968852
5,-0.9803476318883036,-0.9787232029369928,-0.9782368940972692,-0.9767586244128921,-0.975921609821751,-0.9740383547443634,-0.9729605575021869,-0.9718723241826829,-0.9702000348669152,-0.9685356831123488,-0.9663110973693025,-0.9646296259325068,-0.962472590001943,-0.959616843420446,-0.9576105868086677,-0.9540798247592049,-0.9521574320509718,-0.9481256621987522,-0.9452950745442654,-0.9425385225844851,-0.938280213612708,-0.9340078931900243,-0.9289390711546656,-0.9256768351978818,-0.9215961659009577,-0.914693364679178,-0.9094318482438805,-0.9025926039966746,-0.8974118723347745,-0.8895812580436411,-0.8839776746468219,-0.8791013415225473,-0.8707130457146531,-0.8651281498256588,-0.8559619841013757,-0.8511087992115206,-0.8464424347753692,-0.8389993519651913,-0.835670925201905,-0.826458023235584,-0.8279784303487514
6,-0.979048899290651,-0.9772502909553111,-0.9767923353812011,-0.975239277809056,-0.9745962314939435,-0.9726685424456702,-0.9715189100167622,-0.9702990725552701,-0.9685522919373071,-0.9668612280524662,-0.9645783411919301,-0.9628261694184352,-0.9605642989979737,-0.9577352709315643,-0.9559083822277791,-0.952622169249106,-0.9500685539156384,-0.9461075326684718,-0.9432155494809572,-0.9404966602737914,-0.9357546175039967,-0.9316063481400622,-0.9261354921175969,-0.9228085085518628,-0.917977893625969,-0.9098293543026225,-0.9039619676008777,-0.8957800905256027,-0.8886027947057,-0.8798961688637471,-0.8722221086418743,-0.8648391789235493,-0.8530637176107503,-0.8449740584971902,-0.832941245490012,-0.8257515194655861,-0.8201808702167737,-0.8096474896365862,-0.8034630272904767,-0.7948908778102105,-0.7953898921517437
7,-0.9705254645312111,-0.968450666910575,-0.9679558310103115,-0.9660692112508773,-0.9653719265994813,-0.9630798563548184,-1.0,-0.9606377601023387,-0.9584690049994657,-0.9561197769768367,-0.9536020715776455,-0.951193542161619,-0.9480597884919644,-0.9449212416891017,-0.9423133412166996,-0.9377798537512483,-0.9342043713202678,-0.9295504616471301,-0.9253467272635798,-0.9226076317703855,-0.9171485424674308,-0.9118145940045344,-0.9067916489135066,-0.9021173317207508,-0.8973156545819546,-0.8880142677637712,-0.8823469911766079,-0.8740339317055147,-0.8669858789157604,-0.857326711795886,-0.851648164427998,-0.8438079844835946,-0.8339291455024754,-0.8289358591849695,-0.8179695520811945,-0.8139736078409899,-0.8089207105764328,-0.8009247353857865,-0.796423605559835,-0.7891689702499468,-0.7915728920977296
8,-0.976978960531918,-0.9749321104273968,-0.9745696771225202,-0.972944833064684,-0.9721588484390901,-0.9702297212246862,-0.9691682915744256,-0.9679572488213508,-0.9662184580950293,-0.9644920522762495,-0.9620790497539358,-0.9604304338277866,-0.9581286257529076,-0.9552736089006559,-0.9532119696615927,-0.9494330444866798,-0.9466892491329946,-0.9421974067035536,-0.9386372402689966,-0.9359417366576285,-0.9310605802918467,-0.926114703165673,-0.9205027694929697,-0.9160258557991681,-0.9107968927293357,-0.9027846459405781,-0.8961267331663062,-0.8880977307017274,-0.879550250106978,-0.871439893551272,-0.8647666946074323,-0.8567512526264749,-0.8452002829036199,-0.8397677846076422,-0.828429790853891,-0.8221321798171166,-0.8168871174199457,-0.806937058333419,-0.8030851367915158,-0.7940644874446656,-0.7949487765794638
9,-0.9665167991730956,-0.9639278493908073,-0.9633751928333649,-0.9612065308766707,-0.9602755802120605,-0.9575820961830366,-0.9558953608272613,-0.9542725387638885,-0.9520411204651922,-0.9493625788983036,-0.9465422174125893,-0.9435671171980541,-0.9401906903155967,-0.9363760765123231,-0.9332826186835782,-0.9280594659021357,-0.9240180659730624,-0.9179209902288895,-0.9135823173288166,-0.9090089941141459,-0.9027432905881152,-0.8963556973717357,-0.8884959522795057,-0.8840002941873483,-0.8774707007228609,-0.8672368367719184,-0.8593625993993246,-0.8486698278781907,-0.8410382021808738,-0.830525481527801,-0.821581174738822,-0.813253596250202,-0.8028161769433549,-0.7971110871466743,-0.7864245695344813,-0.7849039040683349,-0.7782674756220666,-0.7701636545048706,-0.7698598413828854,-0.7637828381434729,-0.7684503339875047
10,-0.9738111241133137,-0.9718254331212802,-0.9711020595956589,-0.9694896692143359,-0.9687530775038571,-0.9665738032653364,-0.9654151211716929,-0.9643826147957868,-0.9624449580753462,-0.9604009191689478,-0.9579500657030223,-0.955871881384469,-0.9534238210231215,-0.9500230548407729,-0.9477814851358375,-0.9436507425184422,-0.9407290910557303,-0.9357814365718706,-0.9322309614449346,-0.9293284174327094,-0.9239685023300113,-0.9191535813250483,-0.9137792927141031,-0.9091042812431049,-0.9037507835622526,-0.8955372704795104,-0.8894041487060581,-0.8811312621239646,-0.8735816204571277,-0.8642706008099992,-0.8572499471851383,-0.8499757556166155,-0.838282003471999,-0.8316678049774135,-1.0,-0.8176422274544161,-0.8120271409393179,-0.802729975210097,-0.8007838805478443,-0.7911117125128067,-0.7936119263246971
11,-0.9758757072737059,-0.9739669903708773,-0.9733517821862567,-0.971521891702208,-0.9709401569116634,-0.9688228869719744,-0.9675751489295157,-0.966492319437137,-0.9646438232134924,-0.9628057216485664,-0.9606103939604751,-0.9587068351667365,-0.9563521803092125,-0.9533548511847213,-0.9510427886027611,-0.947162001095255,-0.9445277844987499,-0.939884966616774,-0.9366080262959299,-0.9335940083327823,-0.9287560801387802,-0.9240238475102863,-0.9184831700042607,-0.9141790130014464,-0.9092496052433209,-0.9016091767662437,-0.895792160097104,-0.8881747082550728,-0.8818299862773162,-0.8727196050345013,-0.8665249183925201,-0.8604170033942137,-0.8498038963544011,-0.8446864852558803,-1.0,-0.8303509828615233,-0.82491076167383,-0.8176399189442176,-0.8145139020100868,-0.8074703755968374,-0.8097261482508418
12,-0.9766736914264904,-0.9748564147366894,-0.9742009256001516,-0.9726170552440595,-0.9718880280996619,-0.9698641294287512,-0.9687382407991125,-0.967570383667069,-0.9659091548147274,-0.9640645318354284,-0.9619180129344773,-0.959911357783146,-0.9578371776723014,-0.954864571403073,-0.9528429076064443,-0.9492478175434075,-0.9464876199693524,-0.9421217268461681,-0.9391822770799443,-0.936636135176245,-0.931477261131331,-0.9270971534133848,-0.9217554324669791,-0.9176357143440848,-0.9128440730954478,-0.9049977706619108,-0.8992468215558426,-0.8916771869322906,-0.8844638562216878,-0.8755044317281194,-0.869196328174514,-0.8629384192662033,-0.852260014145181,-0.8456330805085254,-0.8359273708603444,-0.8323221814597821,-0.8271118002726582,-0.8194554450353333,-0.8173287017523461,-0.8094469467050704,-0.811796690732972
13,-0.9766924360206833,-0.9747586411361924,-0.9741264986873799,-0.9724126761323759,-0.9716828611758527,-0.9696929028914146,-0.9687186930365983,-0.9675342762526694,-0.965791057198612,-0.9639220250218213,-0.9619180129344773,-0.9601176572367852,-0.9576151219918394,-0.9549686900388213,-0.9530688639667392,-0.9494894179041974,-0.9467860311315429,-0.9423908107835388,-0.9393919066226165,-0.9360326697969711,-0.9310010544576346,-0.9264841716348979,-0.9210651896037495,-0.9161892932148957,-0.9109873281122299,-0.9027846459405781,-0.8961889793187159,-0.8881747082550728,-0.880199495359372,-0.8694694287106179,-0.8619112846618827,-0.8550767738807177,-0.8418633061145759,-0.8354961237523515,-1.0,-0.8186442534085309,-0.8121884463685465,-0.8020099365337338,-0.7988266015532268,-0.7889514991011193,-0.7899614699051152
14,-0.9751500236985227,-0.9731911095411264,-0.9724248288181007,-0.970742937352018,-0.9700128024160457,-0.9680222872163193,-0.9669496205290602,-0.9656876399162307,-0.9639127427327788,-0.9619684941186251,-0.9598889490093014,-0.9578616728889244,-0.9557137702278846,-0.9527078282339992,-0.9505230889740828,-0.9466949070643945,-0.9438987015081861,-0.9393888431072468,-0.9363313152996026,-0.9331310759870379,-0.9282968808462873,-0.9239566714249727,-0.9184831700042607,-0.9145222315744743,-0.9093448229347679,-0.9018929107048762,-0.8962512254711256,-0.8884056409151092,-0.8825456316123416,-0.873352189688143,-0.8666543999890963,-0.860985938257637,-0.8504661480100302,-0.845824796002732,-0.8362559033175911,-0.8318293818102174,-0.8260190860746583,-0.8188536984272298,-0.8174934232518931,-0.8124238850979103,-0.8136421742496535
15,-0.9761193869982139,-0.9741909234558868,-0.9734532734309453,-0.9717416956525092,-0.9709401569116634,-0.9690172522305728,-0.9678976870110005,-0.9668379189749621,-0.9651274610699644,-0.9632391798732877,-0.9610870629460719,-0.9591859822848663,-0.9568934410303384,-0.9541729261798872,-0.9521349110108535,-0.9483861095899236,-0.9456246471489637,-0.9412808395418846,-0.9380754330946351,-0.9353713378744792,-0.9303632776625055,-0.9257452346964481,-0.9205027694929697,-0.9156172622598492,-0.9103208042721004,-0.9028413927283044,-0.8967725369975569,-0.8887058533731564,-0.8814758525032831,-0.8720797492928867,-0.8650256578005847,-0.8577921448197834,-0.8458110975374525,-0.8407802820614209,-0.8304244522014608,-0.8265345233532279,-0.8200351749903737,-0.8108098377855725,-0.8089715080253284,-1.0,-0.802614284942655
16,-0.9700568496763879,-0.9678703332818183,-0.9672183279655742,-0.9652594072234519,-0.9644322620884351,-0.9620710081078079,-0.9606845626432484,-0.9595493794682926,-0.9573611368863845,-0.9551756693366902,-0.9526616165520084,-0.9502618672097001,-0.9473103505704056,-0.943857744195386,-0.9414622389262554,-0.9368456656895274,-0.9338978949915315,-0.9288693429306605,-0.9250951718123732,-0.9221198994775478,-0.9170720092520154,-0.9119909312284826,-0.9058116744780571,-0.9016678788275,-0.8964904345894134,-0.8891735235701836,-0.88268156424581,-0.8746112633556055,-0.8673252571158755,-0.8577266216343952,-0.851034830549479,-0.8439890092128657,-0.8335240789558285,-0.8283547215931557,-0.8175647531606582,-0.8139736078409899,-0.8084211840859186,-0.8005595729142022,-0.7988266015532268,-0.7928079874736619,-0.7958265065447148
17,-0.9764782120870499,-0.9745473239996342,-0.9740148583182224,-0.9723355519392879,-0.9715515543446148,-1.0,-0.9685232154114559,-0.9673588973827283,-0.9657123254545352,-0.9641714119456336,-0.9616990028600139,-0.9600710734891893,-0.9577608460321425,-0.9550728086745698,-0.9530387364520332,-0.9493686177238024,-0.9469876602951851,-0.9427608011974236,-0.9396434620738231,-0.937140400767145,-0.9322596006666893,-0.927928457469141,-0.9228291435875586,-0.9187225731586732,-0.9146294048100804,-0.9080783105670626,-0.9010130561304679,-0.8938017674046248,-0.8878797715837158,-0.8797071205764518,-0.8732375169518669,-0.8664296104735736,-0.8555648427956022,-0.8502941634614233,-0.8390190959490774,-0.8353063571154794,-0.8283293960932866,-0.8200571916434368,-0.817163980252799,-0.8087317082600375,-0.810104247312796
18,-0.9721294662342913,-0.9698825770597901,-0.9691500446561476,-0.9672762048727065,-0.9664757246495749,-0.9643478582799601,-0.9633186236420413,-0.961958259828954,-0.9600098977049697,-0.9580911212317339,-0.9555796037205947,-0.9534961102570757,-0.9510575401781997,-0.9477175707634871,-0.9452583057792106,-0.9411058853847888,-0.9379546737640132,-0.933115823817292,-0.9296315551157993,-0.9264020236756828,-0.921230313956257,-0.916004702325972,-0.9102428632296549,-0.9059254235072035,-0.9004340339768462,-0.8924486238903976,-0.886260718009368,-0.8780059734581396,-0.8711690841215269,-0.8606932255273356,-0.8539106849576459,-0.847131081299499,-0.8355429820613387,-0.831332302862552,-0.8209908773576604,-0.8176422274544161,-0.8117045300808609,-0.804859232438771,-0.8023245110436076,-0.7953016566468848,-0.7990673556471796
19,-0.9711895587254747,-0.9689836907326397,-0.9681858778316057,-0.9661270543956934,-0.9651790696911007,-0.9628530968864537,-0.9614762470250748,-0.96008583248223,-0.9579403775749498,-0.9554309940444028,-0.9529901316637036,-0.9504748214844244,-0.9477614011713437,-0.9440585444214722,-0.9410253899630184,-0.936281931514351,-0.9328574885071377,-0.9273473369099073,-0.9230072615673581,-0.9186231069373718,-0.9125310384706963,-0.9062053908808464,-0.8994120153387303,-0.8936594454568484,-0.8872146444809446,-0.8761785091808196,-0.8694309145515943,-0.8589309357391385,-0.8490504788183736,-0.8357897492201758,-0.8271556982124725,-0.8168870211734282,-0.804520028290362,-0.7944749991013336,-0.782106714382095,-0.7759404259979192,-0.7684538614438396,-0.7578664225392678,-0.7543711756754793,-0.7466074500782897,-0.7491852865450748
20,-0.9752812358578732,-0.9731911095411264,-0.9724248288181007,-0.970742937352018,-0.969930735646522,-0.9678325497019733,-0.9668176731320891,-0.965641216097717,-0.9636709238045428,-0.9618022361694168,-0.9597472366081781,-0.9578084343202433,-0.9555541677075526,-0.9525665243711978,-0.9503950470365823,-0.94656605353864,-0.9438664408420034,-0.939430887472461,-0.9356856563081722,-0.9329244097612591,-0.9277186298853702,-0.9226215467293644,-0.9169748615253515,-0.9125201232318114,-0.9067580756504559,-0.898634023752584,-0.8920962947977779,-0.8837715922037134,-0.8759941567927284,-0.8651067759268819,-0.8583743926290898,-0.851281719734928,-0.8390535587989455,-0.8316678049774135,-0.8213780763251298,-0.8154574823413459,-0.809420237066947,-0.8005595729142022,-0.7978334278059581,-1.0,-0.7929367494283502
21,-0.9725364917081949,-0.9703651370880498,-0.9697285447508728,-0.9676926755153824,-0.9669352985589075,-0.9647874939839325,-0.9635238751484408,-0.9622780683564937,-0.960336072073288,-0.9584533260496517,-0.9559789750328516,-0.953802232026992,-0.9510228439781275,-0.9480968600794276,-0.9457478778931829,-0.9415488193795702,-0.9384547140898459,-0.9337633070415903,-0.9298579550218853,-0.9269558891607698,-0.9216384911051396,-0.9164833319338316,-0.9103280783979548,-0.9056148924173211,-0.8999579455196108,-0.8915649953386567,-0.884906864194457,-0.8763355605505435,-0.8680040135161057,-0.8578575012179073,-0.8497877183298237,-0.8412671731048974,-0.8299813540795988,-0.82393927411721,-0.8131647648939603,-0.8081092920111701,-0.8018596954969768,-0.7913585072569612,-0.7884249233318315,-0.7805571127563743,-0.7849696620514575
22,-0.9773110076290499,-0.9754682882365743,-0.974786191777856,-0.9730528069350074,-0.9722655352394708,-1.0,-0.9693148997932824,-0.9681996843180342,-0.9664659007192707,-0.9648958215814694,-0.9623302671922909,-0.9608496875561501,-0.958600494073889,-0.9561288691228749,-0.954183582010861,-0.9504397126566375,-0.9481813049439471,-0.9439548611695061,-0.9404568246993912,-0.9375950664638583,-0.9329654069866322,-0.9290284658661516,-0.9229654878568385,-0.9188778387036144,-0.9138359240480215,-0.9062624133598152,-0.9004684022968831,-0.8926778951257813,-0.885149990408877,-0.875809817422981,-0.8687192907134436,-0.8622466461936318,-0.8498038963544011,-0.8446864852558803,-0.8340617758352644,-0.8282100421617478,-0.8214973306553163,-0.8138854315603238,-0.8095044305238628,-1.0,-0.8036315514664842
23,-0.9704638751502915,-0.9682109638900015,-0.9674010122060137,-0.9654367928675546,-0.9646661523815776,-0.9621913294583688,-0.9612172391717613,-0.9596731763176627,-0.957608579510626,-0.9557456965911183,-0.9529579242998119,-0.9504748214844244,-0.9479487606517334,-0.944378337374128,-0.9416354721358149,-0.9374093998647038,-0.9337446568271635,-0.9286423033585038,-0.9245836757282531,-0.9205575028106606,-0.9150226198170006,-0.9098412964984466,-0.902002556455049,-0.8969690531253319,-0.8908170471406921,-0.8814154270195776,-0.8746206875087533,-0.8637805215999015,-0.8559044429033067,-0.8453875853443951,-0.8349859273948984,-0.8270890577016324,-0.8131292998135408,-0.8052350312136789,-0.7940570825144466,-0.788057821825549,-0.7809212101029233,-0.7725706409372847,-0.7703782296314599,-0.7637828381434729,-0.7658801606020778
24,-0.9731389965215389,-0.9710400903301909,-0.9703577904679423,-0.968494767123499,-0.9675836260381446,-1.0,-0.9644084114022099,-0.9630724314732857,-0.9612414871301717,-0.9590767933591825,-0.9571513230785087,-0.9550200642855717,-0.9526743831015627,-0.9494727134803885,-0.947231657992453,-0.9432319685597397,-0.9401000080651666,-0.9354534905232,-0.9318620134498314,-0.9282868196547848,-0.9232541923194666,-0.9177260895121336,-0.9119130805283341,-0.907143032254374,-0.9015449070437287,-0.8933241457581776,-0.8867353449214921,-0.8772669889460233,-0.8697673045993124,-0.8587736583024917,-0.851034830549479,-0.8431808631000485,-0.83083006493924,-0.82393927411721,-0.8120266345956411,-0.8081092920111701,-0.8006004724688056,-0.7919602538650647,-0.7890789645800328,-0.7807890819817904,-0.7834977764174214
25,-0.9704638751502915,-0.9683907411554317,-0.9676648894422041,-0.9656103223020029,-0.9647810458589108,-0.9623671837399578,-0.9613052041030754,-0.9597918149649758,-0.9578166562628291,-0.9557160076716168,-0.953247790574837,-0.9509938975290649,-0.9482818441724262,-0.9450402344156713,-0.9422681499446407,-0.9380456141481172,-0.9348657149770143,-0.9296009148853871,-0.9256653641684416,-0.9219793664440182,-0.916289669716657,-0.9103871021916198,-0.903996591393268,-0.8993143800410228,-0.8927769446229776,-0.8842284463540189,-0.8776085028244192,-0.8685223388859808,-0.8594162694958021,-0.8479906348386909,-0.8397426723638569,-0.8305285275577824,-0.8182601427377355,-0.8109086116203554,-0.7985802704526122,-0.7931719870776981,-0.7843606581261513,-0.7744633140294392,-0.7708917731300476,-0.7632319112331097,-0.7657361228641905
26,-0.9689000404347675,-0.9668105936119145,-0.9659666026144145,-0.9638981652154465,-0.9630945737451991,-1.0,-0.9595068099517658,-0.9577233759400823,-0.955837115268897,-0.9534715253573062,-0.9508773285924094,-0.948584852296246,-0.9458253532073168,-0.9419389864794514,-0.9392629303527179,-0.9344055020455497,-0.9311638035325429,-0.9257664687778544,-0.9216404769491355,-0.917465776073011,-0.9110513963059969,-0.9058023343689646,-0.8985002130379207,-0.8932018206928112,-0.886373554873162,-0.8775971788739816,-0.8706680568307371,-0.8603858114973674,-0.8513597261365481,-0.8400651489482371,-0.8310128868262697,-0.8225957653143688,-0.8109175078762939,-0.8046299291850894,-0.7932005514651961,-0.7899797404588512,-0.7809212101029233,-0.774694755032556,-0.7716620883779293,-0.7659527169395527,-0.770966493221224
27,-0.9704638751502915,-0.9683308154002883,-0.9676378251102872,-0.965668165446819,-0.9648384925975774,-0.9624227166709859,-0.9614176037375322,-0.9598795043999464,-0.9580865936710925,-0.9561197769768367,-0.9534410347581871,-0.9512334710881298,-0.9487190162933355,-0.9452707828233999,-0.9427727858159661,-0.9384080146893019,-0.9354060811355754,-0.9300465851566573,-0.9262187861610961,-0.9227481648039151,-0.9168339059151672,-0.9121672684524309,-0.9052151682999574,-0.9001887702151654,-0.8947289072976425,-0.8850066880142677,-0.8790557258679448,-0.8698925393355298,-0.8620353838662554,-0.8509499676436585,-0.8440905280804694,-0.8349313075804106,-0.8233459782678583,-0.8170614807625484,-0.806447449473468,-0.8011772436072935,-0.7950224266580637,-0.7853821862431468,-0.7839580638441154,-0.7767151224604203,-0.7807475558596352
28,-0.9738861024900854,-0.9717528914176856,-0.9710343987658665,-0.969443394698483,-0.9682976069330007,-0.9662961386101958,-0.9652489651903219,-0.9639544840250482,-0.962062546746973,-0.9601990345163378,-0.9577374971013373,-0.955871881384469,-0.9535417881033669,-0.9502461662030909,-0.9481279515549563,-0.944061463131785,-0.9411404145495604,-0.9366980037335396,-0.9330527092522095,-0.9296177501487997,-0.9241640872138508,-0.9194558737089596,-0.9133617383894334,-0.908327953518399,-0.9029731724154347,-0.8942483077297232,-0.8872021910645648,-0.8778212273301106,-0.8706378834604772,-0.8601842493692331,-0.8528680173641636,-0.8449587845482464,-0.8321867163891211,-0.8261140467546162,-0.8149775600598398,-0.8096862508897772,-0.8029263926902623,-0.7941306561609595,-0.7910168645747037,-0.7835823780711759,-0.7871392304783853
29,-0.9717947413379892,-0.9696617979618936,-0.9688827843784676,-0.9672222179375448,-0.9661597675869087,-0.963954500018511,-0.9629472161542709,-0.9613908576026741,-0.9594362807124098,-0.9576042229519098,-0.9550449614799927,-0.9530901661708825,-0.9505232186970883,-0.9473308444021359,-0.9449570306321505,-0.9405663112456915,-0.9377772401000081,-0.932964464102521,-0.9290697479414379,-0.9257737583493155,-0.9199632640566006,-0.9151985893022084,-0.9088708990200256,-0.9037517058780267,-0.8981250049592547,-0.8888897896315512,-0.8827671527053734,-0.8740339317055147,-1.0,-0.8548981684129396,-0.8482066798874192,-0.8398706966219492,-0.8276023918215135,-0.8212013372155721,-0.8083951776128597,-0.8038766905765756,-0.7982225182379203,-0.7881029038131191,-0.7862157173379067,-0.7772032243722333,-0.7799868565564178
30,-0.9729569061779505,-0.970989626536386,-0.9702326179328263,-0.968371368414558,-0.9674851459147162,-0.9652872903631854,-0.9642862378864959,-0.9629486346239154,-0.9609603023298973,-0.9591836734693877,-0.9567133029295818,-0.9548470389373581,-0.9522719071807255,-0.9489818684832889,-1.0,-0.9426601810392037,-0.9397209452375191,-0.9349321403945443,-0.9311660433681598,-0.9278652205541962,-0.9225909044525324,-0.9172642539256025,-0.9113080528334043,-0.906129720276863,-0.9007831655121522,-0.8918406225933282,-0.8858638987877562,-0.8772669889460233,-0.8688893479511886,-0.8586427787189798,-0.8519548313672575,-0.8436269597543236,-0.8314601684562464,-0.8261140467546162,-0.813023965269426,-0.8103104637792258,-0.8043313109448336,-0.7962547702562309,-0.7935506688177356,-0.7871923991417139,-0.7901955312291821
31,-0.9703406963884522,-0.9681794240188735,-0.9674010122060137,-0.9653481000455033,-0.9646661523815776,-0.9623671837399578,-0.9612172391717613,-0.9596731763176627,-0.9576648164706809,-0.9556210031292122,-0.9528613022081369,-0.9507143950434892,-0.9482055125322675,-0.9446535080543201,-0.9419744066762573,-0.9374979866636601,-0.9346156948140979,-0.9297690923462437,-0.9255982827147864,-0.9222604325110773,-0.916136603285826,-0.9115542866739441,-0.9052151682999574,-0.9001315671196607,-0.8946019503757131,-0.8850796481699161,-0.8791413143275081,-0.8697847707608461,-0.8620353838662554,-0.8519533777839178,-0.8439201575586586,-0.8362178761920155,-0.8245997556741465,-0.8179841115784177,-0.8055381185650171,-0.8018562120133603,-0.7959694456296635,-0.7872748593353014,-0.7853194385903716,-0.7774448589820417,-0.7822554509281432
32,-0.9694382780680214,-0.9672363818721437,-0.9665112722942434,-0.9644650280346442,-0.9635295276236746,-0.9611038095590685,-0.9600101648365074,-0.9584352078239609,-0.9562588924693087,-0.9541543705058398,-0.9515085929246863,-0.949177131372823,-0.9464984594887168,-0.9427050021567431,-0.9400462457350737,-0.9354041168701479,-0.931994515686749,-0.9266914448125663,-0.9225963876637207,-0.9186231069373718,-0.9120973502500085,-0.9072886052565287,-0.8994716659565403,-0.8935940704905574,-0.8874447539019417,-0.8771513112561307,-0.8709715068237345,-0.8602626474120146,-0.8514999040887695,-0.8403996189949903,-0.8310128868262697,-0.8228285113948602,-0.8103902784028805,-0.8032639562888674,-0.79093015751958,-0.7860975743306138,-0.7784912218626094,-0.7686978614851312,-0.7675052928893604,-0.7580367671222284,-0.7635485497200266
33,-0.9692401209294106,-0.9670092948000214,-0.9663522693442312,-0.9643107796484679,-0.9634064274693891,-0.9611362037688349,-0.959980843192736,-0.9584352078239609,-0.9564838403095283,-0.9545581398110597,-0.951579449125248,-0.9495098724270798,-0.9470050240097705,-0.9434933289702667,-0.940761774209341,-0.936281931514351,-0.9333817243326075,-0.9284068549133045,-0.9243237350953395,-0.9210617684015607,-0.9147760127895507,-0.9098412964984466,-0.9033745206646783,-0.8978843026534065,-0.892015203091401,-0.8822342020996311,-0.876503633619147,-0.8672291159897774,-0.8585235572737602,-0.8476925202318023,-0.8397426723638569,-0.8316728624535316,-0.8187423648170771,-0.8121727356602801,-0.8002053327857792,-0.7962711493182938,-0.789725364498236,-0.779498441630579,-0.7773740486122214,-0.770949720670391,-0.7755666984750005
34,-0.9678503431599637,-0.9657161600837699,-0.9648941784622047,-0.9630420866721682,-0.9619907756951055,-0.9594193106512162,-0.958255753150855,-0.9567123683368924,-0.9544761808355687,-0.9524086620391538,-0.9497887196928706,-0.9477396900184338,-0.9449301912454547,-0.9412473412562657,-0.9385549337571271,-0.9342524884837161,-0.9306637632067102,-0.9256403356822118,-0.9212128326820842,-0.9169945770782356,-0.9110513963059969,-0.9050969854731715,-0.8981593523647209,-0.8920659306535045,-0.8855959437263443,-0.8752705605771959,-0.8668866030718476,-0.8569372171074915,-0.846977320682888,-0.8343718870654616,-0.8240890288198774,-0.8152771941166963,-0.8006429627724555,-0.792791497417832,-0.7783989909360242,-0.7735257077150522,-0.7657376861516687,-0.7555468693746978,-0.7533343991783304,-0.7445438905105256,-0.7491852865450748
35,-0.9742663499722848,-0.9722953772010887,-0.9715418549893096,-0.9698714339701221,-0.9688679709811903,-0.9667357743141684,-0.9658500588876345,-0.9643826147957868,-0.9625180661234176,-0.9608700040970709,-0.9583880858519492,-0.9566371858092595,-0.9542426513448247,-0.9512055450610581,-0.9488585437865766,-0.945253358245015,-0.9423421243648681,-0.9380350145473504,-0.9343943383253115,-0.9311801468156868,-0.9255501887819314,-0.9211016877991435,-0.9149211759693225,-0.9105180148891485,-0.9044093725947614,-0.8961128450407361,-0.8891785064035729,-0.8803460910798411,-0.8729618863525697,-0.8624455577288029,-0.8553826862660915,-0.847131081299499,-0.8348421526393622,-0.8276537618174629,-0.8160746238010032,-0.8110879921152057,-0.803628851817548,-0.7939352170916609,-0.7908036955752898,-0.781262685817015,-0.7861804792855728
36,-0.9693740108879314,-0.9672048420010155,-0.9665721670410566,-0.9646848319849454,-0.9635910777008174,-0.9612889193291622,-0.9601958685803926,-0.9586260613000732,-0.9564219796534679,-0.9544571974847548,-0.9518564324547164,-0.9496895525963784,-0.9468107252893663,-0.9435751364697833,-0.9409350074189005,-0.9364671584576233,-0.9331720300024196,-0.9281714064681051,-0.9239296315551158,-0.9204831029693803,-0.9138746215857683,-0.9087244940801075,-0.901900298253089,-0.8967811000972452,-0.8908170471406921,-0.8813343601799684,-0.8738503913726833,-0.863434122609847,-0.8549600861725517,-0.8444496149958919,-0.8371325959697149,-0.8283950218199451,-0.816665595062046,-0.8107708161088945,-0.7970960077439794,-0.7940973553085473,-0.7885077686776076,-0.7799458942366048,-0.7768895736135537,-0.7710753706674914,-0.7759628022541906
37,-0.9644977385986006,-0.9621332307236192,-0.961473923516198,-0.9592591450011955,-0.9582403243278732,-0.9557309984820999,-0.954492808866865,-0.9528385585920172,-0.950601454287787,-0.9484897246649605,-0.945157300765247,-0.9428350868786892,-0.9398506675548894,-0.9359596019693296,-0.9330566623232833,-0.9278742389588636,-0.9242196951367045,-0.9188207396444729,-0.9143369836824364,-0.9103233913100985,-0.9033725636926426,-0.8982618187925099,-0.8911291009799744,-0.8854630590581102,-0.8788910312869465,-0.8685663329415103,-0.861494530119357,-0.8525187055454629,-0.842646559737941,-0.8308963070144185,-0.8226783608992838,-0.8143979311459512,-0.8019546068282647,-0.7956372742849611,-0.7819131148983602,-0.7780868422493566,-0.7736988895942388,-0.7631484205437321,-0.763193465401218,-0.7558620556339526,-0.7628103563133541
38,-0.9709512345993075,-0.9688354533383376,-0.9681013017943652,-0.9661270543956934,-0.9651790696911007,-0.9630798563548184,-0.9619356194441594,-0.9604933304447402,-0.9584127680394109,-0.9565472974176578,-0.9538854963798923,-0.9516993085640892,-0.9494268187748078,-0.9458359982746055,-0.9436690793784693,-0.9394227362046194,-0.9363739011210581,-0.9316694976539244,-0.9279125928658875,-0.9243601613649891,-0.9186536957039355,-0.9137123184146444,-0.9063996591393269,-0.9017250819230046,-0.8958477151721457,-0.8866766649102185,-0.880635221985341,-0.8718400714351695,-0.8639609862625607,-0.8530876675076892,-0.8459237148951539,-0.8370971391627606,-0.8256156368546261,-0.8191523778712391,-0.8065999824000469,-0.8032086732738324,-0.7963492938984921,-0.7887200798214304,-0.7855422970897586,-0.7779281282016586,-0.7815037539835437
39,-0.9675745298454107,-0.9653566055529097,-0.9645423421472841,-0.9624983611108969,-0.9617199553556773,-0.959146273740328,-0.9577768329692563,-0.9562584465558684,-0.954121887987223,-0.9518208214330248,-0.9488031743577852,-0.9466216800761311,-0.9438268520831599,-0.9398937989915367,-0.9371464724446219,-0.9325290725767483,-0.9291555770626664,-0.9242444627571013,-0.9197118851565513,-0.9161927121222141,-0.9098013537875438,-0.9035435385002939,-0.8974605879846612,-0.8917880870467676,-0.8860640973759591,-0.8759028819261481,-0.8683805107296805,-0.859900852911291,-0.8502161691578994,-0.839396208854731,-0.8320010358527726,-0.823740100210118,-0.8118369446409053,-0.8049294846447871,-0.7926784195242146,-0.788829874609867,-0.7822220603386373,-0.7737587047532839,-0.7711485448793415,-0.7647348785061182,-0.7694360922561712
40,-0.9694730894572369,-0.9673341554726408,-0.9666059974559528,-0.9647735248069967,-0.9636526277779601,-0.9614740290992558,-0.9602887204523353,-0.9586879597247583,-0.956354495301402,-0.9546531443534644,-0.9517855762541547,-0.9496562784909528,-0.9469286923696116,-0.9434487066978031,-0.9409801986909595,-0.9365637986019393,-0.9332768771675135,-0.9281714064681051,-0.9241308759160811,-0.9207724356854705,-0.9144528725466853,-0.9090939625493324,-0.9022155943757989,-0.8967157251309542,-0.8909598736778627,-0.8810830529771797,-0.873655872146403,-0.8629722572897743,-0.8548272860072893,-0.8433371385360392,-0.8346997049182562,-0.8280717633748181,-0.8146595512119849,-0.8073079549947877,-0.7947434806840515,-0.7899797404588512,-0.7854117451166082,-0.7735221206167645,-0.7719140153772365,-0.7654114554135818,-0.7704083469869105
41,-0.9718215193296933,-0.9696617979618936,-0.9689639773742185,-0.9670602571320598,-0.966053080786528,-0.9640054052052868,-0.9628934598073569,-0.9613650665923885,-0.9594643991924372,-0.9577764186850184,-0.9551673494627811,-0.9533097752666919,-0.9508909984178533,-0.9476134521277387,-0.9454466027461229,-0.9414682859259736,-0.9381804984272926,-0.9336624005650763,-0.9296315551157993,-0.9261540242047483,-0.9205330113269159,-0.9150390460995885,-0.907942053685556,-0.902444206552206,-0.8963634776674839,-0.8867577317498277,-0.8790557258679448,-0.8687378760353481,-1.0,-0.8482960205335525,-0.8397426723638569,-0.8305285275577824,-0.8167877579888124,-0.8092011455000779,-0.7962629432988179,-0.7914964682691781,-0.7845687941638655,-0.7723340568007653,-0.7703782296314599,-0.7636475227619802,-0.7663122738157397
42,-0.9666373001357644,-0.9643536376510365,-0.9636390700695553,-0.9615381649069497,-0.9603863703509175,-0.9578736440709341,-0.9567114799122306,-0.9549895288498241,-0.9526541033297904,-0.950567949030063,-0.9474118162376646,-0.9452441321115082,-0.9420920420795514,-0.9382799601374366,-1.0,-0.9305882163450697,-0.9268328090975079,-0.9212761305729806,-0.9165255161079341,-0.9131009853845645,-0.9065954624306949,-0.900209925266605,-0.8922965487856839,-0.8866724959344943,-0.8795020114737319,-0.8694661748611731,-0.8612611070478207,-0.850625057733165,-0.8410382021808738,-0.8276897572183726,-0.8191142095830011,-0.8126135445288508,-0.7996142223365267,-0.7903890626310555,-0.7774075269132615,-0.7739692273996606,-0.7669812989770114,-0.757053807461658,-0.7556937924218421,-0.7477044712068199,-0.7501710448137412
43,-0.9710717355619763,-0.9689836907326397,-0.9682129421635227,-0.9664895381032076,-0.965343203230148,-0.9631631557513606,-0.962072453781759,-0.9604365902221121,-0.9585252419595206,-0.9564226039557516,-0.9536020715776455,-0.9516327603532378,-0.9490729175340716,-0.9454195237316119,-0.943058997205673,-0.9389395354830397,-0.9356077102992176,-0.9312406451287398,-0.9265877341561992,-0.9233598968322201,-0.9177523045001531,-0.9125199429003275,-0.9058116744780571,-0.9011040197432398,-0.8953874963301515,-0.88607677029711,-0.8794058604752494,-0.8714397881577732,-0.863127296336191,-0.8526659444052613,-0.8455966034932771,-0.8395862291902376,-0.8266122291519321,-0.8206920929340858,-0.8104485054706521,-0.8055248316267865,-0.8002362344028057,-0.7913585072569612,-0.7895149920788338,-0.7817314569600433,-0.7861804792855728
44,-0.9694061444779765,-0.9672363818721437,-0.9666059974559528,-0.9647156816621806,-0.9635623543314841,-0.9612889193291622,-0.9599466346083362,-0.9587189089371009,-0.9567369066297752,-0.9545878287305611,-0.9518564324547164,-0.9495431465325055,-0.9469286923696116,-0.94328509169877,-1.0,-0.9364671584576233,-0.9330671828373256,-0.9280620911185483,-0.9241979573697362,-0.9205575028106606,-0.9142062655192353,-0.90890922831472,-0.9021133361738389,-0.8969036781590409,-0.8909598736778627,-0.8816586275384054,-0.8738503913726833,-0.863434122609847,-0.8557716427380443,-0.8439697231896809,-0.8349859273948984,-0.8266494262162599,-0.814151610621745,-0.8078950836957954,-0.7960928104191722,-0.7911186552045119,-0.7862442892674653,-0.7758571031815423,-0.77517453211827,-0.7671560572963987,-0.7736942078824652
45,-0.9679253215367354,-0.9657855478002517,-0.9650295001217895,-0.9631114984459475,-0.9619907756951055,-0.9596183036540669,-0.958221544566455,-0.9567845831656918,-0.9546167732357059,-0.9523017819289484,-0.9494151142717271,-0.9470276241623244,-0.9441738140838816,-0.9404367033065104,-1.0,-0.9332699803498373,-0.9296878780546818,-0.924816266124014,-0.9206510255077227,-0.917465776073011,-0.9114085513112691,-0.9058023343689646,-0.8997443544951002,-0.8946972730467185,-0.8887857363898213,-0.8798346236471971,-0.8732590529247911,-0.863434122609847,-0.8556388425727819,-0.8458529349746603,-0.8381411894588351,-0.831569419751091,-0.8198289719025268,-0.81300549983824,-0.800844797747206,-0.7975195750971911,-0.7921137255310071,-0.7814939773907855,-0.7802421406043342,-0.7724816840965765,-0.7775382150123332
46,-0.9659732059415008,-0.9637291482027004,-0.9630741021407887,-0.9609828707167152,-0.959795489610347,-0.9573553367146718,-0.9561592556212034,-0.9544633922400009,-0.9520411204651922,-0.9500929263180395,-0.9468771739970627,-0.9445054469710582,-0.9413911788380936,-0.937491633323913,-0.9348191219335839,-0.9302499758399639,-0.9263247036051294,-0.9208556869208389,-0.9167603011957269,-0.9125801864956021,-0.9065954624306949,-0.900209925266605,-0.8935151256923732,-0.8878492453277329,-0.8817158227998763,-0.8719062867334118,-0.8640232800610013,-0.8548896141885026,-0.844837762464771,-0.8338338265554674,-0.8256905117248993,-0.8196670438015193,-0.8043785764804218,-0.7990462154163221,-0.7873397670939544,-0.7840989979740459,-0.777819983140981,-0.7696801999650267,-0.7695982248836049,-0.7626809843227466,-0.7678831853945733
47,-0.961391491560916,-0.9587805424227036,-0.9580976481095564,-0.956039209939766,-0.9549289301775925,-0.9519778978934508,-0.9507885078704179,-0.9489389578368563,-0.9466873618679669,-0.9438582532227322,-0.9403326376542732,-0.9378106969594122,-0.9345699059039054,-0.9300025285954396,-0.9270160956247316,-0.9218261765937571,-0.918162755060892,-0.9125645381006038,-0.9072179644132888,-0.9032884729845909,-0.8966121296642743,-0.8908640523973466,-0.8835023434171283,-0.877397422591954,-0.8715433994302808,-0.8614243443719347,-0.8541105802897558,-0.8434199587400314,-0.8356671732747045,-0.823836080592739,-0.816108873578258,-0.8107968320672377,-0.7972224008229923,-0.7917670177456654,-0.7797776539262562,-0.7785139352789794,-0.7729964304669532,-0.7636627338839915,-0.7640122281489664,-0.7571717152191143,-0.7641382042095028
48,-0.9673683393092884,-0.9652115221457205,-0.9645423421472841,-0.9626024787715659,-0.9615517184781538,-0.9590444633667765,-0.9577426243848564,-0.9561552825147267,-0.954121887987223,-0.951785194729623,-0.9489577697044652,-0.9467015379291528,-0.943653371082799,-0.9399830435364638,-1.0,-0.9329558998808105,-0.9293894668924914,-0.9244378668370865,-0.9199298998809304,-0.9159529793003108,-0.9094356950916698,-0.903963389033504,-0.8962760971452919,-0.8911751967377892,-0.8849690939243178,-0.8743545052896113,-0.8666765223074648,-0.8578147612156295,-0.847279809948208,-0.8359642553315253,-0.8263174752451632,-0.8175012122191693,-0.8056387835144345,-0.7987226955198485,-0.7887946965474759,-0.7816514263812079,-0.7750881976459814,-0.7667074688583273,-0.7661729866430242,-0.7570267344532292,-0.7635485497200266
49,-0.9720464544600084,-0.9699361948407079,-0.9691229803242307,-0.9673803225333755,-0.9662664543872895,-0.9641905149753804,-0.9629472161542709,-0.9616642423116998,-0.9596331100726019,-0.9577764186850184,-0.9552832959727913,-0.9533763234775433,-0.9508909984178533,-0.947405214856242,-0.945295965172593,-0.9411461521115871,-0.9380514557625615,-0.9337633070415903,-0.9297489476596957,-0.9261540242047483,-0.9202438858464573,-0.9159291292299941,-0.9089646357051555,-0.9034330029173578,-0.8981250049592547,-0.8885979490089578,-0.8808063989044678,-0.8728484773839948,-0.863127296336191,-0.8520987995433756,-0.8435794165150369,-0.8350347502828511,-0.8227673117726484,-0.814647063757384,-0.8027514593294418,-0.7977002683020314,-0.7921137255310071,-0.7808356563152535,-0.7788177841082511,-0.7710753706674914,-0.7750355593165409
50,-0.9728283718177704,-0.9707309995931357,-0.9699315272402501,-0.9681477082546024,-0.9672635656370022,-0.9649124430787457,-0.9637828830017544,-0.9625617694696337,-0.9604654170814142,-0.9587561530285666,-0.9559789750328516,-0.9539885670173758,-0.9515085907791379,-0.9481712305335337,-0.9460039617681838,-0.9417904197403602,-0.9389386240825873,-0.9348396427910731,-0.9307383991011086,-0.9276254877322928,-0.9221912309942515,-0.9174237971282223,-0.9109586706433745,-0.906734438715055,-0.9011402318550786,-0.8925864375177334,-0.8861829103188559,-0.8771746158820088,-0.8699886382080831,-0.8604387374482844,-0.8531678694825506,-0.8453984160336189,-0.8345399601363082,-0.8284745437770349,-0.8190314159162242,-0.8127689864753874,-0.807245215472833,-0.7979622905458922,-0.7960214913109409,-0.7887340279522916,-0.7920320123872454
