series,Temp,Humi,Pres,200,205,210,215,220,225,230,235,240,245,250,255,260,265,270,275,280,285,290,295,300,305,310,315,320,325,330,335,340,345,350,355,360,365,370,375,380,385,390,395,400,configuration
0,30.49,37.27,98064.0,104037.0,97953.0,94390.0,87214.0,85697.0,83393.0,79589.0,72493.0,71139.0,70958.0,72368.0,72619.0,76256.0,79817.0,83227.0,90318.0,96821.0,104167.0,111667.0,124350.0,137747.0,151447.0,166501.0,187811.0,210229.0,234810.0,261053.0,289763.0,317104.0,342496.0,375279.0,408876.0,443265.0,484320.0,524143.0,561048.0,586618.0,606278.0,616895.0,656207.0,688612.0,"TEMP:200,205,210,215,220,225,230,235,240,245,250,255,260,265,270,275,280,285,290,295,300,305,310,315,320,325,330,335,340,345,350,355,360,365,370,375,380,385,390,395,400;HTDR:500;CTDR:50;TRSH:0.002;NEUTR;ENV;;Preheating:300"
1,31.37,60.63,98143.0,12845.0,12345.0,11802.0,11123.0,10846.0,10603.0,10465.0,10053.0,10043.0,10053.0,10072.0,9957.0,10150.0,10270.0,10372.0,10778.0,11123.0,11528.0,11863.0,12568.0,13268.0,13986.0,14839.0,16032.0,17332.0,18795.0,20567.0,22883.0,25297.0,28322.0,31659.0,34931.0,38141.0,42512.0,47336.0,51277.0,54764.0,58555.0,63675.0,68019.0,72619.0,"TEMP:200,205,210,215,220,225,230,235,240,245,250,255,260,265,270,275,280,285,290,295,300,305,310,315,320,325,330,335,340,345,350,355,360,365,370,375,380,385,390,395,400;HTDR:500;CTDR:50;TRSH:0.002;NEUTR;ENV;;Preheating:300"
2,31.55,60.81,98125.0,13226.0,12720.0,12230.0,11490.0,11194.0,10982.0,10812.0,10413.0,10455.0,10455.0,10507.0,10434.0,10647.0,10834.0,10891.0,11352.0,11796.0,12273.0,12583.0,13319.0,14043.0,14807.0,15672.0,17050.0,18270.0,19752.0,21630.0,23939.0,26429.0,29333.0,32671.0,35919.0,39285.0,43800.0,48319.0,52237.0,55674.0,59428.0,64261.0,68857.0,73190.0,"TEMP:200,205,210,215,220,225,230,235,240,245,250,255,260,265,270,275,280,285,290,295,300,305,310,315,320,325,330,335,340,345,350,355,360,365,370,375,380,385,390,395,400;HTDR:500;CTDR:50;TRSH:0.002;NEUTR;ENV;;Preheating:300"
3,31.65,60.8,98117.0,13135.0,12628.0,12152.0,11439.0,11194.0,10959.0,10857.0,10455.0,10476.0,10476.0,10539.0,10465.0,10679.0,0.0,11017.0,11502.0,11917.0,12433.0,12790.0,13596.0,14390.0,15172.0,16106.0,17347.0,18761.0,20249.0,22039.0,24342.0,26784.0,29581.0,32722.0,36042.0,39175.0,43258.0,47470.0,51530.0,54764.0,58514.0,63434.0,67200.0,71503.0,"TEMP:200,205,210,215,220,225,230,235,240,245,250,255,260,265,270,275,280,285,290,295,300,305,310,315,320,325,330,335,340,345,350,355,360,365,370,375,380,385,390,395,400;HTDR:500;CTDR:50;TRSH:0.002;NEUTR;ENV;;Preheating:300"
4,31.76,60.67,98111.0,14321.0,13775.0,13218.0,12433.0,12131.0,11896.0,11789.0,11291.0,11303.0,11267.0,11352.0,11230.0,11439.0,11617.0,11756.0,12159.0,12560.0,13045.0,13379.0,14176.0,14923.0,15731.0,16683.0,18003.0,19369.0,20958.0,22833.0,25190.0,27870.0,30686.0,34107.0,37293.0,40775.0,44975.0,49784.0,53300.0,56846.0,60588.0,65467.0,69601.0,74162.0,"TEMP:200,205,210,215,220,225,230,235,240,245,250,255,260,265,270,275,280,285,290,295,300,305,310,315,320,325,330,335,340,345,350,355,360,365,370,375,380,385,390,395,400;HTDR:500;CTDR:50;TRSH:0.002;NEUTR;ENV;;Preheating:300"
5,31.82,60.57,98113.0,14118.0,13596.0,13053.0,12280.0,12026.0,11782.0,11630.0,11158.0,11206.0,11182.0,11267.0,11123.0,11365.0,0.0,11756.0,12159.0,12552.0,13078.0,13404.0,14195.0,15031.0,15814.0,16777.0,18112.0,19477.0,21043.0,22933.0,25282.0,27778.0,30686.0,33777.0,36931.0,40112.0,44310.0,48543.0,52631.0,55786.0,59428.0,64015.0,68074.0,72243.0,"TEMP:200,205,210,215,220,225,230,235,240,245,250,255,260,265,270,275,280,285,290,295,300,305,310,315,320,325,330,335,340,345,350,355,360,365,370,375,380,385,390,395,400;HTDR:500;CTDR:50;TRSH:0.002;NEUTR;ENV;;Preheating:300"
6,31.83,60.64,98117.0,14724.0,14176.0,13649.0,12806.0,12530.0,12230.0,12131.0,11579.0,11671.0,11579.0,11697.0,11502.0,11749.0,11957.0,12089.0,12463.0,12821.0,13319.0,13676.0,14420.0,15249.0,15971.0,16912.0,18270.0,19586.0,21149.0,23110.0,25559.0,27760.0,30821.0,34218.0,37359.0,40460.0,44545.0,49083.0,52763.0,56463.0,60024.0,64508.0,68240.0,72619.0,"TEMP:200,205,210,215,220,225,230,235,240,245,250,255,260,265,270,275,280,285,290,295,300,305,310,315,320,325,330,335,340,345,350,355,360,365,370,375,380,385,390,395,400;HTDR:500;CTDR:50;TRSH:0.002;NEUTR;ENV;;Preheating:300"
7,31.92,60.5,98119.0,15625.0,15041.0,14420.0,13543.0,13235.0,12932.0,12782.0,12244.0,12237.0,12187.0,12237.0,12061.0,12237.0,0.0,12455.0,12869.0,13252.0,13748.0,14043.0,14828.0,15590.0,16396.0,17347.0,18728.0,20055.0,21652.0,23722.0,25939.0,28573.0,31612.0,34844.0,38315.0,41626.0,45962.0,50232.0,54162.0,58108.0,61208.0,65930.0,69486.0,73641.0,"TEMP:200,205,210,215,220,225,230,235,240,245,250,255,260,265,270,275,280,285,290,295,300,305,310,315,320,325,330,335,340,345,350,355,360,365,370,375,380,385,390,395,400;HTDR:500;CTDR:50;TRSH:0.002;NEUTR;ENV;;Preheating:300"
8,32.03,60.31,98119.0,14881.0,14390.0,13829.0,12989.0,12674.0,12418.0,12266.0,11789.0,11730.0,11697.0,11776.0,11579.0,11796.0,12019.0,12145.0,12522.0,12916.0,13439.0,13757.0,14500.0,15283.0,16081.0,17022.0,18334.0,19678.0,21170.0,23110.0,25559.0,27723.0,30596.0,33695.0,36737.0,40035.0,44216.0,48263.0,51625.0,55307.0,58473.0,63290.0,67092.0,71018.0,"TEMP:200,205,210,215,220,225,230,235,240,245,250,255,260,265,270,275,280,285,290,295,300,305,310,315,320,325,330,335,340,345,350,355,360,365,370,375,380,385,390,395,400;HTDR:500;CTDR:50;TRSH:0.002;NEUTR;ENV;;Preheating:300"
9,32.06,60.24,98117.0,17521.0,16777.0,16093.0,15150.0,14724.0,14351.0,14137.0,13543.0,13491.0,13430.0,13353.0,13102.0,13252.0,13421.0,13439.0,13766.0,14080.0,14460.0,14703.0,15475.0,16281.0,17050.0,17972.0,19387.0,20854.0,22345.0,24456.0,27043.0,29686.0,32748.0,36386.0,39769.0,43124.0,47822.0,52466.0,56235.0,59852.0,63147.0,67580.0,71687.0,75431.0,"TEMP:200,205,210,215,220,225,230,235,240,245,250,255,260,265,270,275,280,285,290,295,300,305,310,315,320,325,330,335,340,345,350,355,360,365,370,375,380,385,390,395,400;HTDR:500;CTDR:50;TRSH:0.002;NEUTR;ENV;;Preheating:300"
10,32.04,60.28,98119.0,15874.0,15350.0,14724.0,13829.0,13456.0,13168.0,13013.0,12463.0,12448.0,12345.0,12396.0,12287.0,12411.0,12659.0,12636.0,13127.0,13499.0,13977.0,14282.0,15041.0,15862.0,16643.0,17654.0,19104.0,20407.0,22039.0,24035.0,26231.0,28750.0,31635.0,34873.0,38003.0,41420.0,45463.0,49843.0,53437.0,56769.0,60153.0,64409.0,68185.0,72243.0,"TEMP:200,205,210,215,220,225,230,235,240,245,250,255,260,265,270,275,280,285,290,295,300,305,310,315,320,325,330,335,340,345,350,355,360,365,370,375,380,385,390,395,400;HTDR:500;CTDR:50;TRSH:0.002;NEUTR;ENV;;Preheating:300"
11,32.06,60.25,98115.0,16473.0,15874.0,15238.0,14331.0,13903.0,13587.0,13379.0,12814.0,12736.0,12713.0,12659.0,12448.0,12552.0,12689.0,12666.0,13053.0,13439.0,13811.0,14061.0,14755.0,15532.0,16256.0,17106.0,18366.0,19641.0,21170.0,22908.0,25100.0,27595.0,30375.0,33587.0,36641.0,39769.0,43892.0,48515.0,51913.0,55307.0,58678.0,63004.0,66825.0,70958.0,"TEMP:200,205,210,215,220,225,230,235,240,245,250,255,260,265,270,275,280,285,290,295,300,305,310,315,320,325,330,335,340,345,350,355,360,365,370,375,380,385,390,395,400;HTDR:500;CTDR:50;TRSH:0.002;NEUTR;ENV;;Preheating:300"
12,32.02,60.35,98115.0,15790.0,15216.0,14621.0,13703.0,13362.0,13070.0,12908.0,12374.0,12360.0,12316.0,12345.0,12187.0,12353.0,12560.0,12636.0,12956.0,13421.0,13884.0,14185.0,14977.0,15742.0,16525.0,17462.0,18863.0,20152.0,21674.0,23473.0,25987.0,28132.0,30935.0,34190.0,37029.0,40189.0,44077.0,48656.0,51945.0,55089.0,58432.0,62440.0,66243.0,69834.0,"TEMP:200,205,210,215,220,225,230,235,240,245,250,255,260,265,270,275,280,285,290,295,300,305,310,315,320,325,330,335,340,345,350,355,360,365,370,375,380,385,390,395,400;HTDR:500;CTDR:50;TRSH:0.002;NEUTR;ENV;;Preheating:300"
13,32.01,60.41,98109.0,16591.0,15995.0,15316.0,14380.0,14052.0,13721.0,13578.0,12924.0,12932.0,12948.0,12861.0,12705.0,12853.0,13045.0,13045.0,13439.0,13875.0,14321.0,14652.0,15429.0,16218.0,16995.0,17988.0,19405.0,20833.0,22321.0,24542.0,26939.0,29170.0,32170.0,35343.0,38421.0,41750.0,45811.0,49489.0,53233.0,56885.0,60283.0,64261.0,67908.0,71564.0,"TEMP:200,205,210,215,220,225,230,235,240,245,250,255,260,265,270,275,280,285,290,295,300,305,310,315,320,325,330,335,340,345,350,355,360,365,370,375,380,385,390,395,400;HTDR:500;CTDR:50;TRSH:0.002;NEUTR;ENV;;Preheating:300"
14,31.99,60.46,98117.0,16256.0,15648.0,15052.0,14118.0,13775.0,13473.0,13294.0,12720.0,12689.0,12720.0,12720.0,12515.0,12651.0,12853.0,12972.0,13353.0,13748.0,14224.0,14570.0,15373.0,16243.0,17009.0,17972.0,19423.0,20813.0,22465.0,24413.0,26818.0,29190.0,31973.0,35433.0,38280.0,41626.0,45562.0,49784.0,53199.0,56273.0,59554.0,63675.0,66931.0,70838.0,"TEMP:200,205,210,215,220,225,230,235,240,245,250,255,260,265,270,275,280,285,290,295,300,305,310,315,320,325,330,335,340,345,350,355,360,365,370,375,380,385,390,395,400;HTDR:500;CTDR:50;TRSH:0.002;NEUTR;ENV;;Preheating:300"
15,31.98,60.51,98123.0,16205.0,15672.0,14987.0,14118.0,13739.0,13465.0,13277.0,12682.0,12720.0,12628.0,12674.0,12507.0,12713.0,12940.0,12980.0,13447.0,13866.0,14400.0,14766.0,15555.0,16434.0,17332.0,18334.0,19827.0,21192.0,22983.0,25040.0,27451.0,29855.0,32671.0,35949.0,38956.0,42255.0,46368.0,49992.0,53608.0,56923.0,60110.0,64409.0,67744.0,71503.0,"TEMP:200,205,210,215,220,225,230,235,240,245,250,255,260,265,270,275,280,285,290,295,300,305,310,315,320,325,330,335,340,345,350,355,360,365,370,375,380,385,390,395,400;HTDR:500;CTDR:50;TRSH:0.002;NEUTR;ENV;;Preheating:300"
16,29.81,62.73,98119.0,16422.0,15766.0,15106.0,14195.0,13884.0,13667.0,13370.0,12916.0,12916.0,12814.0,12877.0,12697.0,12956.0,13235.0,13268.0,13748.0,14272.0,14683.0,15194.0,16131.0,17022.0,18096.0,19279.0,20771.0,0.0,24314.0,26750.0,29477.0,32096.0,35373.0,39029.0,42685.0,46063.0,50965.0,54908.0,58473.0,62024.0,65467.0,69717.0,72999.0,77311.0,"TEMP:200,205,210,215,220,225,230,235,240,245,250,255,260,265,270,275,280,285,290,295,300,305,310,315,320,325,330,335,340,345,350,355,360,365,370,375,380,385,390,395,400;HTDR:500;CTDR:50;TRSH:0.002;NEUTR;ENV;;Preheating:300"
17,28.84,65.35,98121.0,16499.0,15862.0,15316.0,14292.0,13977.0,13739.0,13430.0,12997.0,12885.0,12845.0,12916.0,12689.0,12908.0,13160.0,13218.0,13667.0,14090.0,14621.0,15041.0,15886.0,16750.0,17774.0,18863.0,20447.0,22039.0,23789.0,25939.0,28750.0,31305.0,34873.0,38562.0,42043.0,45365.0,50051.0,54338.0,57987.0,61208.0,65060.0,69142.0,72431.0,75910.0,"TEMP:200,205,210,215,220,225,230,235,240,245,250,255,260,265,270,275,280,285,290,295,300,305,310,315,320,325,330,335,340,345,350,355,360,365,370,375,380,385,390,395,400;HTDR:500;CTDR:50;TRSH:0.002;NEUTR;ENV;;Preheating:300"
18,29.49,64.45,98121.0,18081.0,17247.0,16578.0,15509.0,15139.0,14881.0,14510.0,13949.0,13893.0,13793.0,13748.0,13508.0,13667.0,13884.0,13838.0,14205.0,14662.0,15009.0,15373.0,16193.0,17009.0,17988.0,19017.0,20467.0,22203.0,23857.0,26035.0,28868.0,31755.0,34960.0,38884.0,42298.0,45911.0,51058.0,55089.0,58596.0,62208.0,65930.0,69892.0,73062.0,76956.0,"TEMP:200,205,210,215,220,225,230,235,240,245,250,255,260,265,270,275,280,285,290,295,300,305,310,315,320,325,330,335,340,345,350,355,360,365,370,375,380,385,390,395,400;HTDR:500;CTDR:50;TRSH:0.002;NEUTR;ENV;;Preheating:300"
19,30.05,63.53,98127.0,17506.0,16683.0,16081.0,14955.0,14621.0,14390.0,14052.0,13526.0,13473.0,13404.0,13370.0,13143.0,13379.0,13622.0,13596.0,14014.0,14490.0,14977.0,15272.0,16180.0,16953.0,17895.0,18931.0,20407.0,21993.0,23525.0,25795.0,28303.0,31027.0,34386.0,37900.0,41176.0,44404.0,48940.0,53098.0,56885.0,60283.0,63530.0,67689.0,71018.0,74758.0,"TEMP:200,205,210,215,220,225,230,235,240,245,250,255,260,265,270,275,280,285,290,295,300,305,310,315,320,325,330,335,340,345,350,355,360,365,370,375,380,385,390,395,400;HTDR:500;CTDR:50;TRSH:0.002;NEUTR;ENV;;Preheating:300"
20,30.46,62.79,98129.0,17865.0,17009.0,16345.0,15261.0,14945.0,14642.0,14370.0,13775.0,13748.0,13685.0,13640.0,13370.0,13561.0,13766.0,13757.0,14224.0,14652.0,15117.0,15463.0,16332.0,17218.0,18050.0,19104.0,20669.0,22133.0,23830.0,26084.0,28515.0,31235.0,34556.0,37865.0,41297.0,44592.0,49055.0,53131.0,56807.0,60067.0,63290.0,67308.0,70539.0,74228.0,"TEMP:200,205,210,215,220,225,230,235,240,245,250,255,260,265,270,275,280,285,290,295,300,305,310,315,320,325,330,335,340,345,350,355,360,365,370,375,380,385,390,395,400;HTDR:500;CTDR:50;TRSH:0.002;NEUTR;ENV;;Preheating:300"
21,30.77,62.28,98129.0,17654.0,16912.0,16256.0,15238.0,14818.0,14530.0,14263.0,13640.0,13605.0,13517.0,13561.0,13362.0,13465.0,13685.0,13685.0,14214.0,14621.0,15106.0,15441.0,16332.0,17134.0,18003.0,19104.0,20527.0,22039.0,23871.0,25875.0,28399.0,30981.0,34051.0,37560.0,40855.0,44077.0,48403.0,52598.0,56010.0,59259.0,62440.0,66665.0,69834.0,73511.0,"TEMP:200,205,210,215,220,225,230,235,240,245,250,255,260,265,270,275,280,285,290,295,300,305,310,315,320,325,330,335,340,345,350,355,360,365,370,375,380,385,390,395,400;HTDR:500;CTDR:50;TRSH:0.002;NEUTR;ENV;;Preheating:300"
22,30.93,62.01,98129.0,16981.0,16345.0,15672.0,14734.0,14331.0,14071.0,13829.0,13201.0,13201.0,13168.0,13143.0,12924.0,13185.0,13404.0,13421.0,13958.0,14400.0,14923.0,15328.0,16231.0,17120.0,17972.0,19069.0,20588.0,22156.0,0.0,25843.0,28341.0,31096.0,33886.0,37426.0,40460.0,43482.0,47389.0,51530.0,55016.0,58148.0,61164.0,65110.0,68632.0,71625.0,"TEMP:200,205,210,215,220,225,230,235,240,245,250,255,260,265,270,275,280,285,290,295,300,305,310,315,320,325,330,335,340,345,350,355,360,365,370,375,380,385,390,395,400;HTDR:500;CTDR:50;TRSH:0.002;NEUTR;ENV;;Preheating:300"
23,31.05,61.8,98131.0,17376.0,16657.0,16007.0,15041.0,14652.0,14341.0,14071.0,13447.0,13439.0,13396.0,13404.0,13193.0,13413.0,13543.0,13587.0,14052.0,14510.0,15020.0,15328.0,16294.0,17148.0,17972.0,19069.0,20527.0,22133.0,23789.0,25843.0,28341.0,30889.0,33859.0,37095.0,40112.0,43347.0,47362.0,51403.0,54764.0,57867.0,61119.0,65161.0,68352.0,71564.0,"TEMP:200,205,210,215,220,225,230,235,240,245,250,255,260,265,270,275,280,285,290,295,300,305,310,315,320,325,330,335,340,345,350,355,360,365,370,375,380,385,390,395,400;HTDR:500;CTDR:50;TRSH:0.002;NEUTR;ENV;;Preheating:300"
24,31.13,61.64,98133.0,16723.0,15995.0,15429.0,14520.0,14128.0,13884.0,13676.0,13053.0,13070.0,13013.0,13037.0,12900.0,13061.0,13235.0,13319.0,13857.0,14292.0,14797.0,15194.0,16143.0,17078.0,17865.0,19000.0,20588.0,22016.0,23844.0,25875.0,28380.0,30731.0,33641.0,36834.0,39883.0,43080.0,46887.0,50780.0,54092.0,57234.0,60326.0,63966.0,67416.0,70480.0,"TEMP:200,205,210,215,220,225,230,235,240,245,250,255,260,265,270,275,280,285,290,295,300,305,310,315,320,325,330,335,340,345,350,355,360,365,370,375,380,385,390,395,400;HTDR:500;CTDR:50;TRSH:0.002;NEUTR;ENV;;Preheating:300"
25,31.25,61.38,98135.0,17318.0,16617.0,15971.0,15020.0,14631.0,14302.0,14099.0,13473.0,13447.0,13370.0,13353.0,13143.0,13319.0,13561.0,13596.0,14090.0,14530.0,15063.0,15452.0,16319.0,17204.0,18128.0,19174.0,20751.0,22156.0,23953.0,25939.0,28341.0,30889.0,33695.0,37062.0,40074.0,43213.0,46964.0,50718.0,54197.0,57234.0,60067.0,64113.0,67362.0,70658.0,"TEMP:200,205,210,215,220,225,230,235,240,245,250,255,260,265,270,275,280,285,290,295,300,305,310,315,320,325,330,335,340,345,350,355,360,365,370,375,380,385,390,395,400;HTDR:500;CTDR:50;TRSH:0.002;NEUTR;ENV;;Preheating:300"
26,31.29,61.27,98135.0,17729.0,17050.0,16383.0,15350.0,14977.0,14662.0,14390.0,13793.0,13739.0,13685.0,13703.0,13499.0,13685.0,13866.0,13884.0,14360.0,14786.0,15339.0,15695.0,16591.0,17550.0,18366.0,19459.0,20896.0,22465.0,24328.0,26231.0,28829.0,31351.0,34246.0,37594.0,40775.0,43892.0,47849.0,51721.0,55125.0,58229.0,61030.0,65212.0,68352.0,71442.0,"TEMP:200,205,210,215,220,225,230,235,240,245,250,255,260,265,270,275,280,285,290,295,300,305,310,315,320,325,330,335,340,345,350,355,360,365,370,375,380,385,390,395,400;HTDR:500;CTDR:50;TRSH:0.002;NEUTR;ENV;;Preheating:300"
27,31.27,61.31,98139.0,16630.0,15983.0,15384.0,14440.0,14071.0,13811.0,13569.0,12940.0,12964.0,12916.0,12964.0,12782.0,12956.0,13201.0,13285.0,13829.0,14282.0,14828.0,15183.0,16155.0,17078.0,18019.0,19051.0,20608.0,22039.0,23816.0,25732.0,28094.0,30641.0,33480.0,36609.0,39470.0,42512.0,46164.0,50081.0,53368.0,56197.0,58967.0,62957.0,66086.0,69371.0,"TEMP:200,205,210,215,220,225,230,235,240,245,250,255,260,265,270,275,280,285,290,295,300,305,310,315,320,325,330,335,340,345,350,355,360,365,370,375,380,385,390,395,400;HTDR:500;CTDR:50;TRSH:0.002;NEUTR;ENV;;Preheating:300"
28,31.28,61.25,98143.0,17926.0,17204.0,16486.0,15452.0,15052.0,14745.0,14490.0,13829.0,13775.0,13739.0,13757.0,13561.0,13712.0,13968.0,13968.0,14520.0,14934.0,15475.0,15850.0,16723.0,17684.0,18595.0,19697.0,21256.0,22858.0,24599.0,26665.0,29210.0,31683.0,34671.0,38176.0,41095.0,44216.0,48042.0,51977.0,55564.0,58392.0,61164.0,65009.0,68185.0,71260.0,"TEMP:200,205,210,215,220,225,230,235,240,245,250,255,260,265,270,275,280,285,290,295,300,305,310,315,320,325,330,335,340,345,350,355,360,365,370,375,380,385,390,395,400;HTDR:500;CTDR:50;TRSH:0.002;NEUTR;ENV;;Preheating:300"
29,31.3,61.16,98146.0,17988.0,17261.0,16578.0,15567.0,15139.0,14807.0,14560.0,13968.0,13903.0,13811.0,13802.0,13631.0,13802.0,13940.0,14052.0,14470.0,14934.0,15441.0,15814.0,16723.0,17639.0,18611.0,19641.0,21192.0,22709.0,24527.0,26563.0,29008.0,31635.0,34699.0,37865.0,40696.0,44030.0,47987.0,51913.0,55453.0,58392.0,61164.0,65262.0,68240.0,71320.0,"TEMP:200,205,210,215,220,225,230,235,240,245,250,255,260,265,270,275,280,285,290,295,300,305,310,315,320,325,330,335,340,345,350,355,360,365,370,375,380,385,390,395,400;HTDR:500;CTDR:50;TRSH:0.002;NEUTR;ENV;;Preheating:300"
30,31.28,61.17,98148.0,17390.0,16750.0,16081.0,15074.0,14734.0,14410.0,14176.0,13499.0,13517.0,13482.0,13491.0,13311.0,13456.0,13667.0,13730.0,14234.0,14776.0,15339.0,15766.0,16710.0,17654.0,18661.0,19808.0,21343.0,22883.0,24744.0,26801.0,29313.0,31949.0,34902.0,38003.0,40934.0,44216.0,47877.0,51657.0,54836.0,57907.0,61074.0,64608.0,67580.0,70599.0,"TEMP:200,205,210,215,220,225,230,235,240,245,250,255,260,265,270,275,280,285,290,295,300,305,310,315,320,325,330,335,340,345,350,355,360,365,370,375,380,385,390,395,400;HTDR:500;CTDR:50;TRSH:0.002;NEUTR;ENV;;Preheating:300"
31,31.29,61.13,98146.0,18238.0,17492.0,16804.0,15790.0,15350.0,15020.0,14828.0,14090.0,14080.0,14005.0,14061.0,13811.0,14014.0,14224.0,14224.0,14724.0,15261.0,15754.0,16193.0,17134.0,18128.0,19104.0,20288.0,21901.0,23552.0,25404.0,27523.0,30048.0,32799.0,36011.0,39322.0,42512.0,45661.0,49519.0,53505.0,56846.0,59809.0,62674.0,66665.0,69486.0,72619.0,"TEMP:200,205,210,215,220,225,230,235,240,245,250,255,260,265,270,275,280,285,290,295,300,305,310,315,320,325,330,335,340,345,350,355,360,365,370,375,380,385,390,395,400;HTDR:500;CTDR:50;TRSH:0.002;NEUTR;ENV;;Preheating:300"
32,31.31,61.03,98145.0,18578.0,17759.0,17148.0,15995.0,15590.0,15227.0,14934.0,14263.0,14243.0,14157.0,14147.0,13884.0,14080.0,14185.0,14224.0,14766.0,15172.0,15660.0,16020.0,16871.0,17759.0,18711.0,19752.0,21278.0,22858.0,24657.0,26699.0,29251.0,31659.0,34699.0,38106.0,41055.0,44216.0,48042.0,51945.0,55380.0,58392.0,61343.0,65161.0,68185.0,71260.0,"TEMP:200,205,210,215,220,225,230,235,240,245,250,255,260,265,270,275,280,285,290,295,300,305,310,315,320,325,330,335,340,345,350,355,360,365,370,375,380,385,390,395,400;HTDR:500;CTDR:50;TRSH:0.002;NEUTR;ENV;;Preheating:300"
33,31.34,60.96,98145.0,18897.0,18112.0,17419.0,16294.0,15826.0,15509.0,15238.0,14560.0,14500.0,14380.0,14380.0,14147.0,14292.0,14500.0,14480.0,14998.0,15475.0,15971.0,16422.0,17275.0,18238.0,19104.0,20249.0,21855.0,23525.0,25343.0,27523.0,30113.0,32646.0,35765.0,39138.0,42426.0,45661.0,49315.0,53539.0,56885.0,59895.0,62862.0,66401.0,69199.0,72431.0,"TEMP:200,205,210,215,220,225,230,235,240,245,250,255,260,265,270,275,280,285,290,295,300,305,310,315,320,325,330,335,340,345,350,355,360,365,370,375,380,385,390,395,400;HTDR:500;CTDR:50;TRSH:0.002;NEUTR;ENV;;Preheating:300"
34,30.71,61.11,98145.0,18628.0,17850.0,17190.0,16007.0,15684.0,15350.0,15150.0,14480.0,14420.0,14341.0,14351.0,14080.0,14341.0,14631.0,14611.0,15128.0,15695.0,16243.0,16630.0,17654.0,18661.0,19604.0,20854.0,22611.0,24441.0,26182.0,28554.0,31305.0,34246.0,37293.0,40934.0,44170.0,47795.0,51913.0,55935.0,59343.0,62534.0,65364.0,69085.0,71933.0,75093.0,"TEMP:200,205,210,215,220,225,230,235,240,245,250,255,260,265,270,275,280,285,290,295,300,305,310,315,320,325,330,335,340,345,350,355,360,365,370,375,380,385,390,395,400;HTDR:500;CTDR:50;TRSH:0.002;NEUTR;ENV;;Preheating:300"
35,29.72,62.32,98146.0,19000.0,18207.0,17492.0,16332.0,15983.0,15695.0,15361.0,14776.0,14703.0,14672.0,14724.0,14420.0,14591.0,14966.0,14977.0,15441.0,16081.0,16538.0,17050.0,18065.0,19086.0,20269.0,21496.0,23212.0,0.0,27008.0,29457.0,32393.0,35254.0,38884.0,42426.0,45962.0,49257.0,54162.0,57708.0,61164.0,64310.0,67634.0,71199.0,74031.0,77311.0,"TEMP:200,205,210,215,220,225,230,235,240,245,250,255,260,265,270,275,280,285,290,295,300,305,310,315,320,325,330,335,340,345,350,355,360,365,370,375,380,385,390,395,400;HTDR:500;CTDR:50;TRSH:0.002;NEUTR;ENV;;Preheating:300"
36,29.42,63.35,98148.0,19104.0,18270.0,17536.0,16409.0,15995.0,15719.0,15373.0,14745.0,14703.0,14621.0,14734.0,14410.0,14591.0,14913.0,14881.0,15384.0,15995.0,16447.0,16967.0,17988.0,18965.0,20055.0,21235.0,23008.0,24891.0,26750.0,29313.0,32047.0,35018.0,38456.0,42170.0,45761.0,48769.0,53505.0,57352.0,60808.0,63918.0,66931.0,70778.0,73576.0,76604.0,"TEMP:200,205,210,215,220,225,230,235,240,245,250,255,260,265,270,275,280,285,290,295,300,305,310,315,320,325,330,335,340,345,350,355,360,365,370,375,380,385,390,395,400;HTDR:500;CTDR:50;TRSH:0.002;NEUTR;ENV;;Preheating:300"
37,29.77,62.93,98146.0,19138.0,18318.0,17609.0,16447.0,16106.0,15766.0,15418.0,14870.0,14766.0,14745.0,14703.0,14420.0,14672.0,14934.0,14934.0,15429.0,16007.0,16447.0,16940.0,17957.0,18897.0,20074.0,21278.0,23161.0,24862.0,26631.0,29170.0,31925.0,34815.0,38141.0,41833.0,45365.0,48712.0,53064.0,56807.0,60326.0,63578.0,66825.0,70126.0,72872.0,75841.0,"TEMP:200,205,210,215,220,225,230,235,240,245,250,255,260,265,270,275,280,285,290,295,300,305,310,315,320,325,330,335,340,345,350,355,360,365,370,375,380,385,390,395,400;HTDR:500;CTDR:50;TRSH:0.002;NEUTR;ENV;;Preheating:300"
38,30.11,62.46,98150.0,18948.0,18175.0,17462.0,16319.0,15886.0,15660.0,15384.0,14724.0,14683.0,14580.0,14560.0,14272.0,14530.0,14807.0,14786.0,15407.0,15922.0,16525.0,16912.0,17926.0,18965.0,20055.0,21278.0,23110.0,24951.0,26853.0,29048.0,31925.0,34728.0,38072.0,41543.0,45072.0,48431.0,52598.0,56539.0,59767.0,62815.0,65672.0,69371.0,72243.0,75228.0,"TEMP:200,205,210,215,220,225,230,235,240,245,250,255,260,265,270,275,280,285,290,295,300,305,310,315,320,325,330,335,340,345,350,355,360,365,370,375,380,385,390,395,400;HTDR:500;CTDR:50;TRSH:0.002;NEUTR;ENV;;Preheating:300"
39,30.36,62.06,98148.0,19423.0,18529.0,17865.0,16617.0,16268.0,15910.0,15555.0,14977.0,14902.0,14766.0,14755.0,14500.0,14786.0,15020.0,15009.0,15544.0,16044.0,16604.0,16995.0,18034.0,19069.0,20074.0,21213.0,23008.0,24832.0,26665.0,29069.0,31803.0,34699.0,37865.0,41420.0,44975.0,48291.0,52237.0,56425.0,59682.0,62721.0,65620.0,69371.0,72493.0,75499.0,"TEMP:200,205,210,215,220,225,230,235,240,245,250,255,260,265,270,275,280,285,290,295,300,305,310,315,320,325,330,335,340,345,350,355,360,365,370,375,380,385,390,395,400;HTDR:500;CTDR:50;TRSH:0.002;NEUTR;ENV;;Preheating:300"
40,30.49,61.86,98156.0,19405.0,18529.0,17895.0,16657.0,16281.0,15971.0,15672.0,14945.0,14892.0,14839.0,14776.0,14520.0,14807.0,14998.0,15009.0,15521.0,16106.0,16683.0,17050.0,18112.0,19174.0,20210.0,21387.0,23135.0,25010.0,26922.0,29069.0,32096.0,34844.0,38037.0,41626.0,45218.0,48431.0,52302.0,56463.0,59724.0,62721.0,65415.0,69256.0,71995.0,75161.0,"TEMP:200,205,210,215,220,225,230,235,240,245,250,255,260,265,270,275,280,285,290,295,300,305,310,315,320,325,330,335,340,345,350,355,360,365,370,375,380,385,390,395,400;HTDR:500;CTDR:50;TRSH:0.002;NEUTR;ENV;;Preheating:300"
41,30.63,61.6,98166.0,20190.0,19209.0,18447.0,17275.0,16858.0,16551.0,16180.0,15509.0,15463.0,15328.0,15350.0,14977.0,15194.0,15452.0,15441.0,15934.0,16486.0,17050.0,17477.0,18529.0,19477.0,20487.0,21787.0,23631.0,25343.0,27468.0,29644.0,32519.0,35313.0,38598.0,42685.0,45962.0,49112.0,53098.0,57156.0,60545.0,63626.0,66401.0,70303.0,73126.0,75910.0,"TEMP:200,205,210,215,220,225,230,235,240,245,250,255,260,265,270,275,280,285,290,295,300,305,310,315,320,325,330,335,340,345,350,355,360,365,370,375,380,385,390,395,400;HTDR:500;CTDR:50;TRSH:0.002;NEUTR;ENV;;Preheating:300"
42,30.75,61.36,98168.0,19351.0,18431.0,17789.0,16604.0,16180.0,15910.0,15625.0,14902.0,14839.0,14818.0,14766.0,14510.0,14766.0,14987.0,15020.0,15578.0,16118.0,16657.0,17134.0,18143.0,19174.0,20229.0,21541.0,23368.0,25175.0,26974.0,29436.0,32170.0,35077.0,38350.0,41875.0,45072.0,48515.0,52269.0,56273.0,59597.0,62768.0,65364.0,69313.0,71625.0,74492.0,"TEMP:200,205,210,215,220,225,230,235,240,245,250,255,260,265,270,275,280,285,290,295,300,305,310,315,320,325,330,335,340,345,350,355,360,365,370,375,380,385,390,395,400;HTDR:500;CTDR:50;TRSH:0.002;NEUTR;ENV;;Preheating:300"
43,30.82,61.25,98168.0,18931.0,18175.0,17448.0,16409.0,16007.0,15625.0,15395.0,14683.0,14662.0,14601.0,14560.0,14311.0,14621.0,14828.0,14870.0,15429.0,16007.0,16538.0,17134.0,18143.0,19174.0,20269.0,21585.0,23394.0,25236.0,27219.0,29540.0,32343.0,35165.0,38456.0,42085.0,45267.0,48459.0,52532.0,56463.0,59597.0,62534.0,65212.0,68801.0,71748.0,74228.0,"TEMP:200,205,210,215,220,225,230,235,240,245,250,255,260,265,270,275,280,285,290,295,300,305,310,315,320,325,330,335,340,345,350,355,360,365,370,375,380,385,390,395,400;HTDR:500;CTDR:50;TRSH:0.002;NEUTR;ENV;;Preheating:300"
44,30.84,61.17,98168.0,19865.0,18982.0,18270.0,17134.0,16697.0,16319.0,16044.0,15316.0,15339.0,15194.0,15194.0,14892.0,15150.0,15373.0,15418.0,15910.0,16525.0,16995.0,17550.0,18529.0,19678.0,20669.0,22016.0,23789.0,25716.0,27796.0,30091.0,33005.0,35765.0,39102.0,43080.0,46471.0,49843.0,53642.0,57549.0,61253.0,63966.0,66771.0,70421.0,72872.0,75773.0,"TEMP:200,205,210,215,220,225,230,235,240,245,250,255,260,265,270,275,280,285,290,295,300,305,310,315,320,325,330,335,340,345,350,355,360,365,370,375,380,385,390,395,400;HTDR:500;CTDR:50;TRSH:0.002;NEUTR;ENV;;Preheating:300"
45,30.86,61.16,98166.0,19568.0,18863.0,18050.0,16763.0,16460.0,16106.0,15886.0,15150.0,15096.0,14998.0,15020.0,14786.0,15041.0,15238.0,15261.0,15886.0,16409.0,16981.0,17433.0,18480.0,19568.0,20689.0,21970.0,23871.0,25653.0,0.0,30048.0,32850.0,35613.0,39138.0,42426.0,46012.0,49431.0,53368.0,57156.0,60501.0,63530.0,66243.0,69775.0,72181.0,75161.0,"TEMP:200,205,210,215,220,225,230,235,240,245,250,255,260,265,270,275,280,285,290,295,300,305,310,315,320,325,330,335,340,345,350,355,360,365,370,375,380,385,390,395,400;HTDR:500;CTDR:50;TRSH:0.002;NEUTR;ENV;;Preheating:300"
46,30.89,61.07,98166.0,19549.0,18761.0,18019.0,16817.0,16434.0,16093.0,15802.0,15106.0,15009.0,14998.0,14998.0,14786.0,14987.0,15194.0,15261.0,15838.0,16409.0,17009.0,17419.0,18562.0,19641.0,20689.0,21970.0,24021.0,25716.0,0.0,30200.0,33031.0,35857.0,39102.0,42772.0,46164.0,49636.0,53539.0,57274.0,60632.0,63820.0,66559.0,69950.0,72999.0,75161.0,"TEMP:200,205,210,215,220,225,230,235,240,245,250,255,260,265,270,275,280,285,290,295,300,305,310,315,320,325,330,335,340,345,350,355,360,365,370,375,380,385,390,395,400;HTDR:500;CTDR:50;TRSH:0.002;NEUTR;ENV;;Preheating:300"
47,30.9,61.05,98168.0,19568.0,18744.0,18065.0,16817.0,16499.0,16155.0,15862.0,15128.0,15074.0,15063.0,15009.0,14714.0,15052.0,15283.0,15316.0,15898.0,16447.0,17022.0,17565.0,18694.0,19771.0,20896.0,22250.0,24118.0,26035.0,28076.0,30397.0,33294.0,36229.0,39694.0,43392.0,46574.0,50051.0,53849.0,57628.0,61030.0,64162.0,66825.0,70126.0,72872.0,75499.0,"TEMP:200,205,210,215,220,225,230,235,240,245,250,255,260,265,270,275,280,285,290,295,300,305,310,315,320,325,330,335,340,345,350,355,360,365,370,375,380,385,390,395,400;HTDR:500;CTDR:50;TRSH:0.002;NEUTR;ENV;;Preheating:300"
48,30.92,60.99,98170.0,21430.0,20447.0,19586.0,18207.0,17850.0,17390.0,17078.0,16281.0,16256.0,16131.0,16106.0,15814.0,15983.0,16168.0,16155.0,16763.0,17289.0,17834.0,18270.0,19315.0,20427.0,21474.0,22858.0,24803.0,26699.0,0.0,31211.0,34274.0,37226.0,40855.0,44498.0,48097.0,51403.0,55897.0,59554.0,63099.0,66139.0,68632.0,72057.0,74558.0,77311.0,"TEMP:200,205,210,215,220,225,230,235,240,245,250,255,260,265,270,275,280,285,290,295,300,305,310,315,320,325,330,335,340,345,350,355,360,365,370,375,380,385,390,395,400;HTDR:500;CTDR:50;TRSH:0.002;NEUTR;ENV;;Preheating:300"
49,30.93,60.96,98174.0,20367.0,19459.0,18761.0,17595.0,17036.0,16697.0,16370.0,15613.0,15578.0,15486.0,15441.0,15128.0,15407.0,15567.0,15613.0,16131.0,16723.0,17304.0,17714.0,18778.0,19884.0,20917.0,22227.0,24215.0,25987.0,0.0,30353.0,33294.0,36166.0,39582.0,43573.0,46626.0,50022.0,54092.0,58068.0,61208.0,64064.0,67146.0,70421.0,73062.0,75364.0,"TEMP:200,205,210,215,220,225,230,235,240,245,250,255,260,265,270,275,280,285,290,295,300,305,310,315,320,325,330,335,340,345,350,355,360,365,370,375,380,385,390,395,400;HTDR:500;CTDR:50;TRSH:0.002;NEUTR;ENV;;Preheating:300"
50,30.96,60.91,98172.0,20113.0,19333.0,18512.0,17347.0,16885.0,16538.0,16193.0,15463.0,15452.0,15350.0,15350.0,15096.0,15305.0,15486.0,15509.0,16069.0,16630.0,17233.0,17609.0,18711.0,19715.0,20792.0,22086.0,24035.0,25875.0,27945.0,30243.0,33188.0,35949.0,39285.0,42729.0,46113.0,49725.0,53505.0,57431.0,60897.0,63675.0,66401.0,69775.0,72493.0,75093.0,"TEMP:200,205,210,215,220,225,230,235,240,245,250,255,260,265,270,275,280,285,290,295,300,305,310,315,320,325,330,335,340,345,350,355,360,365,370,375,380,385,390,395,400;HTDR:500;CTDR:50;TRSH:0.002;NEUTR;ENV;;Preheating:300"
