series,Temp,Humi,Pres,200,205,210,215,220,225,230,235,240,245,250,255,260,265,270,275,280,285,290,295,300,305,310,315,320,325,330,335,340,345,350,355,360,365,370,375,380,385,390,395,400,configuration
0,28.74,39.07,99821.0,10773869.0,9631626.0,8743883.0,7218855.0,6691635.0,6002240.0,5474975.0,4677138.0,4243864.0,3935389.0,3673749.0,3145540.0,2958057.0,2760041.0,2371681.0,2259696.0,2152610.0,2024169.0,1786667.0,1703751.0,1611545.0,1520136.0,1381443.0,1321499.0,1257036.0,1220401.0,1094771.0,1055118.0,1017464.0,937719.0,917808.0,894526.0,887417.0,807715.0,810157.0,820576.0,817073.0,800478.0,765714.0,777262.0,740410.0,"TEMP:200,205,210,215,220,225,230,235,240,245,250,255,260,265,270,275,280,285,290,295,300,305,310,315,320,325,330,335,340,345,350,355,360,365,370,375,380,385,390,395,400;HTDR:100;CTDR:0;TRSH:0.002;NEUTR;ENV;;Preheating:300"
1,29.89,60.03,99852.0,299241.0,279912.0,265901.0,234142.0,222290.0,210095.0,200136.0,181868.0,172680.0,165514.0,161680.0,147707.0,144148.0,142070.0,132937.0,133042.0,133148.0,132516.0,128156.0,130553.0,131476.0,134538.0,132516.0,135190.0,140993.0,145779.0,144024.0,149821.0,155814.0,158768.0,166171.0,172325.0,182462.0,182263.0,192532.0,203979.0,214753.0,218311.0,221691.0,234643.0,236836.0,"TEMP:200,205,210,215,220,225,230,235,240,245,250,255,260,265,270,275,280,285,290,295,300,305,310,315,320,325,330,335,340,345,350,355,360,365,370,375,380,385,390,395,400;HTDR:100;CTDR:0;TRSH:0.002;NEUTR;ENV;;Preheating:300"
2,30.15,60.4,99850.0,301708.0,284261.0,267847.0,236326.0,224717.0,213500.0,202474.0,183461.0,174843.0,168851.0,163255.0,150224.0,145526.0,143654.0,134430.0,134322.0,134646.0,133042.0,128550.0,131476.0,131890.0,134430.0,131890.0,135848.0,140050.0,144148.0,141949.0,147968.0,153108.0,153811.0,162464.0,168173.0,176688.0,176688.0,186852.0,196906.0,206408.0,211037.0,214473.0,227354.0,228934.0,"TEMP:200,205,210,215,220,225,230,235,240,245,250,255,260,265,270,275,280,285,290,295,300,305,310,315,320,325,330,335,340,345,350,355,360,365,370,375,380,385,390,395,400;HTDR:100;CTDR:0;TRSH:0.002;NEUTR;ENV;;Preheating:300"
3,30.19,60.77,99858.0,240996.0,228141.0,215455.0,191079.0,182860.0,174298.0,164216.0,150090.0,141709.0,136846.0,132937.0,122263.0,119132.0,117133.0,109477.0,108979.0,109477.0,108625.0,104296.0,106824.0,108065.0,110197.0,109549.0,112416.0,116158.0,121114.0,120417.0,126894.0,132411.0,134538.0,141470.0,149021.0,157129.0,158168.0,168681.0,179336.0,187277.0,196671.0,196202.0,207972.0,212261.0,"TEMP:200,205,210,215,220,225,230,235,240,245,250,255,260,265,270,275,280,285,290,295,300,305,310,315,320,325,330,335,340,345,350,355,360,365,370,375,380,385,390,395,400;HTDR:100;CTDR:0;TRSH:0.002;NEUTR;ENV;;Preheating:300"
4,30.28,60.87,99854.0,272276.0,254399.0,240117.0,213777.0,202226.0,193323.0,184066.0,166667.0,158168.0,152689.0,148099.0,135737.0,132726.0,131064.0,122531.0,121907.0,122442.0,121465.0,117133.0,119472.0,120330.0,123252.0,121818.0,124443.0,129444.0,132621.0,132516.0,136735.0,143654.0,145652.0,151584.0,158918.0,166336.0,168342.0,178191.0,186640.0,196085.0,202973.0,202723.0,216162.0,217017.0,"TEMP:200,205,210,215,220,225,230,235,240,245,250,255,260,265,270,275,280,285,290,295,300,305,310,315,320,325,330,335,340,345,350,355,360,365,370,375,380,385,390,395,400;HTDR:100;CTDR:0;TRSH:0.002;NEUTR;ENV;;Preheating:300"
5,30.44,60.7,99850.0,250338.0,234810.0,221691.0,195968.0,186007.0,178953.0,169534.0,154520.0,146416.0,141709.0,137747.0,126511.0,123071.0,121818.0,113559.0,112795.0,113868.0,112795.0,108344.0,110125.0,112492.0,114883.0,112795.0,116078.0,120939.0,124628.0,124814.0,130452.0,136068.0,137295.0,144024.0,152550.0,158918.0,160749.0,171619.0,180108.0,188348.0,192307.0,196906.0,209427.0,212125.0,"TEMP:200,205,210,215,220,225,230,235,240,245,250,255,260,265,270,275,280,285,290,295,300,305,310,315,320,325,330,335,340,345,350,355,360,365,370,375,380,385,390,395,400;HTDR:100;CTDR:0;TRSH:0.002;NEUTR;ENV;;Preheating:300"
6,30.55,60.63,99858.0,284506.0,265686.0,249390.0,221841.0,210229.0,200380.0,189322.0,173037.0,163255.0,157721.0,152828.0,141470.0,137295.0,136179.0,127086.0,126130.0,127183.0,126130.0,121026.0,123343.0,125000.0,126511.0,124628.0,128352.0,132831.0,135299.0,134215.0,139004.0,144771.0,146544.0,153388.0,160134.0,167836.0,167668.0,179144.0,186323.0,196202.0,200136.0,203475.0,214333.0,218456.0,"TEMP:200,205,210,215,220,225,230,235,240,245,250,255,260,265,270,275,280,285,290,295,300,305,310,315,320,325,330,335,340,345,350,355,360,365,370,375,380,385,390,395,400;HTDR:100;CTDR:0;TRSH:0.002;NEUTR;ENV;;Preheating:300"
7,30.72,60.44,99856.0,219329.0,207057.0,194809.0,174116.0,166006.0,158019.0,150901.0,136846.0,129845.0,125751.0,121996.0,111816.0,109334.0,107856.0,100782.0,100239.0,100661.0,100179.0,96320.0,98820.0,99525.0,102384.0,100722.0,104426.0,108484.0,112416.0,112416.0,118124.0,123071.0,126225.0,133148.0,140638.0,147447.0,151996.0,158918.0,168342.0,178002.0,185493.0,186640.0,198688.0,201483.0,"TEMP:200,205,210,215,220,225,230,235,240,245,250,255,260,265,270,275,280,285,290,295,300,305,310,315,320,325,330,335,340,345,350,355,360,365,370,375,380,385,390,395,400;HTDR:100;CTDR:0;TRSH:0.002;NEUTR;ENV;;Preheating:300"
8,30.87,60.27,99860.0,231998.0,217878.0,205122.0,183662.0,173936.0,165350.0,157129.0,143654.0,137295.0,131373.0,126511.0,117626.0,115358.0,113023.0,105346.0,104950.0,105678.0,104819.0,100782.0,103331.0,104296.0,106349.0,105879.0,109908.0,112416.0,115997.0,116969.0,122174.0,127570.0,129845.0,136623.0,143285.0,150629.0,152689.0,161058.0,171795.0,180301.0,185275.0,188132.0,199894.0,206408.0,"TEMP:200,205,210,215,220,225,230,235,240,245,250,255,260,265,270,275,280,285,290,295,300,305,310,315,320,325,330,335,340,345,350,355,360,365,370,375,380,385,390,395,400;HTDR:100;CTDR:0;TRSH:0.002;NEUTR;ENV;;Preheating:300"
9,30.93,60.24,99862.0,229572.0,216446.0,202723.0,181277.0,171619.0,165025.0,155814.0,142553.0,135958.0,130249.0,126130.0,116562.0,114413.0,112190.0,105612.0,105082.0,105280.0,105082.0,100239.0,102824.0,103973.0,106417.0,105016.0,108134.0,111741.0,115279.0,116319.0,120851.0,126894.0,128846.0,136179.0,143530.0,149955.0,152689.0,161368.0,171619.0,180301.0,186323.0,189649.0,199772.0,203979.0,"TEMP:200,205,210,215,220,225,230,235,240,245,250,255,260,265,270,275,280,285,290,295,300,305,310,315,320,325,330,335,340,345,350,355,360,365,370,375,380,385,390,395,400;HTDR:100;CTDR:0;TRSH:0.002;NEUTR;ENV;;Preheating:300"
10,31.0,60.24,99858.0,230537.0,216589.0,203601.0,181670.0,172680.0,163894.0,156250.0,142796.0,136958.0,129946.0,126130.0,116643.0,113946.0,112567.0,105214.0,104687.0,105346.0,105346.0,100420.0,102887.0,103973.0,106552.0,104622.0,108837.0,111890.0,115120.0,116239.0,121026.0,126320.0,129244.0,135958.0,143285.0,149420.0,154236.0,161992.0,170397.0,179528.0,186007.0,188888.0,198928.0,204486.0,"TEMP:200,205,210,215,220,225,230,235,240,245,250,255,260,265,270,275,280,285,290,295,300,305,310,315,320,325,330,335,340,345,350,355,360,365,370,375,380,385,390,395,400;HTDR:100;CTDR:0;TRSH:0.002;NEUTR;ENV;;Preheating:300"
11,31.18,60.01,99866.0,216162.0,204486.0,191635.0,171971.0,163574.0,155959.0,148099.0,135081.0,129644.0,123891.0,119472.0,110125.0,107995.0,106552.0,99762.0,98937.0,99407.0,99171.0,95279.0,98011.0,98298.0,101147.0,99762.0,103651.0,106824.0,110634.0,111965.0,116239.0,121730.0,124628.0,131786.0,138430.0,145147.0,148361.0,156835.0,165514.0,175945.0,182065.0,185493.0,194809.0,199894.0,"TEMP:200,205,210,215,220,225,230,235,240,245,250,255,260,265,270,275,280,285,290,295,300,305,310,315,320,325,330,335,340,345,350,355,360,365,370,375,380,385,390,395,400;HTDR:100;CTDR:0;TRSH:0.002;NEUTR;ENV;;Preheating:300"
12,31.14,60.23,99868.0,195040.0,184471.0,174479.0,155525.0,148493.0,142675.0,134000.0,122621.0,117709.0,112871.0,108555.0,100239.0,98068.0,96431.0,91702.0,91402.0,91904.0,92207.0,88039.0,90221.0,91904.0,93651.0,93338.0,95550.0,98471.0,101392.0,103077.0,107786.0,113482.0,115997.0,123525.0,130859.0,137408.0,141231.0,149287.0,158617.0,167166.0,173936.0,178953.0,187811.0,193892.0,"TEMP:200,205,210,215,220,225,230,235,240,245,250,255,260,265,270,275,280,285,290,295,300,305,310,315,320,325,330,335,340,345,350,355,360,365,370,375,380,385,390,395,400;HTDR:100;CTDR:0;TRSH:0.002;NEUTR;ENV;;Preheating:300"
13,31.07,60.49,99876.0,196085.0,185288.0,175945.0,155959.0,149154.0,142070.0,134755.0,123708.0,117461.0,113636.0,109549.0,100964.0,99112.0,97782.0,93130.0,92309.0,92820.0,93234.0,89164.0,91803.0,92820.0,95032.0,94496.0,95989.0,99762.0,103973.0,104492.0,109406.0,114023.0,117461.0,124074.0,131476.0,137747.0,140993.0,149420.0,159069.0,167668.0,175209.0,178381.0,188025.0,192419.0,"TEMP:200,205,210,215,220,225,230,235,240,245,250,255,260,265,270,275,280,285,290,295,300,305,310,315,320,325,330,335,340,345,350,355,360,365,370,375,380,385,390,395,400;HTDR:100;CTDR:0;TRSH:0.002;NEUTR;ENV;;Preheating:300"
14,31.08,60.6,99878.0,181670.0,171619.0,162938.0,144896.0,139235.0,132202.0,125468.0,115120.0,110415.0,106214.0,101762.0,95574.0,94072.0,92207.0,86673.0,86138.0,86852.0,87033.0,83476.0,85873.0,87671.0,89259.0,88411.0,91104.0,95140.0,96933.0,98587.0,103204.0,108484.0,111816.0,118124.0,125751.0,131476.0,136512.0,144771.0,152828.0,162306.0,170397.0,173395.0,183662.0,187704.0,"TEMP:200,205,210,215,220,225,230,235,240,245,250,255,260,265,270,275,280,285,290,295,300,305,310,315,320,325,330,335,340,345,350,355,360,365,370,375,380,385,390,395,400;HTDR:100;CTDR:0;TRSH:0.002;NEUTR;ENV;;Preheating:300"
15,31.08,60.71,99878.0,179336.0,170051.0,160903.0,144148.0,137747.0,131890.0,124350.0,114569.0,110053.0,104950.0,101270.0,95248.0,93338.0,91702.0,86404.0,85522.0,86315.0,85873.0,83145.0,85522.0,86943.0,88692.0,88411.0,91803.0,94177.0,97101.0,98240.0,102509.0,108625.0,111074.0,118041.0,125468.0,131682.0,135408.0,143777.0,152828.0,161836.0,170570.0,172680.0,183461.0,188455.0,"TEMP:200,205,210,215,220,225,230,235,240,245,250,255,260,265,270,275,280,285,290,295,300,305,310,315,320,325,330,335,340,345,350,355,360,365,370,375,380,385,390,395,400;HTDR:100;CTDR:0;TRSH:0.002;NEUTR;ENV;;Preheating:300"
16,31.02,60.93,99864.0,184268.0,173575.0,164700.0,146930.0,140402.0,133679.0,127280.0,116239.0,111296.0,106892.0,103523.0,95714.0,94925.0,93546.0,87671.0,87396.0,88225.0,88318.0,84743.0,87033.0,88411.0,91104.0,90513.0,92718.0,95496.0,97896.0,99940.0,104296.0,109477.0,113176.0,118291.0,126035.0,132726.0,136623.0,145906.0,154236.0,163734.0,171443.0,173755.0,184471.0,190969.0,"TEMP:200,205,210,215,220,225,230,235,240,245,250,255,260,265,270,275,280,285,290,295,300,305,310,315,320,325,330,335,340,345,350,355,360,365,370,375,380,385,390,395,400;HTDR:100;CTDR:0;TRSH:0.002;NEUTR;ENV;;Preheating:300"
17,31.0,61.06,99870.0,196085.0,185083.0,173936.0,156250.0,148493.0,141949.0,134972.0,123162.0,118794.0,113023.0,109908.0,101638.0,99940.0,98298.0,93338.0,93027.0,93756.0,93861.0,89930.0,92513.0,93756.0,94633.0,95248.0,97554.0,100661.0,103973.0,105214.0,109908.0,115279.0,118124.0,124628.0,131890.0,138544.0,142553.0,150765.0,159221.0,168511.0,177061.0,178571.0,188888.0,194579.0,"TEMP:200,205,210,215,220,225,230,235,240,245,250,255,260,265,270,275,280,285,290,295,300,305,310,315,320,325,330,335,340,345,350,355,360,365,370,375,380,385,390,395,400;HTDR:100;CTDR:0;TRSH:0.002;NEUTR;ENV;;Preheating:300"
18,31.01,61.13,99862.0,182263.0,170570.0,162621.0,144771.0,137974.0,132098.0,125468.0,114491.0,110927.0,105612.0,101948.0,94686.0,93756.0,92513.0,86943.0,86404.0,87487.0,87579.0,83894.0,86049.0,87487.0,89737.0,89164.0,91702.0,95684.0,97668.0,99054.0,103844.0,109121.0,111890.0,118626.0,126035.0,132831.0,138430.0,144896.0,153811.0,163255.0,170570.0,173037.0,185083.0,191190.0,"TEMP:200,205,210,215,220,225,230,235,240,245,250,255,260,265,270,275,280,285,290,295,300,305,310,315,320,325,330,335,340,345,350,355,360,365,370,375,380,385,390,395,400;HTDR:100;CTDR:0;TRSH:0.002;NEUTR;ENV;;Preheating:300"
19,31.01,61.23,99862.0,195271.0,183864.0,174116.0,156396.0,148625.0,142796.0,134755.0,123525.0,117792.0,113559.0,109620.0,101886.0,99940.0,98471.0,93338.0,92923.0,93651.0,93651.0,90027.0,92207.0,94177.0,95466.0,94817.0,97611.0,100480.0,104167.0,104950.0,109836.0,114883.0,118041.0,124535.0,131682.0,138430.0,142675.0,150359.0,159676.0,168511.0,175945.0,179336.0,188888.0,193892.0,"TEMP:200,205,210,215,220,225,230,235,240,245,250,255,260,265,270,275,280,285,290,295,300,305,310,315,320,325,330,335,340,345,350,355,360,365,370,375,380,385,390,395,400;HTDR:100;CTDR:0;TRSH:0.002;NEUTR;ENV;;Preheating:300"
20,31.04,61.26,99876.0,179721.0,168342.0,159828.0,143654.0,136958.0,131270.0,124258.0,113176.0,108274.0,104819.0,100722.0,94817.0,92513.0,91602.0,85873.0,85261.0,86404.0,86049.0,82980.0,85348.0,86583.0,88598.0,88411.0,91005.0,94710.0,96653.0,98820.0,103268.0,108766.0,111370.0,118124.0,125468.0,132306.0,136068.0,144397.0,153952.0,162621.0,170570.0,173755.0,184675.0,189649.0,"TEMP:200,205,210,215,220,225,230,235,240,245,250,255,260,265,270,275,280,285,290,295,300,305,310,315,320,325,330,335,340,345,350,355,360,365,370,375,380,385,390,395,400;HTDR:100;CTDR:0;TRSH:0.002;NEUTR;ENV;;Preheating:300"
21,31.06,61.26,99878.0,202226.0,190747.0,181081.0,161058.0,153388.0,146673.0,138889.0,127280.0,121818.0,116725.0,112871.0,104687.0,103204.0,101515.0,95062.0,95442.0,95989.0,95170.0,93234.0,95466.0,95116.0,97668.0,96765.0,99940.0,103014.0,106080.0,107786.0,112190.0,117875.0,120072.0,126894.0,134322.0,140756.0,145399.0,153529.0,161680.0,170744.0,178953.0,181277.0,190969.0,195271.0,"TEMP:200,205,210,215,220,225,230,235,240,245,250,255,260,265,270,275,280,285,290,295,300,305,310,315,320,325,330,335,340,345,350,355,360,365,370,375,380,385,390,395,400;HTDR:100;CTDR:0;TRSH:0.002;NEUTR;ENV;;Preheating:300"
22,31.12,61.28,99878.0,184879.0,173936.0,164055.0,147447.0,140638.0,135081.0,127473.0,116725.0,112416.0,107648.0,103523.0,96320.0,95140.0,93966.0,88598.0,87763.0,88692.0,88225.0,85088.0,87487.0,89545.0,90808.0,90513.0,93338.0,95934.0,98995.0,100904.0,105346.0,110634.0,113482.0,120504.0,127765.0,133893.0,138659.0,146416.0,155093.0,163894.0,170918.0,173575.0,185493.0,191524.0,"TEMP:200,205,210,215,220,225,230,235,240,245,250,255,260,265,270,275,280,285,290,295,300,305,310,315,320,325,330,335,340,345,350,355,360,365,370,375,380,385,390,395,400;HTDR:100;CTDR:0;TRSH:0.002;NEUTR;ENV;;Preheating:300"
23,31.17,61.2,99876.0,179144.0,168342.0,158617.0,143162.0,136735.0,130047.0,123616.0,113099.0,108625.0,103908.0,100540.0,94603.0,92106.0,91303.0,85522.0,85174.0,86226.0,85873.0,82408.0,84915.0,86943.0,87855.0,87671.0,91502.0,93966.0,96542.0,97839.0,102950.0,107925.0,110488.0,117461.0,125000.0,131890.0,135518.0,143408.0,151996.0,161368.0,168681.0,171971.0,183461.0,186852.0,"TEMP:200,205,210,215,220,225,230,235,240,245,250,255,260,265,270,275,280,285,290,295,300,305,310,315,320,325,330,335,340,345,350,355,360,365,370,375,380,385,390,395,400;HTDR:100;CTDR:0;TRSH:0.002;NEUTR;ENV;;Preheating:300"
24,31.07,61.41,99870.0,163734.0,154520.0,146033.0,131270.0,125656.0,119814.0,113406.0,103779.0,99821.0,96044.0,93756.0,87123.0,85088.0,84232.0,78989.0,78766.0,79363.0,79213.0,76186.0,78324.0,79589.0,81765.0,81526.0,83978.0,88225.0,90906.0,93027.0,96542.0,101948.0,104884.0,111222.0,119132.0,125751.0,130962.0,138659.0,146801.0,156250.0,163415.0,167836.0,178381.0,185698.0,"TEMP:200,205,210,215,220,225,230,235,240,245,250,255,260,265,270,275,280,285,290,295,300,305,310,315,320,325,330,335,340,345,350,355,360,365,370,375,380,385,390,395,400;HTDR:100;CTDR:0;TRSH:0.002;NEUTR;ENV;;Preheating:300"
25,31.09,61.44,99860.0,182462.0,171971.0,162149.0,145526.0,138430.0,132831.0,125940.0,115279.0,110634.0,106147.0,102259.0,94686.0,94072.0,92718.0,87305.0,86583.0,87487.0,87305.0,83978.0,86673.0,88132.0,89930.0,90027.0,93130.0,95279.0,98471.0,100239.0,104492.0,110270.0,112719.0,119472.0,126894.0,133679.0,137860.0,145652.0,154806.0,163574.0,172148.0,174843.0,185698.0,191524.0,"TEMP:200,205,210,215,220,225,230,235,240,245,250,255,260,265,270,275,280,285,290,295,300,305,310,315,320,325,330,335,340,345,350,355,360,365,370,375,380,385,390,395,400;HTDR:100;CTDR:0;TRSH:0.002;NEUTR;ENV;;Preheating:300"
26,31.14,61.39,99852.0,201854.0,189649.0,179721.0,160287.0,153388.0,145779.0,138544.0,127183.0,121377.0,116481.0,112643.0,104687.0,102824.0,101392.0,95225.0,95466.0,95550.0,95714.0,92718.0,94925.0,95605.0,97214.0,96154.0,98878.0,102698.0,106756.0,107441.0,112265.0,117792.0,120851.0,126798.0,133786.0,140402.0,144771.0,152550.0,161368.0,170224.0,177813.0,181277.0,190527.0,194579.0,"TEMP:200,205,210,215,220,225,230,235,240,245,250,255,260,265,270,275,280,285,290,295,300,305,310,315,320,325,330,335,340,345,350,355,360,365,370,375,380,385,390,395,400;HTDR:100;CTDR:0;TRSH:0.002;NEUTR;ENV;;Preheating:300"
27,31.15,61.39,99856.0,198090.0,187064.0,177061.0,158168.0,150359.0,144397.0,136290.0,124628.0,119643.0,114883.0,110927.0,102698.0,101086.0,99525.0,94283.0,94177.0,95140.0,95032.0,90808.0,93442.0,94633.0,95824.0,95574.0,97497.0,101025.0,105016.0,106484.0,110707.0,116319.0,119302.0,126225.0,132621.0,139583.0,143777.0,151721.0,160441.0,169706.0,177436.0,179528.0,190197.0,194579.0,"TEMP:200,205,210,215,220,225,230,235,240,245,250,255,260,265,270,275,280,285,290,295,300,305,310,315,320,325,330,335,340,345,350,355,360,365,370,375,380,385,390,395,400;HTDR:100;CTDR:0;TRSH:0.002;NEUTR;ENV;;Preheating:300"
28,31.11,61.5,99860.0,161058.0,151859.0,143777.0,128846.0,123162.0,117461.0,112190.0,102196.0,97554.0,95032.0,92207.0,85522.0,83810.0,82490.0,77598.0,77098.0,77598.0,76956.0,74625.0,76745.0,77887.0,80276.0,80199.0,83310.0,86315.0,90027.0,91803.0,95062.0,100480.0,103204.0,110343.0,117544.0,123799.0,127183.0,137295.0,145652.0,154378.0,162779.0,165187.0,176688.0,184268.0,"TEMP:200,205,210,215,220,225,230,235,240,245,250,255,260,265,270,275,280,285,290,295,300,305,310,315,320,325,330,335,340,345,350,355,360,365,370,375,380,385,390,395,400;HTDR:100;CTDR:0;TRSH:0.002;NEUTR;ENV;;Preheating:300"
29,31.09,61.58,99862.0,169878.0,160749.0,151996.0,136179.0,130148.0,124535.0,118041.0,107995.0,103587.0,99289.0,96044.0,90513.0,88411.0,87396.0,82085.0,81685.0,82327.0,82490.0,78989.0,81368.0,82490.0,84572.0,84487.0,87487.0,91203.0,94283.0,94955.0,99702.0,104884.0,108274.0,114883.0,122801.0,128254.0,131994.0,142553.0,150359.0,160287.0,167500.0,170918.0,182065.0,188025.0,"TEMP:200,205,210,215,220,225,230,235,240,245,250,255,260,265,270,275,280,285,290,295,300,305,310,315,320,325,330,335,340,345,350,355,360,365,370,375,380,385,390,395,400;HTDR:100;CTDR:0;TRSH:0.002;NEUTR;ENV;;Preheating:300"
30,31.05,61.67,99862.0,173395.0,164377.0,155380.0,139583.0,133148.0,126702.0,120590.0,110634.0,105479.0,102010.0,98240.0,92106.0,90415.0,88975.0,83727.0,83227.0,83810.0,84232.0,80740.0,82980.0,84147.0,86494.0,85522.0,89641.0,92309.0,95684.0,95934.0,101270.0,105678.0,109477.0,116481.0,123799.0,130553.0,135408.0,142675.0,152134.0,161524.0,168004.0,172148.0,183060.0,188563.0,"TEMP:200,205,210,215,220,225,230,235,240,245,250,255,260,265,270,275,280,285,290,295,300,305,310,315,320,325,330,335,340,345,350,355,360,365,370,375,380,385,390,395,400;HTDR:100;CTDR:0;TRSH:0.002;NEUTR;ENV;;Preheating:300"
31,31.04,61.71,99866.0,184879.0,174298.0,164538.0,147188.0,140520.0,135190.0,127668.0,116888.0,111370.0,107717.0,103523.0,96765.0,95466.0,94177.0,88692.0,88225.0,88786.0,88318.0,85348.0,87855.0,89930.0,91104.0,90611.0,93546.0,96597.0,99584.0,101270.0,106417.0,111370.0,113946.0,121114.0,128254.0,135081.0,138201.0,147968.0,156396.0,166171.0,173575.0,176874.0,186428.0,192644.0,"TEMP:200,205,210,215,220,225,230,235,240,245,250,255,260,265,270,275,280,285,290,295,300,305,310,315,320,325,330,335,340,345,350,355,360,365,370,375,380,385,390,395,400;HTDR:100;CTDR:0;TRSH:0.002;NEUTR;ENV;;Preheating:300"
32,31.04,61.73,99870.0,206408.0,195040.0,184268.0,164538.0,157129.0,149287.0,141709.0,130148.0,124628.0,119132.0,115279.0,107234.0,105214.0,103779.0,97327.0,96989.0,97839.0,97839.0,94710.0,96264.0,98240.0,99348.0,99289.0,102635.0,105214.0,108979.0,109406.0,114726.0,119814.0,122801.0,129444.0,136846.0,143654.0,145399.0,154520.0,163734.0,173936.0,181277.0,183662.0,193892.0,199772.0,"TEMP:200,205,210,215,220,225,230,235,240,245,250,255,260,265,270,275,280,285,290,295,300,305,310,315,320,325,330,335,340,345,350,355,360,365,370,375,380,385,390,395,400;HTDR:100;CTDR:0;TRSH:0.002;NEUTR;ENV;;Preheating:300"
33,31.01,61.78,99868.0,188240.0,178191.0,168004.0,150901.0,143408.0,137295.0,130350.0,119302.0,114491.0,109549.0,105879.0,98529.0,96542.0,94847.0,90318.0,89930.0,90513.0,90906.0,87123.0,89545.0,90808.0,93130.0,92820.0,94633.0,98240.0,101948.0,103268.0,108134.0,113868.0,116158.0,122263.0,129244.0,136846.0,139933.0,149554.0,158617.0,167668.0,175209.0,178953.0,188348.0,193209.0,"TEMP:200,205,210,215,220,225,230,235,240,245,250,255,260,265,270,275,280,285,290,295,300,305,310,315,320,325,330,335,340,345,350,355,360,365,370,375,380,385,390,395,400;HTDR:100;CTDR:0;TRSH:0.002;NEUTR;ENV;;Preheating:300"
34,30.97,61.88,99874.0,184675.0,174116.0,164216.0,147059.0,139583.0,133786.0,127376.0,116078.0,111741.0,107510.0,103523.0,95879.0,95140.0,94177.0,88225.0,87671.0,88692.0,88225.0,85174.0,87579.0,89069.0,91303.0,90906.0,94710.0,96597.0,99821.0,100964.0,105148.0,111148.0,114101.0,120851.0,127473.0,134972.0,139583.0,146673.0,156396.0,165842.0,172503.0,176130.0,185171.0,190527.0,"TEMP:200,205,210,215,220,225,230,235,240,245,250,255,260,265,270,275,280,285,290,295,300,305,310,315,320,325,330,335,340,345,350,355,360,365,370,375,380,385,390,395,400;HTDR:100;CTDR:0;TRSH:0.002;NEUTR;ENV;;Preheating:300"
35,30.95,61.92,99872.0,203099.0,192419.0,182462.0,161992.0,154378.0,147707.0,140285.0,128648.0,122891.0,117461.0,114023.0,105678.0,103651.0,102824.0,95879.0,95824.0,96431.0,96486.0,93651.0,95062.0,96044.0,98125.0,97725.0,100299.0,104492.0,107097.0,107995.0,113252.0,118963.0,121377.0,128058.0,135958.0,142553.0,147059.0,154663.0,162938.0,172680.0,179336.0,183060.0,193096.0,199048.0,"TEMP:200,205,210,215,220,225,230,235,240,245,250,255,260,265,270,275,280,285,290,295,300,305,310,315,320,325,330,335,340,345,350,355,360,365,370,375,380,385,390,395,400;HTDR:100;CTDR:0;TRSH:0.002;NEUTR;ENV;;Preheating:300"
36,30.9,62.01,99866.0,174661.0,164538.0,155669.0,139351.0,133786.0,127473.0,121201.0,111074.0,106013.0,102072.0,98645.0,92513.0,90611.0,89354.0,84063.0,83727.0,84402.0,83559.0,81289.0,83643.0,85088.0,86943.0,86494.0,89930.0,93442.0,95605.0,97271.0,101824.0,107166.0,110270.0,116643.0,123708.0,131270.0,134863.0,143530.0,152134.0,161213.0,168851.0,171971.0,184066.0,188563.0,"TEMP:200,205,210,215,220,225,230,235,240,245,250,255,260,265,270,275,280,285,290,295,300,305,310,315,320,325,330,335,340,345,350,355,360,365,370,375,380,385,390,395,400;HTDR:100;CTDR:0;TRSH:0.002;NEUTR;ENV;;Preheating:300"
37,30.86,62.1,99864.0,182860.0,172680.0,163255.0,146161.0,139583.0,133466.0,126320.0,116078.0,110927.0,106417.0,103459.0,95989.0,94925.0,93651.0,87855.0,87487.0,88225.0,87487.0,85174.0,87487.0,88880.0,90906.0,90221.0,93234.0,95934.0,98995.0,100964.0,105612.0,111222.0,113868.0,120417.0,127765.0,134863.0,138087.0,147059.0,155959.0,165187.0,172680.0,176316.0,186323.0,192082.0,"TEMP:200,205,210,215,220,225,230,235,240,245,250,255,260,265,270,275,280,285,290,295,300,305,310,315,320,325,330,335,340,345,350,355,360,365,370,375,380,385,390,395,400;HTDR:100;CTDR:0;TRSH:0.002;NEUTR;ENV;;Preheating:300"
38,30.83,62.14,99862.0,176874.0,167333.0,158318.0,141949.0,134646.0,129344.0,123071.0,112416.0,107717.0,103204.0,100420.0,93966.0,91904.0,90906.0,85174.0,84743.0,85609.0,85174.0,82408.0,85001.0,86226.0,88225.0,87763.0,90808.0,94817.0,96933.0,98471.0,102824.0,108344.0,111518.0,118207.0,126130.0,132516.0,137634.0,145526.0,154094.0,162149.0,170744.0,174479.0,185171.0,191190.0,"TEMP:200,205,210,215,220,225,230,235,240,245,250,255,260,265,270,275,280,285,290,295,300,305,310,315,320,325,330,335,340,345,350,355,360,365,370,375,380,385,390,395,400;HTDR:100;CTDR:0;TRSH:0.002;NEUTR;ENV;;Preheating:300"
39,30.8,62.19,99860.0,203349.0,191635.0,182462.0,162464.0,154520.0,148099.0,140520.0,128058.0,122263.0,118291.0,114334.0,105612.0,104037.0,102446.0,96099.0,96044.0,96264.0,97158.0,93966.0,95279.0,96486.0,98414.0,97953.0,101025.0,104687.0,107925.0,109263.0,113636.0,118710.0,121907.0,129045.0,136735.0,142190.0,147059.0,155093.0,163574.0,174116.0,181277.0,184066.0,193096.0,198329.0,"TEMP:200,205,210,215,220,225,230,235,240,245,250,255,260,265,270,275,280,285,290,295,300,305,310,315,320,325,330,335,340,345,350,355,360,365,370,375,380,385,390,395,400;HTDR:100;CTDR:0;TRSH:0.002;NEUTR;ENV;;Preheating:300"
40,30.78,62.21,99862.0,190087.0,179914.0,170744.0,152828.0,144272.0,139120.0,132098.0,120939.0,115438.0,110488.0,107372.0,99762.0,97782.0,96154.0,91702.0,91104.0,91402.0,91303.0,88598.0,90906.0,92309.0,94390.0,93756.0,95989.0,99821.0,102824.0,104167.0,108625.0,114726.0,117379.0,124258.0,132726.0,138774.0,141709.0,150359.0,160134.0,169534.0,176874.0,178953.0,190307.0,197733.0,"TEMP:200,205,210,215,220,225,230,235,240,245,250,255,260,265,270,275,280,285,290,295,300,305,310,315,320,325,330,335,340,345,350,355,360,365,370,375,380,385,390,395,400;HTDR:100;CTDR:0;TRSH:0.002;NEUTR;ENV;;Preheating:300"
41,30.76,62.23,99854.0,187597.0,177436.0,167500.0,150090.0,142796.0,136623.0,129845.0,118879.0,114101.0,109192.0,106214.0,98298.0,96044.0,94740.0,90318.0,89930.0,90709.0,90709.0,87579.0,89545.0,91104.0,92923.0,92718.0,94633.0,98762.0,101577.0,102635.0,107995.0,113176.0,116158.0,123708.0,130859.0,137070.0,143408.0,149287.0,159372.0,168511.0,175577.0,178571.0,190197.0,195619.0,"TEMP:200,205,210,215,220,225,230,235,240,245,250,255,260,265,270,275,280,285,290,295,300,305,310,315,320,325,330,335,340,345,350,355,360,365,370,375,380,385,390,395,400;HTDR:100;CTDR:0;TRSH:0.002;NEUTR;ENV;;Preheating:300"
42,30.74,62.25,99852.0,200380.0,189213.0,179528.0,160134.0,152273.0,145779.0,138201.0,126225.0,120244.0,117051.0,113176.0,104687.0,102509.0,101208.0,94579.0,94901.0,95387.0,95062.0,92820.0,95140.0,95714.0,97839.0,96821.0,99584.0,103523.0,106688.0,108344.0,112871.0,119387.0,121377.0,127570.0,135190.0,141829.0,144646.0,155380.0,163574.0,172859.0,180886.0,182860.0,193778.0,198568.0,"TEMP:200,205,210,215,220,225,230,235,240,245,250,255,260,265,270,275,280,285,290,295,300,305,310,315,320,325,330,335,340,345,350,355,360,365,370,375,380,385,390,395,400;HTDR:100;CTDR:0;TRSH:0.002;NEUTR;ENV;;Preheating:300"
43,30.72,62.28,99850.0,184066.0,173936.0,164377.0,146801.0,140285.0,134430.0,127863.0,116481.0,110634.0,107510.0,104557.0,96044.0,95248.0,94072.0,88598.0,87763.0,89164.0,88504.0,85697.0,87855.0,89164.0,91702.0,91402.0,94177.0,96486.0,100060.0,102072.0,106417.0,111444.0,114413.0,121377.0,128846.0,135518.0,140285.0,147577.0,156982.0,166667.0,173755.0,176688.0,187811.0,193436.0,"TEMP:200,205,210,215,220,225,230,235,240,245,250,255,260,265,270,275,280,285,290,295,300,305,310,315,320,325,330,335,340,345,350,355,360,365,370,375,380,385,390,395,400;HTDR:100;CTDR:0;TRSH:0.002;NEUTR;ENV;;Preheating:300"
44,30.71,62.3,99856.0,199530.0,187918.0,178002.0,158768.0,151173.0,144646.0,137634.0,125845.0,120330.0,115757.0,112567.0,103651.0,102010.0,100359.0,95357.0,95466.0,94901.0,95357.0,92411.0,94710.0,95062.0,97158.0,96597.0,99171.0,102950.0,106080.0,107648.0,112265.0,118124.0,119986.0,126894.0,134107.0,140756.0,143654.0,154520.0,162621.0,173037.0,180108.0,182661.0,192983.0,200136.0,"TEMP:200,205,210,215,220,225,230,235,240,245,250,255,260,265,270,275,280,285,290,295,300,305,310,315,320,325,330,335,340,345,350,355,360,365,370,375,380,385,390,395,400;HTDR:100;CTDR:0;TRSH:0.002;NEUTR;ENV;;Preheating:300"
45,30.68,62.33,99856.0,209693.0,198568.0,186958.0,166833.0,158918.0,152968.0,144521.0,132411.0,127473.0,121818.0,117792.0,108979.0,107097.0,105678.0,98704.0,98414.0,99230.0,98820.0,95387.0,97953.0,98645.0,101700.0,100120.0,103077.0,106620.0,110270.0,112416.0,116643.0,121553.0,124535.0,131476.0,138889.0,145906.0,148099.0,157721.0,166999.0,175393.0,182462.0,185698.0,196906.0,200258.0,"TEMP:200,205,210,215,220,225,230,235,240,245,250,255,260,265,270,275,280,285,290,295,300,305,310,315,320,325,330,335,340,345,350,355,360,365,370,375,380,385,390,395,400;HTDR:100;CTDR:0;TRSH:0.002;NEUTR;ENV;;Preheating:300"
46,30.65,62.37,99852.0,196202.0,185171.0,174843.0,156688.0,149021.0,142311.0,135408.0,124074.0,117792.0,113482.0,110634.0,102321.0,100239.0,98704.0,94177.0,93651.0,94603.0,94177.0,91203.0,93546.0,94603.0,95934.0,94901.0,98298.0,102509.0,105346.0,106282.0,111148.0,117133.0,119217.0,126511.0,133360.0,140756.0,145779.0,152828.0,161992.0,170918.0,178762.0,181277.0,191747.0,197378.0,"TEMP:200,205,210,215,220,225,230,235,240,245,250,255,260,265,270,275,280,285,290,295,300,305,310,315,320,325,330,335,340,345,350,355,360,365,370,375,380,385,390,395,400;HTDR:100;CTDR:0;TRSH:0.002;NEUTR;ENV;;Preheating:300"
47,30.65,62.37,99854.0,190527.0,180886.0,170397.0,151996.0,144896.0,139583.0,132202.0,120764.0,115517.0,110927.0,107786.0,99643.0,97782.0,96542.0,92005.0,91502.0,92309.0,91702.0,88786.0,91005.0,92309.0,94817.0,94072.0,95824.0,99762.0,103523.0,103459.0,108766.0,114179.0,116888.0,124258.0,131476.0,137974.0,140993.0,149420.0,159828.0,168004.0,175761.0,180496.0,189213.0,196202.0,"TEMP:200,205,210,215,220,225,230,235,240,245,250,255,260,265,270,275,280,285,290,295,300,305,310,315,320,325,330,335,340,345,350,355,360,365,370,375,380,385,390,395,400;HTDR:100;CTDR:0;TRSH:0.002;NEUTR;ENV;;Preheating:300"
48,30.64,62.36,99860.0,211988.0,199530.0,188455.0,168681.0,160749.0,154094.0,145906.0,133360.0,128156.0,122981.0,118963.0,110343.0,107925.0,106484.0,100480.0,99466.0,100179.0,99702.0,96709.0,99054.0,100359.0,101886.0,101331.0,104687.0,108625.0,111518.0,112871.0,117461.0,122801.0,125468.0,132306.0,139583.0,146801.0,149287.0,158019.0,167668.0,176316.0,183461.0,185493.0,197496.0,200502.0,"TEMP:200,205,210,215,220,225,230,235,240,245,250,255,260,265,270,275,280,285,290,295,300,305,310,315,320,325,330,335,340,345,350,355,360,365,370,375,380,385,390,395,400;HTDR:100;CTDR:0;TRSH:0.002;NEUTR;ENV;;Preheating:300"
49,30.63,62.35,99864.0,205250.0,194120.0,183260.0,164862.0,156104.0,149554.0,141709.0,129744.0,124258.0,119472.0,115597.0,106892.0,104753.0,103908.0,97045.0,96486.0,97214.0,97101.0,94925.0,95879.0,97782.0,99762.0,99112.0,101392.0,105148.0,109263.0,109836.0,115041.0,119643.0,122621.0,129845.0,136512.0,144148.0,145906.0,155959.0,165350.0,174843.0,182462.0,183662.0,195156.0,201978.0,"TEMP:200,205,210,215,220,225,230,235,240,245,250,255,260,265,270,275,280,285,290,295,300,305,310,315,320,325,330,335,340,345,350,355,360,365,370,375,380,385,390,395,400;HTDR:100;CTDR:0;TRSH:0.002;NEUTR;ENV;;Preheating:300"
50,30.62,62.36,99864.0,212535.0,200015.0,188779.0,168851.0,161213.0,153952.0,146544.0,133254.0,127863.0,123434.0,119472.0,110197.0,107648.0,106892.0,100480.0,100060.0,100299.0,100060.0,96375.0,98937.0,100540.0,102824.0,101392.0,104557.0,108274.0,111965.0,113714.0,117215.0,123525.0,124628.0,132411.0,139467.0,146033.0,150629.0,157425.0,166833.0,175393.0,183662.0,185698.0,196436.0,201730.0,"TEMP:200,205,210,215,220,225,230,235,240,245,250,255,260,265,270,275,280,285,290,295,300,305,310,315,320,325,330,335,340,345,350,355,360,365,370,375,380,385,390,395,400;HTDR:100;CTDR:0;TRSH:0.002;NEUTR;ENV;;Preheating:300"
