^C:\USERS\PHILIPP\SOURCE\REPOS\OOP-ASSIGNMENTS\OOP-ASSIGNMENTS\X64\DEBUG\COMPUTER.OBJ|C:\USERS\PHILIPP\SOURCE\REPOS\OOP-ASSIGNMENTS\OOP-ASSIGNMENTS\X64\DEBUG\COMPUTERSPEC.OBJ|C:\USERS\PHILIPP\SOURCE\REPOS\OOP-ASSIGNMENTS\OOP-ASSIGNMENTS\X64\DEBUG\INVENTORY.OBJ|C:\USERS\PHILIPP\SOURCE\REPOS\OOP-ASSIGNMENTS\OOP-ASSIGNMENTS\X64\DEBUG\ITEM.OBJ|C:\USERS\PHILIPP\SOURCE\REPOS\OOP-ASSIGNMENTS\OOP-ASSIGNMENTS\X64\DEBUG\ITEMSPEC.OBJ|C:\USERS\PHILIPP\SOURCE\REPOS\OOP-ASSIGNMENTS\OOP-ASSIGNMENTS\X64\DEBUG\MAIN.OBJ|C:\USERS\PHILIPP\SOURCE\REPOS\OOP-ASSIGNMENTS\OOP-ASSIGNMENTS\X64\DEBUG\SMARTPHONE.OBJ|C:\USERS\PHILIPP\SOURCE\REPOS\OOP-ASSIGNMENTS\OOP-ASSIGNMENTS\X64\DEBUG\SMARTPHONESPEC.OBJ
/OUT:"C:\USERS\PHILIPP\SOURCE\REPOS\OOP-ASSIGNMENTS\X64\DEBUG\OOP-ASSIGNMENTS.EXE" /INCREMENTAL /NOLOGO KERNEL32.LIB USER32.LIB GDI32.LIB WINSPOOL.LIB COMDLG32.LIB ADVAPI32.LIB SHELL32.LIB OLE32.LIB OLEAUT32.LIB UUID.LIB ODBC32.LIB ODBCCP32.LIB /MANIFEST /MANIFESTUAC:"level='asInvoker' uiAccess='false'" /manifest:embed /DEBUG:FASTLINK /PDB:"C:\USERS\PHILIPP\SOURCE\REPOS\OOP-ASSIGNMENTS\X64\DEBUG\OOP-ASSIGNMENTS.PDB" /SUBSYSTEM:CONSOLE /TLBID:1 /DYNAMICBASE /NXCOMPAT /IMPLIB:"C:\USERS\PHILIPP\SOURCE\REPOS\OOP-ASSIGNMENTS\X64\DEBUG\OOP-ASSIGNMENTS.LIB" /MACHINE:X64 X64\DEBUG\COMPUTER.OBJ
X64\DEBUG\COMPUTERSPEC.OBJ
X64\DEBUG\INVENTORY.OBJ
X64\DEBUG\ITEM.OBJ
X64\DEBUG\ITEMSPEC.OBJ
X64\DEBUG\MAIN.OBJ
X64\DEBUG\SMARTPHONE.OBJ
X64\DEBUG\SMARTPHONESPEC.OBJ
