^C:\USERS\PHILIPP\SOURCE\REPOS\OOP-ASSIGNMENTS\OOP-ASSIGNMENTS\X64\RELEASE\COMPUTER.OBJ|C:\USERS\PHILIPP\SOURCE\REPOS\OOP-ASSIGNMENTS\OOP-ASSIGNMENTS\X64\RELEASE\COMPUTERSPEC.OBJ|C:\USERS\PHILIPP\SOURCE\REPOS\OOP-ASSIGNMENTS\OOP-ASSIGNMENTS\X64\RELEASE\INVENTORY.OBJ|C:\USERS\PHILIPP\SOURCE\REPOS\OOP-ASSIGNMENTS\OOP-ASSIGNMENTS\X64\RELEASE\ITEM.OBJ|C:\USERS\PHILIPP\SOURCE\REPOS\OOP-ASSIGNMENTS\OOP-ASSIGNMENTS\X64\RELEASE\ITEMSPEC.OBJ|C:\USERS\PHILIPP\SOURCE\REPOS\OOP-ASSIGNMENTS\OOP-ASSIGNMENTS\X64\RELEASE\MAIN.OBJ|C:\USERS\PHILIPP\SOURCE\REPOS\OOP-ASSIGNMENTS\OOP-ASSIGNMENTS\X64\RELEASE\SMARTPHONE.OBJ|C:\USERS\PHILIPP\SOURCE\REPOS\OOP-ASSIGNMENTS\OOP-ASSIGNMENTS\X64\RELEASE\SMARTPHONESPEC.OBJ
C:\USERS\PHILIPP\SOURCE\REPOS\OOP-ASSIGNMENTS\X64\RELEASE\OOP-ASSIGNMENTS.EXE
C:\USERS\PHILIPP\SOURCE\REPOS\OOP-ASSIGNMENTS\OOP-ASSIGNMENTS\X64\RELEASE\OOP-ASSIGNMENTS.IPDB
C:\USERS\PHILIPP\SOURCE\REPOS\OOP-ASSIGNMENTS\OOP-ASSIGNMENTS\X64\RELEASE\OOP-ASSIGNMENTS.IOBJ
C:\USERS\PHILIPP\SOURCE\REPOS\OOP-ASSIGNMENTS\X64\RELEASE\OOP-ASSIGNMENTS.PDB
