Vertex 0: -25.703784667213576,26.602424658720906
Vertex 1: 22.29000105984452,-31.88236528101994
Vertex 2: 61.40444642773039,-17.488154102604184
Vertex 3: 30.32752136696075,-27.477284650792317
Vertex 4: 29.977380846059138,-27.42842281551499
Vertex 5: 18.695421965813885,-27.78592402755281
Vertex 6: 18.883179971611128,-28.00761402188645
Vertex 7: -18.21990591937527,19.23710033990775
Vertex 8: -11.88568693440613,12.657461013923797
Vertex 9: 14.505917425433575,-14.807251908577726
Vertex 10: 24.32424754761672,-31.531265413888597
Vertex 11: 24.880012981035357,-31.24456892447284
Vertex 12: 18.56103314346555,-32.806778487894796
Vertex 13: 31.012728444019746,-24.14049296654448
Vertex 14: 19.458660293029418,-15.274143503551013
Vertex 15: 29.853458737706177,-27.126207152488195
Vertex 16: 31.039534286511692,-28.838727420738802
Vertex 17: 30.71846280637817,-29.6960793677682
Vertex 18: 24.39980319548303,-31.603988454231825
Vertex 19: 28.704604387849546,-28.5375037639736
Vertex 20: 28.281102753415567,-29.45140879525909
Vertex 21: 27.452711979591776,-27.44213261248113
Vertex 22: 25.201078760605988,-26.893598158572445
Vertex 23: 25.685113966721516,-28.1169565761469
Vertex 24: 28.20717937941372,-30.062515951592548
Vertex 25: 26.928602729534422,-30.87426576147279
Vertex 26: 29.597388939088862,-31.19892260143595
Vertex 27: 28.01835248984303,-33.89528028881516
Vertex 28: 32.68793228514125,-41.658638083604274
Vertex 29: 18.72519423885354,-35.137600708517155
Vertex 30: 18.70626231022764,-35.00496893977074
Vertex 31: 21.653163642849588,-92.6568479079857
Vertex 32: 18.52813007858799,-33.81080959554466
Vertex 33: 29.72633303462872,-26.63936515088488
Vertex 34: 29.571004924024898,-25.296621889396146
Vertex 35: 29.191118343047236,-24.98841825709692
Vertex 36: 27.230738775135432,-25.866694853659634
Vertex 37: 27.490080132704264,-26.335485275326416
Vertex 38: 27.921698941754876,-26.446555099535967
Vertex 39: 28.13603468356102,-25.651474142984068
Vertex 40: 28.353952263556188,-25.524617244709216
Vertex 41: 28.35839938627736,-26.070031640260584
Vertex 42: 28.214167695477958,-25.75917534419101
Vertex 43: 27.932425789332427,-25.896434830503193
Vertex 44: 28.099386952405176,-25.705341138265744
Vertex 45: 28.004296004548994,-26.23765036914116
Vertex 46: 28.171185249602047,-26.002908436761317
Vertex 47: 28.049252926123163,-25.95234355519978
Vertex 48 (bei 16): 34.66845283698192,-32.27834224714787
Vertex 49 (bei 17): 34.31844792823083,-33.165965118400266
Vertex 50 (bei 26): 32.86844570645788,-34.98048148959958
Vertex 51 (bei 32): 15.812659939504417,-38.00916902795936