Region 0: [7, 2, 1, 6]
Region 1: [15, 13, 14]
Region 2: [14, 6, 1, 0, 13]
Region 3: [15, 7, 6, 14]
Region 4: [17, 8, 0, 3, 16]
Region 5: [19, 17, 16, 18]
Region 6: [21, 20, 43, 45]
Region 7: [43, 3, 4, 20]
Region 8: [27, 24, 23, 25, 26]
Region 9: [27, 12, 11, 2, 7, 15, 13, 0, 8, 9, 10, 26]
Region 10: [44, 30, 28, 29, 31, 32]
Region 11: [29, 12, 27, 24, 28]
Region 12: [30, 21, 20, 4, 5, 23, 24, 28]
Region 13: [31, 22, 11, 12, 29]
Region 14: [45, 44, 30, 21]
Region 15: [32, 22, 31]
Region 16: [1, 2, 11, 22, 32]
Region 17: []
Region 18: [34, 10, 26, 25, 33]
Region 19: [36, 19, 17, 8, 9, 35]
Region 20: [37, 34, 10, 9, 35]
Region 21: [42, 40, 39, 38, 41]
Region 22: [41, 36, 19, 18, 38]
Region 23: [39, 5, 4, 3, 16, 18, 38]
Region 24: [40, 33, 25, 23, 5, 39]
Region 25: [42, 37, 34, 33, 40]
Region 26: [42, 37, 35, 36, 41]