    Cape Town,20151016,478279726,http://www.newsfultoncounty.com/world/news/2312954-south-africa-police-teargas-university-fee-hike-protest

    Cape Town,20151026,478920983,http://www.dukechronicle.com/article/2015/10/students-gather-sunday-for-fees-must-fall-movement
    Cape Town,20151026,479028099,http://www.ibtimes.co.uk/south-africa-fees-must-fall-protesters-march-pretoria-president-zuma-prepares-address-1525324
    Cape Town,20151026,479000185,http://www.news24.com/SouthAfrica/News/FeesMustFall-timeline-Where-are-we-now-20151026
    Cape Town,20151026,479087447,http://www.news24.com/SouthAfrica/News/UCT-vice-chancellors-son-arrested-in-Feesmustfall-protest-20151021

    Cape Town,20151027,479283879,http://www.biznews.com/matthew-lester/2015/10/27/matthew-lester-feesmustfall-blanket-exemption-unaffordable-solution/
    Cape Town,20151027,479358306,http://billsinsider.com/2015/10/27/1899-south-africa-students-win-fee-concessions/
    Cape Town,20151027,479361574,http://www.iol.co.za:80/news/south-africa/live-feesmustfall-debate-1.1932948
    Cape Town,20151027,479378580,http://www.news24.com/SouthAfrica/News/Maimane-compares-feesmustfall-to-Soweto-uprising-20151027
    Cape Town,20151027,479474947,http://www.pri.org/stories/2015-10-27/south-african-photographer-imraan-christian-why-feesmustfall-was-just-beginning
    Cape Town,20151027,479277643,http://www.news24.com/SouthAfrica/News/EFF-playing-of-the-FeesMustFall-card-was-effective-expert-20151021

    Cape Town,20151025,478695036,http://mwcnews.net/news/africa/55089-s-africa-halts-university-fee.html
    Cape Town,20151025,478696928,http://www.justcurious.co.za/feesmustfall/
    Cape Town,20151025,478755259,http://www.timeslive.co.za/sundaytimes/stnews/2015/10/25/Pride-pain-and-parenthood-in-wake-of-fees-protests
    Cape Town,20151025,478841814,http://www.dailymaverick.co.za/article/2015-10-25-reporters-notebook-feesmustfall-the-event-we-didnt-cover/

    Cape Town,20151024,478428949,http://www.aljazeera.com/news/2015/10/africa-halts-university-fee-hikes-mass-protests-151023234533972.html
    Cape Town,20151024,478436238,http://www.chronicle.co.zw/zero-increase-in-varsity-fees-zuma/
    Cape Town,20151024,478447307,http://www.capitalfm.co.ke/campus/south-african-students-storm-parliament-to-demo-against-rising-uni-fees/
    Cape Town,20151024,478481060,http://www.lidtime.com/where-to-watch-feesmustfall-parliament-occupation-live-4988/
    Cape Town,20151024,478505005,http://www.turkishweekly.net/2015/10/24/news/south-africa-police-teargas-university-fee-hike-protest/
    Cape Town,20151024,478505283,http://www.dailymaverick.co.za/article/2015-10-24-feeshavefallen-cape-towns-day-of-confusion-and-misinformation/
    Cape Town,20151024,478523765,http://seatingchair.com/2015/10/24/heres-the-deal-with-the-feesmustfall-student-uprising-in-12216.html
    Cape Town,20151024,478526388,http://www.dispatchtimes.com/eff-kicked-out-of-parliament-for-chanting-feesmustfall/147760/
    Cape Town,20151024,478540085,http://africajournalismtheworld.com/tag/feesmustfall/
    Cape Town,20151024,478587681,http://www.ghanaweb.com/GhanaHomePage/worldNews/S-Africa-defer-plans-to-increase-tuition-fees-after-protests-389700

    Cape Town,20151015,476214365,http://www.bdlive.co.za/national/2015/10/15/sa-hit-by-anti-corruption-marches-as-wits-faces-fees-war

    Cape Town,20151028,479536475,http://capeandislands.org/post/south-african-photographer-imraan-christian-why-feesmustfall-was-just-beginning
    Cape Town,20151028,479554897,http://www.dailymaverick.co.za/article/2015-10-28-feesmustfall-no-end-in-sight/
    Cape Town,20151028,479554906,http://www.dailymaverick.co.za/article/2015-10-27-parliamentary-diary-teletubbies-and-grandstanding-in-student-fees-debate/
    Cape Town,20151028,479617203,https://www.biznews.com/matthew-lester/2015/10/27/matthew-lester-feesmustfall-blanket-exemption-unaffordable-solution/
    Cape Town,20151028,479678756,http://www.news24.com/SouthAfrica/News/Police-exercised-serious-restraint-on-feesmustfall-protesters-20151028
    Cape Town,20151028,479683178,http://www.timeslive.co.za/local/2015/10/28/Police-exercised-serious-restraint-on-feesmustfall-protesters
    Cape Town,20151028,479750488,http://wakeywakeynews.com/2341/south-africa-police-teargas-university-fee-hike-protest

    Cape Town,20151017,476924656,http://www.news24.com/SouthAfrica/News/Wits-suspends-fee-hike-20151017-2

    Cape Town,20151013,477813020,http://ewn.co.za/2015/10/20/FeesMustFall-Consensus-reached-on-increases


--------------------------
Johannesburg,20151020,477591114,http://herald-review.com/news/world/africa/south-african-students-protest-planned-tuition-fee-hikes/article_8865983e-4bff-508d-882e-e2c348c89377.html
Johannesburg,20151020,477592048,http://thetandd.com/news/world/south-african-students-protest-planned-tuition-fee-hikes/article_31d9950d-66d6-5b00-8d65-df8c51e562dc.html
Johannesburg,20151020,477632512,http://www.moneyweb.co.za/news/south-africa/so-you-think-that-sa-varsity-fees-must-fall/
Johannesburg,20151020,477667362,http://www.enca.com/south-africa/students-say-witsfees-fight-far-over
Johannesburg,20151020,477689121,http://www.thestar.com.my/News/World/2015/10/20/South-African-students-protest-over-plans-to-raise-tuition-fees/
Johannesburg,20151020,477746394,http://gulfnews.com/news/africa/south-africa/south-african-students-protest-over-plans-to-raise-tuition-fees-1.1603613
Johannesburg,20151020,477785493,http://theconversation.com/fee-protests-point-to-a-much-deeper-problem-at-south-african-universities-49456
Johannesburg,20151020,477798425,http://mg.co.za/article/2015-10-20-police-fire-stun-grenades-arrest-23-as-student-fee-protests-spread/
Johannesburg,20151020,477805417,http://www.htxt.co.za/2015/10/20/high-court-issues-interdiction-against-a-hashtag-in-feesmustfall-doc/
Johannesburg,20151020,477817442,http://www.islamicinvitationturkey.com/2015/10/20/south-africa-students-protest-tuition-fee-hike/
Johannesburg,20151020,477851951,http://www.dw.com/en/south-african-universities-to-cap-fee-increases-as-protests-mount/a-18793983
Johannesburg,20151020,477876889,http://www.enca.com/south-africa/university-fees-increment-capped
Johannesburg,20151020,477900527,http://www.sabc.co.za/news/a/1a8c71804a475b2da60dff6d39fe9e0c/Tuition-fee-increases-at-tertiary-institutions-won%E2%80%99t-exceed-6-20152010
Johannesburg,20151020,477934206,http://www.dailymaverick.co.za/article/2015-10-21-feesmustfall-political-failure-triggers-ticking-time-bomb/

Johannesburg,20151021,477987508,http://www.dailymaverick.co.za/article/2015-10-21-feesmustfall-the-word-is-zero.../
Johannesburg,20151021,479750106,http://wakeywakeynews.com/2341/south-africa-police-teargas-university-fee-hike-protest

Johannesburg,20151023,478051726,http://citizen.co.za/828900/tuks-joins-fee-hike-protests/
Johannesburg,20151023,478052141,http://citizen.co.za/828884/wits-students-regroup-to-protest-against-fee-hikes/
Johannesburg,20151023,478080146,http://www.dailymaverick.co.za/article/2015-10-23-groundup-feesmustfall-i-am-inspired-by-students-spirit-and-discipline-says-kathrada/
Johannesburg,20151023,478081635,http://www.theguardian.com/world/2015/oct/22/south-african-students-rally-against-tuition-fees-in-johannesburg
Johannesburg,20151023,478092723,http://www.aljazeera.com/news/2015/10/zuma-meet-feesmustfall-leaders-protests-continue-151023014228801.html
Johannesburg,20151023,478099555,http://www.okayafrica.com/news/fees-must-fall-student-protests-johannesburg-south-africa-kgomotso-neto-photos/
Johannesburg,20151023,478113729,http://morningstaronline.co.uk/a-d76b-South-Africa-Students-stage-mass-rallies-against-tuition-fee-rises
Johannesburg,20151023,478144255,http://ewn.co.za/2015/10/23/Zuma-to-lead-highlevel-meeting-over-varsity-fees
Johannesburg,20151023,478166568,http://www.702.co.za/articles/5946/feesmustfall-students-join-forces-to-march-to-union-buildings
Johannesburg,20151023,478176589,http://www.enca.com/south-africa/feesmustfall-brutality-police-defend-their-actions
Johannesburg,20151023,478177881,http://www.enca.com/south-africa/feesmustfall-latest-campuses-nationwide
Johannesburg,20151023,478190418,http://rapidnewsnetwork.com/students-breach-south-africa-parliament-during-fee-demo/245784/
Johannesburg,20151023,478199075,http://www.cnn.com/2015/10/23/africa/south-africa-fee-increase-protests/
Johannesburg,20151023,478215871,http://www.ifreepress.com/1853-jacob-zuma-will-meet-feesmustfall-protesters-on-friday/
Johannesburg,20151023,478225325,https://www.destinyman.com/2015/10/23/more-universities-suspend-classes-following-feesmustfall/
Johannesburg,20151023,478225326,https://www.enca.com/south-africa/map-explore-feesmustfall-across-country
Johannesburg,20151023,478228558,http://pulse.com.gh/international/in-south-africa-zuma-meets-students-after-protests-over-fees-id4287625.html
Johannesburg,20151023,478232800,http://thenationonlineng.net/fee-hikes-south-african-students-march-in-pretoria/
Johannesburg,20151023,478239139,http://www.graziadaily.co.za/hot-stories/how-you-can-help-feesmustfall/
Johannesburg,20151023,478247428,http://kenya.news24.com/Africa/News/University-students-in-SA-to-protest-against-fee-increases-20151021
Johannesburg,20151023,478297828,http://mgafrica.com/article/2015-10-23-faced-with-worst-south-african-student-protests-in-over-20-years-zuma-freezes-university-fees-hike
Johannesburg,20151023,478298153,http://www.dazeddigital.com/artsandculture/article/27121/1/south-african-student-protests-against-fees-go-global
Johannesburg,20151023,478319754,http://zululandobserver.co.za/87938/how-zululand-students-parents-feel-about-feesmustfall/
Johannesburg,20151023,478321228,http://www.biznews.com/briefs/2015/10/23/students-win-round-1-zuma-freezes-2016-tuition-fees/
Johannesburg,20151023,478323808,http://www.dailysun.co.za/news/national/2015-10-23-zero-increase-in-fees-zuma
Johannesburg,20151023,478334547,http://www.anglicannews.org/news/2015/10/south-african-students-win-zero-per-cent-fee-increase-fight.aspx
Johannesburg,20151023,478343780,http://www.irishtimes.com/news/world/africa/zuma-backs-down-on-third-level-fees-amid-protests-in-south-africa-1.2403952
Johannesburg,20151023,478351133,http://qz.com/531822/protests-force-south-africas-president-to-scrap-university-fee-increases-but-this-is-what-he-missed/
Johannesburg,20151023,478060252,http://www.timeslive.co.za/politics/2015/10/22/FeesMustFall-protests-continue-across-South-Africa-for-a-9th-day
Johannesburg,20151023,478074021,http://ewn.co.za/2015/10/22/South-Africans-from-across-the-world-pledge-their-support-for-FeesMustFall
Johannesburg,20151023,478150661,http://www.sabc.co.za/news/a/f93bde804a4f243398a4db6d39fe9e0c/Fees-must-fall-protest-heads-to-Union-Buildings--20151023
Johannesburg,20151023,478220636,http://www.telegraph.co.uk/news/worldnews/africaandindianocean/southafrica/11950108/South-Africas-FeesMustFall-student-protestors-attack-fences-around-Pretoria-seat-of-government.html
Johannesburg,20151023,478247404,http://www.women24.com/Wellness/BodyAndSpirit/Education-is-for-the-privileged-FeesMustFall-20151023
Johannesburg,20151023,478350396,http://www.timeslive.co.za/politics/2015/10/23/Experiencing-the-FeesMustFall-revolution
Johannesburg,20151023,478575670,http://ewn.co.za/2015/10/24/FeesHaveFallen-Wits-students-meet-behind-closed-doors

Johannesburg,20151016,478287287,https://news.vice.com/article/south-africa-freezes-university-fees-after-days-of-violence
Johannesburg,20151016,476558790,https://www.enca.com/south-africa/ramaphosa-calls-affordable-university-fees
Johannesburg,20151016,476591349,http://www.thedailyvox.co.za/special-editorial-the-wits-protest-is-not-just-about-university-fees/
Johannesburg,20151016,476780550,http://www.enca.com/south-africa/habib-tells-students-hes-powerless-wits-fees

Johannesburg,20151025,478683440,https://www.enca.com/south-africa/watch-montage-feesmustfall

Johannesburg,20151019,477350555,http://www.news24.com/SouthAfrica/News/Special-assembly-planned-at-Wits-over-fee-hikes-20151018
Johannesburg,20151019,477366574,http://www.bdlive.co.za/national/education/2015/10/19/campus-protests-over-fee-increases-spread
Johannesburg,20151019,477405339,https://www.enca.com/south-africa/d-day-witsfees-protest
Johannesburg,20151019,477429729,http://pulse.ng/student/rhodes-university-tuition-fee-protests-shut-down-another-south-african-institution-id4273565.html
Johannesburg,20151019,477430128,http://www.live5news.com/story/30292894/south-african-students-protests-planned-tuition-fee-hikes
Johannesburg,20151019,477436156,http://www.enca.com/south-africa/student-leaders-forefront-feesmustfall-protest
Johannesburg,20151019,477441560,http://www.moneyweb.co.za/news-fast-news/students-protest-at-top-universities-over-fee-hikes/
Johannesburg,20151019,477441564,http://whlt.com/ap/south-african-students-protests-planned-tuition-fee-hikes/
Johannesburg,20151019,477457008,http://herald-review.com/news/world/africa/south-african-students-protests-planned-tuition-fee-hikes/article_8865983e-4bff-508d-882e-e2c348c89377.html
Johannesburg,20151019,477469456,https://www.timeshighereducation.com/news/tuition-fee-protests-spread-across-south-africa
Johannesburg,20151019,477479393,http://www.nbc29.com/story/30292893/south-african-students-protest-planned-tuition-fee-hikes
Johannesburg,20151019,477511109,http://ewn.co.za/2015/10/19/FeesMustFall-The-trending-conversation

Johannesburg,20151012,477405254,https://www.enca.com/south-africa/d-day-witsfees-protest

Johannesburg,20151018,477199845,http://www.sabc.co.za/news/a/915deb004a3ebfdfac00efa53d9712f0/Govt-hopes-for-amicable-solution-to-Wits-fee-saga-20151017

Johannesburg,20151024,478433519,http://www.thezimbabwedaily.com/news/40089-zuma-caves-in-on-uni-fees.html
Johannesburg,20151024,478437158,http://www.chronicle.co.zw/zero-increase-in-varsity-fees-zuma/
Johannesburg,20151024,478481417,http://www.enca.com/south-africa/watch-feesmustfall-highlights-package
Johannesburg,20151024,478492763,http://www.enca.com/south-africa/feeshavefallen-where-will-money-come
Johannesburg,20151024,478523910,http://seatingchair.com/2015/10/24/heres-the-deal-with-the-feesmustfall-student-uprising-in-12216.html
Johannesburg,20151024,478582347,http://www.enca.com/south-africa/watch-montage-feesmustfall
Johannesburg,20151024,478599569,http://www.ghanamma.com/worldnews/2015/10/s-africa-halts-university-fee-hikes-after-mass-protests/
Johannesburg,20151024,478485736,http://www.news24.com/SouthAfrica/News/Sanef-concerned-about-intimidation-of-journalists-during-FeesMustFall-20151024
Johannesburg,20151024,478601480,http://www.news24.com/SouthAfrica/News/Wits-to-remain-closed-as-students-continue-FeesMustFall-campaign-20151024

Johannesburg,20151015,476224498,http://ewn.co.za/2015/10/15/Wits-students-battle-over-fees-continues
Johannesburg,20151015,476231150,http://www.enca.com/south-africa/wits-students-dig-heels-over-fees
Johannesburg,20151015,476253906,http://ewn.co.za/2015/10/15/Higher-education-dept-investigates-factors-in-tuition-fees-increases
Johannesburg,20151015,476317254,http://www.sabc.co.za/news/a/7259ec804a374a8a994fdba53d9712f0/Wits-fees-protest-enters-second-day-20151015
Johannesburg,20151015,476317559,http://www.enca.com/south-africa/witsfeesmustfall-protest-lectures-cancelled-rest-week
Johannesburg,20151015,476384936,http://witspress.bookslive.co.za/blog/2015/10/15/students-have-a-legitimate-concern-on-wits-fees-but-we-are-caught-in-a-bind-adam-habib/
Johannesburg,20151015,476390958,http://mg.co.za/article/2015-10-15-wits-fees-protest-intensifies
Johannesburg,20151015,476444027,http://www.enca.com/south-africa/ramaphosa-calls-affordable-university-fees
Johannesburg,20151015,476591269,http://www.thedailyvox.co.za/special-editorial-the-wits-protest-is-not-just-about-university-fees/

Johannesburg,20151014,475997848,http://www.ann7.com/article/41104-1410201514102015wits-students-protest-against-the-proposed-intuition-fees.html

Johannesburg,20151017,476902056,http://ewn.co.za/2015/10/17/Wits-University-suspends-10-point-5-percent-fee-hike
Johannesburg,20151017,476929648,http://www.sabc.co.za/news/a/88382d804a3cdb1eb44bffa53d9712f0/Wits-suspends-fees-hike-20151017
Johannesburg,20151017,476996429,http://www.sabc.co.za/news/a/98a0c1804a3dacc6a0beeba53d9712f0/Wits-management-to-re-negotiate-tuition-fee-deal-20151017
Johannesburg,20151017,477034879,http://www.sabc.co.za/news/a/28eb35804a3df8b885e0cfa53d9712f0/Nzimande-worried-by-fees-protests-20151710


--------------------------
East London,20151020,477760462,http://www.grocotts.co.za/content/college-rhodes-students-join-forces-over-fees-bursaries-20-10-2015


--------------------------
Pretoria,20151020,477740613,http://en.starafrica.com/education/safrican-minister-stakeholders-discuss-varsity-fees-crisis.html
Pretoria,20151020,477746370,http://www.capetalk.co.za/articles/5903/mixed-responses-to-feesmustfall-protests
Pretoria,20151020,477777255,http://www.ann7.com/article/41381-20102015fee-hike-protest-continue-at-uct.html
Pretoria,20151020,477910521,http://www.coastweek.com/3842-Protests-over-tuition-fee-hikes-escalate-across-South-Africa.htm

Pretoria,20151016,478306333,http://www.newsfultoncounty.com/politics/news/2312962-update-south-africa-police-teargas-university-fee-hike-protest

Pretoria,20151026,478999944,http://citizen.co.za/837849/registrations-fees-scrapped-for-needy-students-at-tuks/
Pretoria,20151026,479004252,http://www.ibtimes.co.uk/south-africa-fees-must-fall-protests-continue-johannesburg-students-call-free-education-1525696
Pretoria,20151026,479029289,http://www.ibtimes.co.uk/south-africa-fees-must-fall-protesters-march-pretoria-president-zuma-prepares-address-1525324
Pretoria,20151026,479037757,http://www.worldbulletin.net/todays-news/165674/safrican-universities-shut-despite-fee-agreement
Pretoria,20151026,479051005,http://www.rappler.com/world/regions/africa/110739-south-african-universities-shut-despite-fee-agreement
Pretoria,20151026,479063291,http://citizen.co.za/837947/fees-must-fall-doesnt-represent-needs-of-afrikaner-students/
Pretoria,20151026,479087454,http://citizen.co.za/838371/tomorrows-news-today-sam-meyiwa-gauteng-veld-fires-and-feesmustfall-protests/
Pretoria,20151026,479091528,http://dailyindependentnig.com/2015/10/south-african-students-continue-fees-protest-universities-remain-closed/
Pretoria,20151026,479110264,http://www.enca.com/south-africa/feesmustfall-fight-won-battle-continues
Pretoria,20151026,479151539,http://www.timeslive.co.za/thetimes/2015/10/27/Call-to-scrap-all-school-fees
Pretoria,20151026,479156490,http://www.okayafrica.com/news/fees-must-fall-south-african-protests-racial-and-generational-politics/
Pretoria,20151026,479324437,http://witspress.bookslive.co.za/blog/2015/10/27/where-to-after-feesmustfall-adam-habib-reveals-wits-9-step-plan-podcast/
Pretoria,20151026,478912301,http://ewn.co.za/2015/10/26/TUT-investigating-after-students-implicated-in-FeesMustFall-violence
Pretoria,20151026,479045214,http://ewn.co.za/2015/10/26/FeesMustFall-Students-still-discussing-the-way-forward

Pretoria,20151025,478694887,http://mwcnews.net/news/africa/55089-s-africa-halts-university-fee.html
Pretoria,20151025,478702725,http://blouinnews.com/84336/story/s-african-leader-freezes-student-fees
Pretoria,20151025,478720344,http://financialspots.com/2015/10/25/s-africas-zuma-scraps-university-fee-hikes-in-face-of/
Pretoria,20151025,478763145,http://www.bdlive.co.za/national/education/2015/10/25/higher-education-committee-welcomes-fee-hike-freeze
Pretoria,20151025,478782734,https://www.enca.com/south-africa/students-arrested-following-feesmustfall-protest-released

Pretoria,20151019,477448786,http://www.news24.com/SouthAfrica/News/Nzimande-to-meet-with-vice-chancellors-over-varsity-fees-20151019
Pretoria,20151019,477541649,https://www.enca.com/south-africa/nzimande-says-varsity-fee-protests-not-crisis-level

Pretoria,20151030,480262865,http://www.dailymaverick.co.za/article/2015-10-30-feesmustfall-thursday-promises-vs.-petrol-bombs/
Pretoria,20151030,480415019,http://memeburn.com/2015/10/feesmustfall-mxit-singularity-university-5-memeburn-articles-you-loved-this-week/

Pretoria,20151024,478428943,http://www.aljazeera.com/news/2015/10/africa-halts-university-fee-hikes-mass-protests-151023234533972.html
Pretoria,20151024,478428948,http://saudigazette.com.sa/world/s-africas-zuma-scraps-university-fee-hikes-in-face-of-protests/
Pretoria,20151024,478432970,http://www.thezimbabwedaily.com/news/40089-zuma-caves-in-on-uni-fees.html
Pretoria,20151024,478448849,http://www.capitalfm.co.ke/campus/south-african-students-storm-parliament-to-demo-against-rising-uni-fees/
Pretoria,20151024,478451546,http://financialspots.com/2015/10/24/south-african-students-demanding-lower-fees-take-protest-to/
Pretoria,20151024,478459877,http://g987fm.com/south-africa-president-zuma-freezes-tuition-fees-amid-protests
Pretoria,20151024,478466455,http://brudirect.com/0-world/world-africa/item/35736-sa-students-zuma-freezes-tuition-fees-amid-protests
Pretoria,20151024,478468183,http://atlantablackstar.com/2015/10/23/south-africas-zuma-freezes-tuition-increase-amidst-feesmustfall-protests/
Pretoria,20151024,478468188,https://www.enca.com/south-africa/universities-extend-exam-period-following-feesmustfall-protests
Pretoria,20151024,478492246,http://www.enca.com/south-africa/feeshavefallen-where-will-money-come
Pretoria,20151024,478492692,http://www.deentv.co.za/zuma-gives-in-to-student-protests-scraps-fee-hikes/
Pretoria,20151024,478492718,http://nehandaradio.com/2015/10/24/zuma-freezes-student-fees-amid-protests/
Pretoria,20151024,478505288,http://www.turkishweekly.net/2015/10/24/news/south-africa-police-teargas-university-fee-hike-protest/
Pretoria,20151024,478507673,http://www.lagazzettadelsudafrica.net/zuma-no-increase-in-university-fees-in-2016.html
Pretoria,20151024,478523991,http://seatingchair.com/2015/10/24/heres-the-deal-with-the-feesmustfall-student-uprising-in-12216.html
Pretoria,20151024,478529190,http://www.bdlive.co.za/national/2015/10/24/tuition-fees-deal-a-co-ordinated-farce-say-student-leaders
Pretoria,20151024,478540601,http://africajournalismtheworld.com/tag/feesmustfall/
Pretoria,20151024,478579358,http://en.igihe.com/education/south-africa-freezes-tuition-fees-after-student.html
Pretoria,20151024,478588976,http://www.ghanaweb.com/GhanaHomePage/worldNews/S-Africa-defer-plans-to-increase-tuition-fees-after-protests-389700
Pretoria,20151024,478634525,http://www.thefrontierpost.com/article/346441/south-african-fee-hike-off-for-2016-after-student-protests/
Pretoria,20151024,478534249,http://www.sabc.co.za/news/a/06d982004a5172109061db6d39fe9e0c/Students-divided-over-Fees-must-fall-outcome-20152410
Pretoria,20151024,478576669,http://ewn.co.za/2015/10/24/FeesHaveFallen-Wits-students-meet-behind-closed-doors
Pretoria,20151024,478619150,http://www.sabc.co.za/news/a/9bbd9f804a5356c2b2a8fb6d39fe9e0c/FeesMustFall-Students-meet-to-discuss-way-forward-20152410

Pretoria,20151017,478504836,http://www.turkishweekly.net/2015/10/24/news/south-africa-police-teargas-university-fee-hike-protest/

Pretoria,20151015,476388974,http://www.thesouthafrican.com/pistorius-to-walk-fee-next-week/

Pretoria,20151028,479527040,http://www.tjcnewspaper.com/south-africa-s-fees-must-fall-protests-demand-free-education-50903/
Pretoria,20151028,479596690,http://actionaid.org/shared/feesmustfall-not-just-about-fees
Pretoria,20151028,479696425,http://www.ibtimes.co.uk/south-africa-fees-must-fall-protests-prove-post-apartheid-born-free-generation-myth-1526059
Pretoria,20151028,479750444,http://wakeywakeynews.com/2341/south-africa-police-teargas-university-fee-hike-protest


--------------------------
    Pietermaritzburg,20151023,478155862,http://ewn.co.za/2015/10/22/KZN-students-heed-the-call-to-join-fees-campaign


--------------------------
    Pinetown,20151028,479643727,http://www.news24.com/SouthAfrica/News/Thousands-of-UKZN-students-still-face-exclusion-over-unpaid-fees-20151027


--------------------------
    Polokwane,20151020,477933441,http://www.dailymaverick.co.za/article/2015-10-21-feesmustfall-political-failure-triggers-ticking-time-bomb/

    Polokwane,20151029,479935622,http://ewn.co.za/2015/10/28/OPINION-Judith-February-FeesHaveFallen-Now-what


--------------------------
Stellenbosch,20151023,478061384,http://fleminggazette.com/10902/south-africa-tuition-fee-protests-students-arrested-in-cape/
Stellenbosch,20151023,478117588,http://rapidnewsnetwork.com/student-protests-over-tuition-fees-turn-violent-in-south-africa/245337/
Stellenbosch,20151023,478271751,http://ewn.co.za/2015/10/23/Students-told-Zille-to-voetsek-amid-ongoing-fee-protests
Stellenbosch,20151023,478287549,http://www.pri.org/stories/2015-10-22/echoes-1976-south-african-students-demand-fees-must-fall
Stellenbosch,20151023,478059948,http://www.timeslive.co.za/politics/2015/10/22/FeesMustFall-protests-continue-across-South-Africa-for-a-9th-day
Stellenbosch,20151023,478201553,http://www.news24.com/SouthAfrica/News/FeesMustFall-State-was-warned-5-years-ago-20151023
Stellenbosch,20151023,478270278,http://ewn.co.za/2015/10/23/FeesMustFall-Cops-use-water-cannons-stun-grenades-at-Union-Buildings

Stellenbosch,20151027,479197432,http://www.herald.co.zw/sa-varsities-protests-much-deeper-than-fees/
Stellenbosch,20151027,479317825,http://tvnewsroom.org/newslines/world/the-racial-and-generational-politics-behind-south-africa-s-feesmustfall-protests-4143/
Stellenbosch,20151027,479318607,http://www.timeslive.co.za/local/2015/10/27/Government-can-cover-0-fee-hike-political-economist
Stellenbosch,20151027,479318670,http://businesstech.co.za/news/general/102353/how-sa-government-can-fund-0-increase-in-university-fees-economist/

Stellenbosch,20151030,480367076,http://citizen.co.za/841025/increases-but-one-issue-in-feesmustfall-nzimande/

Stellenbosch,20151024,478448850,http://www.capitalfm.co.ke/campus/south-african-students-storm-parliament-to-demo-against-rising-uni-fees/
Stellenbosch,20151024,478526286,http://www.lidtime.com/stun-grenades-chaos-on-the-stairs-of-parliament-feesmustfall-9471/
Stellenbosch,20151024,478527246,http://www.dispatchtimes.com/eff-kicked-out-of-parliament-for-chanting-feesmustfall/147760/
Stellenbosch,20151024,478559674,https://www.enca.com/south-africa/fee-must-fall-protest-reminiscent-1967-uprising

Stellenbosch,20151029,479949357,http://www.iol.co.za:80/news/south-africa/western-cape/why-we-ve-joined-feesmustfall-protest-1.1933239

Stellenbosch,20151028,479555723,http://www.dailymaverick.co.za/article/2015-10-27-parliamentary-diary-teletubbies-and-grandstanding-in-student-fees-debate/
Stellenbosch,20151028,479663989,http://www.rdm.co.za/politics/2015/10/28/why-feesmustfall-succeeded-where-others-failed
Stellenbosch,20151028,479678757,http://www.polity.org.za/article/increases-but-one-issue-fuelling-feesmustfall-protests-says-nzimande-2015-10-28

Stellenbosch,20151016,476618762,http://ewn.co.za/2015/10/16/Open-Stellenbosch-to-fight-proposed-fee-hike

Stellenbosch,20151013,475557647,http://www.news24.com/SouthAfrica/News/Varsity-fees-to-shut-out-poor-students-20151010


--------------------------
Durban,20151025,478828448,http://www.thedailyvox.co.za/feesmustfall-forecast-for-monday-shutdown-in-some-parts-of-the-country-continues/

Durban,20151019,477429714,http://www.news24.com/SouthAfrica/News/ANCYL-welcomes-battle-against-ridiculous-Rhodes-University-fees-20151019
Durban,20151019,477485490,http://citizen.co.za/825616/varsity-fee-hikes-exclude-blacks-anc-spokesperson/
Durban,20151019,477518817,http://www.cnbcafrica.com/news/southern-africa/2015/10/19/education-summit-blade-nzimande-fees/
Durban,20151019,477352314,http://ewn.co.za/2015/10/19/Fee-protests-shuts-down-3-of-SAs-biggest-universities

Durban,20151018,477173762,http://www.timeslive.co.za/politics/2015/10/18/Parliamentary-committee-lauds-handling-of-Wits-fee-hike-dispute
Durban,20151018,477202184,http://africajournalismtheworld.com/2015/10/18/south-africa-habin-confronted-by-students-at-wits-demanding-no-fee-increase/
Durban,20151018,477258081,http://www.politicsweb.co.za/politics/fee-increases-universities-must-exercise-greater-s

Durban,20151030,480367839,http://citizen.co.za/841025/increases-but-one-issue-in-feesmustfall-nzimande/

Durban,20151024,478435700,http://www.chronicle.co.zw/zero-increase-in-varsity-fees-zuma/
Durban,20151024,478441901,http://www.herald.co.zw/zuma-bows-to-pressure-scraps-varsity-fees-hike/

Durban,20151015,476384656,http://witspress.bookslive.co.za/blog/2015/10/15/students-have-a-legitimate-concern-on-wits-fees-but-we-are-caught-in-a-bind-adam-habib/
Durban,20151015,476391538,http://mg.co.za/article/2015-10-15-wits-fees-protest-intensifies
Durban,20151015,476443541,http://www.enca.com/south-africa/ramaphosa-calls-affordable-university-fees

Durban,20151028,479679567,http://www.polity.org.za/article/increases-but-one-issue-fuelling-feesmustfall-protests-says-nzimande-2015-10-28
Durban,20151028,479750490,http://wakeywakeynews.com/2341/south-africa-police-teargas-university-fee-hike-protest
Durban,20151028,479643197,http://www.news24.com/MyNews24/FeesMustFall-How-gove-failed-to-provide-leadership-20151028

Durban,20151016,476558796,https://www.enca.com/south-africa/ramaphosa-calls-affordable-university-fees
Durban,20151016,476609834,http://www.sabc.co.za/news/a/9dcf8a804a39e882b7a8ffa53d9712f0/Department-considers-regulating-tertiary-education-fees-20151016
Durban,20151016,476780437,http://www.enca.com/south-africa/habib-tells-students-hes-powerless-wits-fees
Durban,20151016,476780546,http://www.enca.com/south-africa/university-fees-spotlight-during-wits-university-protests

Durban,20151017,476914829,http://www.enca.com/south-africa/wits-fee-increase-suspended
Durban,20151017,476929642,http://www.sabc.co.za/news/a/88382d804a3cdb1eb44bffa53d9712f0/Wits-suspends-fees-hike-20151017

Durban,20151013,475558207,http://www.news24.com/SouthAfrica/News/Varsity-fees-to-shut-out-poor-students-20151010

Durban,20151012,477352223,http://ewn.co.za/2015/10/19/Fee-protests-shuts-down-3-of-SAs-biggest-universities


--------------------------
    Potchefstroom,20151020,477784767,http://theconversation.com/fee-protests-point-to-a-much-deeper-problem-at-south-african-universities-49456

    Potchefstroom,20151023,478190406,http://rapidnewsnetwork.com/students-breach-south-africa-parliament-during-fee-demo/245784/

    Potchefstroom,20151027,479198480,http://www.herald.co.zw/sa-varsities-protests-much-deeper-than-fees/


--------------------------
Bloemfontein,20151023,3,protests of UFS and CUT students


--------------------------
University Of Cape Town,20151020,477591112,http://thetandd.com/news/world/south-african-students-protest-planned-tuition-fee-hikes/article_31d9950d-66d6-5b00-8d65-df8c51e562dc.html
University Of Cape Town,20151020,477632525,http://www.chronicle.co.zw/uct-suspends-lectures-after-fee-protests/
University Of Cape Town,20151020,477643461,http://citizentv.co.ke/news/students-protest-at-s-africas-top-universities-over-tuition-fee-hike-103593/
University Of Cape Town,20151020,477685630,http://www.bloomberg.com/news/articles/2015-10-20/south-african-university-stops-fee-increases-after-protests
University Of Cape Town,20151020,477790570,http://businesstech.co.za/news/general/101704/maimane-chased-away-from-feesmustfall-protest-at-uct/
University Of Cape Town,20151020,477802413,http://panmacmillan.bookslive.co.za/blog/2015/10/20/the-struggles-of-university-students-are-no-trivial-matter-songezo-zibi-on-feesmustfall/
University Of Cape Town,20151020,477817440,http://www.islamicinvitationturkey.com/2015/10/20/south-africa-students-protest-tuition-fee-hike/
University Of Cape Town,20151020,477821720,http://www.ofm.co.za/article/National/172645/Nzimande-moots-deal-on-university-fees-students-reject-it
University Of Cape Town,20151020,477821723,http://memeburn.com/2015/10/heres-how-the-feesmustfall-conversation-has-taken-off-on-twitter/
University Of Cape Town,20151020,477851971,http://www.dw.com/en/south-african-universities-to-cap-fee-increases-as-protests-mount/a-18793983
University Of Cape Town,20151020,477774285,http://ewn.co.za/2015/10/20/CPUT-cancels-all-classes-amid-FeesMustFall-protests

University Of Cape Town,20151019,477631735,http://www.chronicle.co.zw/uct-suspends-lectures-after-fee-protests/
University Of Cape Town,20151019,477366573,http://www.bdlive.co.za/national/education/2015/10/19/campus-protests-over-fee-increases-spread
University Of Cape Town,20151019,477377999,http://www.news24.com/SouthAfrica/News/UCT-suspends-lectures-after-fee-protests-20151019
University Of Cape Town,20151019,477429735,http://www.live5news.com/story/30292894/south-african-students-protests-planned-tuition-fee-hikes
University Of Cape Town,20151019,477443128,http://whlt.com/ap/south-african-students-protests-planned-tuition-fee-hikes/
University Of Cape Town,20151019,477446070,http://www.destinyconnect.com/2015/10/19/major-universities-go-strike-fees-2/
University Of Cape Town,20151019,477453344,http://www.salon.com/2015/10/19/south_african_students_protests_planned_tuition_fee_hikes/
University Of Cape Town,20151019,477479392,http://www.nbc29.com/story/30292893/south-african-students-protest-planned-tuition-fee-hikes
University Of Cape Town,20151019,477481323,http://www.timeslive.co.za/politics/2015/10/19/Nzimande-warned-of-fees-must-fall-campaign-explosion---DA
University Of Cape Town,20151019,477485958,http://citizen.co.za/825616/varsity-fee-hikes-exclude-blacks-anc-spokesperson/
University Of Cape Town,20151019,477491278,http://www.ifreepress.com/3694-south-africa-universities-close-amid-student-fee-protests/
University Of Cape Town,20151019,477507784,http://www.mytechbits.com/students-make-plea-on-fees/98138701/
University Of Cape Town,20151019,477511880,http://www.dailymail.co.uk/wires/reuters/article-3279649/Students-protest-S-Africas-universities-tuition-fee-hike.html
University Of Cape Town,20151019,477513607,http://www.polity.org.za/article/sasco-sasco-calls-for-a-national-shutdown-against-fee-increments-and-for-free-education-2015-10-19
University Of Cape Town,20151019,477513771,http://www.polity.org.za/article/sacp-sacp-western-cape-supports-the-student-protest-against-exorbitant-fees-and-sky-high-fee-increments-2015-10-19
University Of Cape Town,20151019,477519375,http://www.cnbcafrica.com/news/southern-africa/2015/10/19/education-summit-blade-nzimande-fees/
University Of Cape Town,20151019,477582825,http://qz.com/527572/south-african-students-are-protesting-fee-increases-by-shutting-down-universities/
University Of Cape Town,20151019,477414001,http://www.news24.com/SouthAfrica/News/Four-things-you-need-to-know-about-FeesMustFall-20151019

University Of Cape Town,20151013,477821460,http://memeburn.com/2015/10/heres-how-the-feesmustfall-conversation-has-taken-off-on-twitter/
University Of Cape Town,20151013,475557789,http://www.news24.com/SouthAfrica/News/Varsity-fees-to-shut-out-poor-students-20151010

University Of Cape Town,20151021,477944794,http://www.ifreepress.com/3722-feesmustfall-43-powerful-photos-from-south-africa-s-student-protests/
University Of Cape Town,20151021,477956563,http://rapidnewsnetwork.com/south-african-students-at-top-universities-protest-plans-for-tuition-fee/240984/

University Of Cape Town,20151022,478037909,http://nationalmirroronline.net/new/sa-fee-crisis-protesters-bag-violence-charge/
University Of Cape Town,20151022,478197848,http://www.biznews.com/leadership/2015/10/22/feesmustfall-chikane-maasdorp-treason-charges-dropped/
University Of Cape Town,20151022,478200635,http://www.news24.com/SouthAfrica/News/FeesMustFall-State-was-warned-5-years-ago-20151023
University Of Cape Town,20151022,478027265,http://www.timeslive.co.za/ilive/2015/10/22/Fees-Must-Fall-Joint-statement-from-Amnesty-International-university-groups-iLIVE

University Of Cape Town,20151023,478039247,http://nationalmirroronline.net/new/sa-fee-crisis-protesters-bag-violence-charge/
University Of Cape Town,20151023,478045734,http://isurfpaducah.com/2015/10/23/south-african-students-protest-planned-tuition-fee-hikes35336/
University Of Cape Town,20151023,478059951,http://thoughtleader.co.za/readerblog/2015/10/21/feesmustfall/
University Of Cape Town,20151023,478059976,http://fleminggazette.com/10902/south-africa-tuition-fee-protests-students-arrested-in-cape/
University Of Cape Town,20151023,478080163,http://www.dailymaverick.co.za/article/2015-10-23-feesmustfall-students-and-stun-grenades-occupy-cape-towns-streets/
University Of Cape Town,20151023,478085760,http://www.newswo.com/world/2015/10/south-africas-zuma-to-meet-students-on-friday-after-protests-over-fees/
University Of Cape Town,20151023,478162797,http://humanitariannews.org/20151023/feesmustfall-brings-south-african-universities-standstill
University Of Cape Town,20151023,478170155,http://connect.citizen.co.za/27544/london-students-to-join-the-feesmustfall-campaign/
University Of Cape Town,20151023,478190006,http://rapidnewsnetwork.com/students-breach-south-africa-parliament-during-fee-demo/245784/
University Of Cape Town,20151023,478197861,http://www.biznews.com/leadership/2015/10/22/feesmustfall-chikane-maasdorp-treason-charges-dropped/
University Of Cape Town,20151023,478198241,http://www.cnn.com/2015/10/23/africa/south-africa-fee-increase-protests/
University Of Cape Town,20151023,478210309,http://www.news24.com/SouthAfrica/News/Cape-Town-gears-up-for-more-feesmustfall-protests-20151023
University Of Cape Town,20151023,478212579,http://nysepost.com/south-africa-23-students-arrested-as-anti-fee-hike-protests-25659
University Of Cape Town,20151023,478239143,http://slumz.boxden.com/f5/oct-23-feesmustfall-2273856/
University Of Cape Town,20151023,478248297,http://kenya.news24.com/Africa/News/University-students-in-SA-to-protest-against-fee-increases-20151021
University Of Cape Town,20151023,478267688,http://www.independent.ie/world-news/africa/south-african-police-use-stun-grenades-to-disperse-thousands-of-students-protesting-tuition-fees-rise-34135226.html
University Of Cape Town,20151023,478288016,http://www.nytimes.com/2015/10/24/world/africa/south-africa-freezes-tuition-fees-after-student-protests.html
University Of Cape Town,20151023,478291989,http://www.theage.com.au/world/south-african-president-jacob-zuma-rules-out-university-fee-rise-after-protests-20151023-gkhf2d.html
University Of Cape Town,20151023,478327701,https://www.timeshighereducation.com/news/south-african-tuition-fee-hikes-cancelled-after-nationwide-protests
University Of Cape Town,20151023,478338848,http://www.thesouthafrican.com/sa-high-comissioner-in-london-sits-on-floor-with-protesters-to-sign-feesmustfall-memorandum/
University Of Cape Town,20151023,478356150,http://www.skynews.com.au/news/top-stories/2015/10/24/safrica-scraps-uni-fee-hike-after-protest.html
University Of Cape Town,20151023,478200692,http://www.news24.com/SouthAfrica/News/FeesMustFall-State-was-warned-5-years-ago-20151023
University Of Cape Town,20151023,478220639,http://www.telegraph.co.uk/news/worldnews/africaandindianocean/southafrica/11950108/South-Africas-FeesMustFall-student-protestors-attack-fences-around-Pretoria-seat-of-government.html

University Of Cape Town,20151026,478995745,http://thoughtleader.co.za/blackacademiccaucus/2015/10/26/it-is-not-about-rhodes-outsourcing-feesit-is-about-defining-a-new-society-for-all-south-africans/
University Of Cape Town,20151026,479091643,http://dailyindependentnig.com/2015/10/south-african-students-continue-fees-protest-universities-remain-closed/
University Of Cape Town,20151026,479109666,http://www.enca.com/south-africa/feesmustfall-fight-won-battle-continues
University Of Cape Town,20151026,479146294,http://www.news24.co.ke/Africa/News/University-students-in-SA-to-protest-against-fee-increases-20151021
University Of Cape Town,20151026,479087365,http://www.news24.com/SouthAfrica/News/UCT-vice-chancellors-son-arrested-in-Feesmustfall-protest-20151021

University Of Cape Town,20151027,479225987,http://www.codewit.com/africa/26344-south-africa-protests-zuma-freezes-tuition-fees-amid-protests
University Of Cape Town,20151027,479278707,http://www.tjcnewspaper.com/south-african-students-continue-fees-protest-49538/
University Of Cape Town,20151027,479298485,http://socialistworker.org/2015/10/27/why-the-fees-must-fall
University Of Cape Town,20151027,479350518,http://en.starafrica.com/education/south-africa-varsity-students-agree-to-freeze-fee-hikes.html
University Of Cape Town,20151027,479474178,http://www.pri.org/stories/2015-10-27/south-african-photographer-imraan-christian-why-feesmustfall-was-just-beginning

University Of Cape Town,20151025,478667947,https://redflag.org.au/article/fee-protests-point-much-deeper-problem-south-african-universities
University Of Cape Town,20151025,478829665,http://www.thedailyvox.co.za/feesmustfall-forecast-for-monday-shutdown-in-some-parts-of-the-country-continues/

University Of Cape Town,20151012,477507054,http://www.mytechbits.com/students-make-plea-on-fees/98138701/

University Of Cape Town,20151018,477190298,http://www.thedailyvox.co.za/is-witsfeesmustfall-an-opportunity-to-change-south-africas-future-trajectory/

University Of Cape Town,20151030,480262954,http://www.dailymaverick.co.za/article/2015-10-30-feesmustfall-thursday-promises-vs.-petrol-bombs/
University Of Cape Town,20151030,480341638,http://www.dailymaverick.co.za/article/2015-10-30-the-birth-of-a-movement-feesmustfall-on-twitter/
University Of Cape Town,20151030,480367812,http://citizen.co.za/841025/increases-but-one-issue-in-feesmustfall-nzimande/

University Of Cape Town,20151024,478451000,http://financialspots.com/2015/10/24/south-african-students-demanding-lower-fees-take-protest-to/
University Of Cape Town,20151024,478451523,http://www.thenews.com.pk/Todays-News-1-347537-S-Africa-scraps-university-fee-hikes-in-face-of-protests
University Of Cape Town,20151024,478466494,http://brudirect.com/0-world/world-africa/item/35736-sa-students-zuma-freezes-tuition-fees-amid-protests
University Of Cape Town,20151024,478477160,http://mgafrica.com/article/2015-10-21-as-anger-over-south-african-fees-mounts-here-is-what-it-costs-to-attend-an-african-universitywarning-it-is-not-cheap
University Of Cape Town,20151024,478575798,http://thegrio.com/2015/10/24/feesmutfall-black-white-activists-south-africa-unity/

University Of Cape Town,20151029,479956521,http://www.sowetanlive.co.za/news/2015/10/29/international-students-exam-dilemma-over-feesmustfall-protest
University Of Cape Town,20151029,480058661,http://time.com/4082819/south-africa-fees-must-fall/

University Of Cape Town,20151028,479679549,http://www.polity.org.za/article/increases-but-one-issue-fuelling-feesmustfall-protests-says-nzimande-2015-10-28
University Of Cape Town,20151028,479696420,http://www.ibtimes.co.uk/south-africa-fees-must-fall-protests-prove-post-apartheid-born-free-generation-myth-1526059
University Of Cape Town,20151028,479705811,https://uk.news.yahoo.com/south-africa-fees-must-fall-120011659.html
University Of Cape Town,20151028,479720396,http://tvnewsroom.org/newslines/world/south-african-students-protest-education-fee-hike-5228/
University Of Cape Town,20151028,479760733,http://www.timeslive.co.za/local/2015/10/28/International-students-exam-dilemma-over-FeesMustFall-protest


--------------------------
Braamfontein,20151020,477665259,http://or-politics.com/u-s-world/auckland-uni-students-protest-fee-increases/118240/
Braamfontein,20151020,477900526,http://www.sabc.co.za/news/a/1a8c71804a475b2da60dff6d39fe9e0c/Tuition-fee-increases-at-tertiary-institutions-won%E2%80%99t-exceed-6-20152010

Braamfontein,20151023,478176928,http://www.enca.com/south-africa/feesmustfall-latest-campuses-nationwide

Braamfontein,20151019,477343888,http://www.sabc.co.za/news/a/871da7804a4317a5befbffa53d9712f0/UCT-braces-for-student-protest-over-fees-20151019
Braamfontein,20151019,477498182,http://www.enca.com/south-africa/pictures-witsfeesmustfall-monday

Braamfontein,20151012,477497917,http://www.enca.com/south-africa/pictures-witsfeesmustfall-monday

Braamfontein,20151024,478610982,http://connect.citizen.co.za/27466/fees-anc-zuma-must-fall/

Braamfontein,20151015,476214364,http://www.bdlive.co.za/national/2015/10/15/sa-hit-by-anti-corruption-marches-as-wits-faces-fees-war
Braamfontein,20151015,476384655,http://witspress.bookslive.co.za/blog/2015/10/15/students-have-a-legitimate-concern-on-wits-fees-but-we-are-caught-in-a-bind-adam-habib/

Braamfontein,20151017,476915224,http://www.enca.com/south-africa/wits-fee-increase-suspended


--------------------------
Grahamstown,20151020,477688755,http://www.thestar.com.my/News/World/2015/10/20/South-African-students-protest-over-plans-to-raise-tuition-fees/
Grahamstown,20151020,477700241,http://www.moneyweb.co.za/news-fast-news/student-protests-over-fees-continue/
Grahamstown,20151020,477746393,http://gulfnews.com/news/africa/south-africa/south-african-students-protest-over-plans-to-raise-tuition-fees-1.1603613
Grahamstown,20151020,477760629,http://www.grocotts.co.za/content/college-rhodes-students-join-forces-over-fees-bursaries-20-10-2015
Grahamstown,20151020,477797746,http://mg.co.za/article/2015-10-20-police-fire-stun-grenades-arrest-23-as-student-fee-protests-spread/
Grahamstown,20151020,477819118,http://www.islamicinvitationturkey.com/2015/10/20/south-africa-students-protest-tuition-fee-hike/

Grahamstown,20151021,477956526,http://rapidnewsnetwork.com/south-african-students-at-top-universities-protest-plans-for-tuition-fee/240984/

Grahamstown,20151023,478321226,http://zululandobserver.co.za/87938/how-zululand-students-parents-feel-about-feesmustfall/
Grahamstown,20151023,478349651,http://www.dailymaverick.co.za/article/2015-10-23-feeshavefallen-a-big-day-in-pretoria-with-a-zero-outcome/

Grahamstown,20151027,479209168,http://www.dispatchtimes.com/uwc-students-call-for-no-fee-varsities/151155/
Grahamstown,20151027,479508941,http://rapidnewsnetwork.com/south-african-students-continue-fees-protest/253799/

Grahamstown,20151019,477343881,http://www.enca.com/south-africa/no-fee-increase-spread-other-varsities
Grahamstown,20151019,477430150,http://www.news24.com/SouthAfrica/News/Wits-fees-must-fall-now-Gauteng-education-MEC-20151019
Grahamstown,20151019,477448064,http://www.thedailyvox.co.za/feesmust-fall-rhodes-students-join-forces-with-eastcape-midlands-fet-students/
Grahamstown,20151019,477413460,http://www.news24.com/SouthAfrica/News/Four-things-you-need-to-know-about-FeesMustFall-20151019

Grahamstown,20151029,480070640,http://www.ibtimes.co.uk/south-africa-fees-must-fall-protests-will-continue-jacob-zuma-meet-students-1525137


--------------------------
            Sharpeville,20151020,477732994,http://www.okayafrica.com/news/university-of-cape-town-fees-must-fall-student-protests/


--------------------------
    Eastcape,20151019,477760346,http://www.grocotts.co.za/content/college-rhodes-students-join-forces-over-fees-bursaries-20-10-2015
Eastcape,20151019,477448268,http://www.thedailyvox.co.za/feesmust-fall-rhodes-students-join-forces-with-eastcape-midlands-fet-students/

    Eastcape,20151020,477760417,http://www.grocotts.co.za/content/college-rhodes-students-join-forces-over-fees-bursaries-20-10-2015


--------------------------
Rosebank,20151020,477776619,http://citizen.co.za/827366/varsity-fee-protests-suggest-need-for-more-private-players/

    Rosebank,20151019,477588307,http://www.moneyweb.co.za/news/south-africa/varsity-fee-protests-suggest-need-for-more-private-players/


--------------------------
    Parktown,20151020,477784948,http://connect.citizen.co.za/26966/aka-and-simphiwe-dana-join-in-on-wits-feesmustfall/
    Parktown,20151020,477813855,http://ewn.co.za/2015/10/20/FeesMustFall-Consensus-reached-on-increases
Parktown,20151020,477835726,http://ewn.co.za/2015/10/20/Wits-students-to-occupy-campus-overnight-in-FeesMustFall-battle

Parktown,20151014,475997849,http://www.ann7.com/article/41104-1410201514102015wits-students-protest-against-the-proposed-intuition-fees.html


--------------------------
Free State,20151020,477790576,http://www.itnewsafrica.com/2015/10/wits-protest-rocks-social-media-with-feesmustfall/

Free State,20151023,478177812,http://www.enca.com/south-africa/feesmustfall-latest-campuses-nationwide

Free State,20151024,478529189,http://www.bdlive.co.za/national/2015/10/24/tuition-fees-deal-a-co-ordinated-farce-say-student-leaders


--------------------------
Rondebosch,20151020,477821719,http://www.ofm.co.za/article/National/172645/Nzimande-moots-deal-on-university-fees-students-reject-it


--------------------------
Fort Hare,20151020,477835213,http://ewn.co.za/2015/10/20/Tensions-flare-at-CPUT-and-Fort-Hare-fee-protests

Fort Hare,20151019,477355144,http://www.news24.com/SouthAfrica/News/Rhodes-University-shut-down-amid-nationwide-fees-protests-20151019
Fort Hare,20151019,477413370,http://www.news24.com/SouthAfrica/News/Four-things-you-need-to-know-about-FeesMustFall-20151019


--------------------------
Midlands,20151020,477839928,http://citizen.co.za/827910/feesmustfall-crisis-national-not-racial-maxwele/


--------------------------
Tshwane,20151020,477841922,http://citizen.co.za/827910/feesmustfall-crisis-national-not-racial-maxwele/

Tshwane,20151023,478406656,http://africatimes.com/2015/10/23/south-africa-feesmustfall-but-how/
Tshwane,20151023,478059949,http://www.timeslive.co.za/politics/2015/10/22/FeesMustFall-protests-continue-across-South-Africa-for-a-9th-day
Tshwane,20151023,478152142,http://www.sabc.co.za/news/a/f93bde804a4f243398a4db6d39fe9e0c/Fees-must-fall-protest-heads-to-Union-Buildings--20151023

Tshwane,20151026,479087455,http://citizen.co.za/838371/tomorrows-news-today-sam-meyiwa-gauteng-veld-fires-and-feesmustfall-protests/

Tshwane,20151027,479218618,http://seatingchair.com/2015/10/27/south-african-students-continue-fees-protest-13681.html

Tshwane,20151030,480262782,http://www.dailymaverick.co.za/article/2015-10-30-feesmustfall-thursday-promises-vs.-petrol-bombs/

Tshwane,20151024,478540088,http://africajournalismtheworld.com/tag/feesmustfall/
Tshwane,20151024,478540247,http://africajournalismtheworld.com/2015/10/24/south-africa-students-take-fees/
Tshwane,20151024,478534639,http://www.sabc.co.za/news/a/06d982004a5172109061db6d39fe9e0c/Students-divided-over-Fees-must-fall-outcome-20152410

Tshwane,20151028,479696902,http://www.ibtimes.co.uk/south-africa-fees-must-fall-protests-prove-post-apartheid-born-free-generation-myth-1526059


--------------------------
Swaziland,20151023,478049050,http://isurfpaducah.com/2015/10/23/south-african-students-protest-planned-tuition-fee-hikes35336/


--------------------------
Mahlangu,20151023,478053321,http://citizen.co.za/828884/wits-students-regroup-to-protest-against-fee-hikes/
Mahlangu,20151023,478181769,http://nehandaradio.com/2015/10/23/letter-from-a-burning-october-in-south-africa-feesmustfall-campaign-must-come-to-zimbabwe/
Mahlangu,20151023,478204680,http://www.polity.org.za/article/akf-akf-wits---support-feesmustfall-2015-10-23

Mahlangu,20151026,479020467,http://www.bdlive.co.za/opinion/2015/10/26/halting-fee-increases-fails-to-provide-meaningful-resolution

Mahlangu,20151027,479216299,http://www.dailymaverick.co.za/article/2015-10-27-feesmustfall-wits-splits-the-beginning-not-the-end-of-a-chapter/

Mahlangu,20151025,478694888,http://mwcnews.net/news/africa/55089-s-africa-halts-university-fee.html

Mahlangu,20151024,478428946,http://www.aljazeera.com/news/2015/10/africa-halts-university-fee-hikes-mass-protests-151023234533972.html

Mahlangu,20151028,479596694,http://memeburn.com/2015/10/feesmustfall-how-sas-students-are-using-social-to-subvert-traditional-media-narratives/
Mahlangu,20151028,479720570,http://tvnewsroom.org/newslines/world/south-african-students-protest-education-fee-hike-5228/


--------------------------
Marikana,20151023,478058875,http://thoughtleader.co.za/sharleneswartz/2015/10/22/feesmustfall-we-seemed-like-a-leaderless-country-yesterday/
Marikana,20151023,478181742,https://globalvoices.org/2015/10/23/feesmustfall-brings-south-african-universities-to-a-standstill/
Marikana,20151023,478239116,http://thoughtleader.co.za/kaguremugo/2015/10/23/feesmustfall-you-cannot-ask-women-to-be-vocal-in-public-and-silent-in-private/

Marikana,20151030,480225733,http://www.ann7.com/article/41844-29102015lawyers-hail-0-fee-increase-decision.html
Marikana,20151030,480263523,http://www.dailymaverick.co.za/article/2015-10-30-feesmustfall-thursday-promises-vs.-petrol-bombs/

Marikana,20151015,476223989,http://ewn.co.za/2015/10/15/Wits-students-battle-over-fees-continues

Marikana,20151028,479678959,http://www.news24.com/SouthAfrica/News/Police-exercised-serious-restraint-on-feesmustfall-protesters-20151028
Marikana,20151028,479726103,http://voices.news24.com/lina-mpolase/2015/10/fees-must-fall-from-a-birds-view/


--------------------------
Ndlovu,20151023,478059188,http://fleminggazette.com/10902/south-africa-tuition-fee-protests-students-arrested-in-cape/


--------------------------
Kwazulu,20151023,478059963,http://thoughtleader.co.za/readerblog/2015/10/21/feesmustfall/
Kwazulu,20151023,478157776,http://ewn.co.za/2015/10/22/KZN-students-heed-the-call-to-join-fees-campaign
Kwazulu,20151023,478163653,http://www.news24.com/SouthAfrica/News/FeesMustFall-I-need-around-R600month-but-it-is-a-daily-struggle-20151022

Kwazulu,20151026,478917686,http://www.bdlive.co.za/business/financial/2015/10/26/insurers-to-count-the-cost-of-fees-protests

Kwazulu,20151028,479555444,http://www.dailymaverick.co.za/article/2015-10-28-feesmustfall-no-end-in-sight/

Kwazulu,20151016,476618907,http://ewn.co.za/2015/10/16/Open-Stellenbosch-to-fight-proposed-fee-hike
Kwazulu,20151016,476622906,http://www.sowetanlive.co.za/news/2015/10/16/wits-fee-protest-enters-third-day
Kwazulu,20151016,476781104,http://www.enca.com/south-africa/habib-tells-students-hes-powerless-wits-fees

Kwazulu,20151022,478028382,http://www.timeslive.co.za/ilive/2015/10/22/Fees-Must-Fall-Joint-statement-from-Amnesty-International-university-groups-iLIVE


--------------------------
Bellville,20151023,478079834,http://www.dailymaverick.co.za/article/2015-10-22-feesmustfall-was-high-treason-on-the-cards-for-arrested-students/
Bellville,20151023,478080137,http://www.dailymaverick.co.za/article/2015-10-23-feesmustfall-students-and-stun-grenades-occupy-cape-towns-streets/
Bellville,20151023,478210298,http://www.news24.com/SouthAfrica/News/Cape-Town-gears-up-for-more-feesmustfall-protests-20151023
Bellville,20151023,478270273,http://ewn.co.za/2015/10/23/Students-told-Zille-to-voetsek-amid-ongoing-fee-protests

Bellville,20151022,478270136,http://ewn.co.za/2015/10/23/Students-told-Zille-to-voetsek-amid-ongoing-fee-protests

Bellville,20151029,479901338,http://www.dailymaverick.co.za/article/2015-10-22-feesmustfall-the-day-parliament-became-a-war-zone/

Bellville,20151026,478998965,http://www.news24.com/SouthAfrica/News/FeesMustFall-timeline-Where-are-we-now-20151026


--------------------------
Granger Bay,20151023,478080138,http://www.dailymaverick.co.za/article/2015-10-23-feesmustfall-students-and-stun-grenades-occupy-cape-towns-streets/


--------------------------
University Of The Western Cape,20151023,478080154,http://www.dailymaverick.co.za/article/2015-10-23-feesmustfall-students-and-stun-grenades-occupy-cape-towns-streets/
University Of The Western Cape,20151023,478270167,http://ewn.co.za/2015/10/23/Students-told-Zille-to-voetsek-amid-ongoing-fee-protests
University Of The Western Cape,20151023,478200778,http://www.news24.com/SouthAfrica/News/FeesMustFall-State-was-warned-5-years-ago-20151023

University Of The Western Cape,20151022,478270137,http://ewn.co.za/2015/10/23/Students-told-Zille-to-voetsek-amid-ongoing-fee-protests

University Of The Western Cape,20151027,479208698,http://www.dispatchtimes.com/uwc-students-call-for-no-fee-varsities/151155/

University Of The Western Cape,20151025,478841710,http://www.dailymaverick.co.za/article/2015-10-25-reporters-notebook-feesmustfall-the-event-we-didnt-cover/

University Of The Western Cape,20151030,480342235,http://www.dailymaverick.co.za/article/2015-10-30-the-birth-of-a-movement-feesmustfall-on-twitter/

University Of The Western Cape,20151024,478526386,http://www.lidtime.com/stun-grenades-chaos-on-the-stairs-of-parliament-feesmustfall-9471/

University Of The Western Cape,20151026,479045966,http://ewn.co.za/2015/10/26/FeesMustFall-Students-still-discussing-the-way-forward


--------------------------
Cape Peninsula,20151023,478082611,http://www.dailymaverick.co.za/article/2015-10-23-feesmustfall-students-and-stun-grenades-occupy-cape-towns-streets/
Cape Peninsula,20151023,478092254,https://www.enca.com/south-africa/feesmustfall-students-arrive-parliament-nationalshutdown
Cape Peninsula,20151023,478177880,http://www.enca.com/south-africa/feesmustfall-latest-campuses-nationwide
Cape Peninsula,20151023,478181738,https://globalvoices.org/2015/10/23/feesmustfall-brings-south-african-universities-to-a-standstill/
Cape Peninsula,20151023,478198239,http://www.biznews.com/leadership/2015/10/22/feesmustfall-chikane-maasdorp-treason-charges-dropped/

Cape Peninsula,20151022,478021854,http://celebcafe.org/south-africa-tuition-fee-protests-students-arrested-in-cape-town-5335/

Cape Peninsula,20151019,477513769,http://www.polity.org.za/article/sacp-sacp-western-cape-supports-the-student-protest-against-exorbitant-fees-and-sky-high-fee-increments-2015-10-19

Cape Peninsula,20151029,479901340,http://www.dailymaverick.co.za/article/2015-10-22-feesmustfall-the-day-parliament-became-a-war-zone/


--------------------------
Strydom,20151023,478085761,http://www.newswo.com/world/2015/10/south-africas-zuma-to-meet-students-on-friday-after-protests-over-fees/


--------------------------
Cameroon,20151023,478144027,https://www.enca.com/south-africa/south-african-expats-throw-weight-behind-feesmustfall


--------------------------
Khayelitsha,20151023,478162773,http://humanitariannews.org/20151023/feesmustfall-brings-south-african-universities-standstill


--------------------------
London,20151023,478170156,http://connect.citizen.co.za/27544/london-students-to-join-the-feesmustfall-campaign/
London,20151023,478284232,http://www.thesouthafrican.com/south-africans-in-london-to-join-feesmustfall-solidarity-protest/
London,20151023,478298306,http://citizen.co.za/833804/successful-turnout-in-london-fees-protest/
London,20151023,478309941,http://www.standard.co.uk/news/london/trafalgar-square-protest-150-join-students-fees-demonstration-at-south-african-high-commission-in-a3098001.html
London,20151023,478328084,https://www.timeshighereducation.com/news/south-african-tuition-fee-hikes-cancelled-after-nationwide-protests
London,20151023,478338850,http://www.thesouthafrican.com/sa-high-comissioner-in-london-sits-on-floor-with-protesters-to-sign-feesmustfall-memorandum/
London,20151023,478214925,http://ewn.co.za/2015/10/23/FeesMustFall-goes-global

London,20151024,478526385,http://celebcafe.org/stun-grenades-chaos-on-the-stairs-of-parliament-feesmustfall-6472/


--------------------------
Germany,20151023,478170952,http://connect.citizen.co.za/27544/london-students-to-join-the-feesmustfall-campaign/


--------------------------
Gauteng,20151022,478176399,http://www.enca.com/south-africa/feesmustfall-latest-campuses-nationwide

Gauteng,20151023,478176934,http://www.ann7.com/article/41544-2310201523102015the-government-faces-%E2%80%98near-insurmountable-task%E2%80%99-to-quell-fee.html
Gauteng,20151023,478406531,http://africatimes.com/2015/10/23/south-africa-feesmustfall-but-how/

Gauteng,20151026,478941539,http://www.engineeringnews.co.za/article/skywise-mulls-unlimited-flights-in-sa-for-a-set-fee-2015-10-26

Gauteng,20151029,479956527,http://www.jewocity.com/blog/south-africa-protests-fees-must-fall-campaign-forces-president-jacob-zuma-to/120468

Gauteng,20151028,479556061,http://www.dailymaverick.co.za/article/2015-10-27-parliamentary-diary-teletubbies-and-grandstanding-in-student-fees-debate/


--------------------------
Soweto,20151023,478180900,https://globalvoices.org/2015/10/23/feesmustfall-brings-south-african-universities-to-a-standstill/
Soweto,20151023,478288024,http://www.i24news.tv/en/news/international/africa/90031-151023-s-africa-scraps-university-fee-hikes-in-face-of-protests
Soweto,20151023,478294703,http://mype.co.za/new/how-varsity-students-can-make-a-positive-impact-with-feesmustfall/55129/2015/10
Soweto,20151023,478310153,https://uk.news.yahoo.com/africa-scraps-university-fee-hikes-face-protests-134449497.html
Soweto,20151023,478221101,http://www.telegraph.co.uk/news/worldnews/africaandindianocean/southafrica/11950108/South-Africas-FeesMustFall-student-protestors-attack-fences-around-Pretoria-seat-of-government.html

Soweto,20151026,479005119,http://www.ibtimes.co.uk/south-africa-fees-must-fall-protests-continue-johannesburg-students-call-free-education-1525696
Soweto,20151026,479027791,http://www.ibtimes.co.uk/south-africa-fees-must-fall-protesters-march-pretoria-president-zuma-prepares-address-1525324
Soweto,20151026,479076910,http://www.theguardian.com/world/2015/oct/26/letter-jacob-zuma-feesmustfall-protests-south-africa

Soweto,20151027,479350564,http://www.kbzk.com/story/30359367/south-africas-fees-must-fall-protests-are-about-more-than-tuition-costs
Soweto,20151027,479378566,http://www.news24.com/SouthAfrica/News/Maimane-compares-feesmustfall-to-Soweto-uprising-20151027

Soweto,20151025,478755258,http://www.timeslive.co.za/sundaytimes/stnews/2015/10/25/Pride-pain-and-parenthood-in-wake-of-fees-protests

Soweto,20151024,478428950,http://saudigazette.com.sa/world/s-africas-zuma-scraps-university-fee-hikes-in-face-of-protests/
Soweto,20151024,478509311,http://www.menafn.com/1094396442/Zuma-gives-in-to-student-protests-scraps-fee-hikes
Soweto,20151024,478559565,https://www.enca.com/south-africa/fee-must-fall-protest-reminiscent-1967-uprising

Soweto,20151029,480070197,http://www.ibtimes.co.uk/south-africa-fees-must-fall-protests-will-continue-jacob-zuma-meet-students-1525137

Soweto,20151028,479663836,http://www.rdm.co.za/politics/2015/10/28/why-feesmustfall-succeeded-where-others-failed


--------------------------
Mpumalanga,20151023,478181198,http://nehandaradio.com/2015/10/23/letter-from-a-burning-october-in-south-africa-feesmustfall-campaign-must-come-to-zimbabwe/


--------------------------
Nkandla,20151023,478187247,http://www.news24.com/MyNews24/The-sword-must-rise-and-the-fees-must-fall-20151023

Nkandla,20151025,478683441,https://www.enca.com/south-africa/watch-montage-feesmustfall

Nkandla,20151024,478582348,http://www.enca.com/south-africa/watch-montage-feesmustfall

Nkandla,20151029,479980044,http://www.biznews.com/matthew-lester/2015/10/29/matthew-lester-feesmustfall-free-education-tax-deduction-for-the-rich/

Nkandla,20151015,476214542,http://www.bdlive.co.za/national/2015/10/15/sa-hit-by-anti-corruption-marches-as-wits-faces-fees-war


--------------------------
United Kingdom,20151023,478239134,http://theconversation.com/university-fees-how-to-structure-a-system-that-benefits-poor-students-49675
United Kingdom,20151023,478287533,http://www.pri.org/stories/2015-10-22/echoes-1976-south-african-students-demand-fees-must-fall
United Kingdom,20151023,478339794,http://www.thesouthafrican.com/young-professionals-in-the-uk-in-support-of-fees-must-fall-campaign/

United Kingdom,20151026,479077421,http://www.polity.org.za/article/university-fees-how-to-structure-a-system-that-benefits-poor-students-2015-10-26

United Kingdom,20151025,478760239,http://businesstech.co.za/news/government/102094/how-to-structure-university-fees-to-benefit-the-poor/

United Kingdom,20151029,479966418,http://www.enca.com/opinion/university-fees-how-structure-system-benefits-poor-students-0


--------------------------
Coetzenburg,20151023,478270165,http://ewn.co.za/2015/10/23/Students-told-Zille-to-voetsek-amid-ongoing-fee-protests


--------------------------
Rekord,20151023,478288040,http://citizen.co.za/833752/zuma-announces-0-fee-increase-twitter-reacts/


--------------------------
University Of Fort Hare,20151023,478309787,https://uk.news.yahoo.com/africa-scraps-university-fee-hikes-face-protests-134449497.html

University Of Fort Hare,20151026,479111856,http://www.enca.com/south-africa/feesmustfall-fight-won-battle-continues

University Of Fort Hare,20151027,479215786,http://rapidnewsnetwork.com/south-africa-s-fees-must-fall-protests-demand-free-education/252060/

University Of Fort Hare,20151025,478828460,http://www.thedailyvox.co.za/feesmustfall-forecast-for-monday-shutdown-in-some-parts-of-the-country-continues/

University Of Fort Hare,20151028,479527321,http://www.tjcnewspaper.com/south-africa-s-fees-must-fall-protests-demand-free-education-50903/


--------------------------
Adelaide,20151023,478320262,http://zululandobserver.co.za/87938/how-zululand-students-parents-feel-about-feesmustfall/


--------------------------
Mtunzini,20151023,478321350,http://zululandobserver.co.za/87938/how-zululand-students-parents-feel-about-feesmustfall/


--------------------------
Nqaba,20151023,478375802,http://sfbayview.com/2015/10/victory-for-south-african-youth-besieged-zuma-announces-0-university-fee-increases/


--------------------------
De La Rey,20151026,478948569,http://www.news24.com/SouthAfrica/News/UP-scraps-registration-fee-for-financially-needy-students-20151026
De La Rey,20151026,479045409,http://ewn.co.za/2015/10/26/FeesMustFall-Students-still-discussing-the-way-forward


--------------------------
Italy,20151026,478953371,http://www.news24.com/Columnists/GuestColumn/Why-Italys-income-based-scheme-for-university-fees-makes-sense-20151026
Italy,20151026,479104301,http://www.somalilandpress.com/why-italys-income-based-scheme-for-university-fees-makes-sense/

Italy,20151027,479184626,http://www.sabc.co.za/news/a/ce7b61804a58a296b24dfb6d39fe9e0c/Why-Italys-income-based-scheme-for-university-fees-makes-sense-20151026


--------------------------
Sandton,20151026,479087343,http://citizen.co.za/838371/tomorrows-news-today-sam-meyiwa-gauteng-veld-fires-and-feesmustfall-protests/


--------------------------
Lutuli,20151027,479215618,http://www.dailymaverick.co.za/article/2015-10-27-feesmustfall-wits-splits-the-beginning-not-the-end-of-a-chapter/


--------------------------
Mokgalong,20151027,479508584,http://rapidnewsnetwork.com/south-african-students-continue-fees-protest/253799/


--------------------------
Jacaranda,20151025,478783048,https://www.enca.com/south-africa/students-arrested-following-feesmustfall-protest-released

Jacaranda,20151024,478485735,http://www.news24.com/SouthAfrica/News/Sanef-concerned-about-intimidation-of-journalists-during-FeesMustFall-20151024


--------------------------
Groote Schuur,20151030,480262956,http://www.dailymaverick.co.za/article/2015-10-30-feesmustfall-thursday-promises-vs.-petrol-bombs/


--------------------------
Tygerberg,20151024,478526384,http://celebcafe.org/stun-grenades-chaos-on-the-stairs-of-parliament-feesmustfall-6472/


--------------------------
Soshanguve,20151024,478528565,http://www.bdlive.co.za/national/2015/10/24/tuition-fees-deal-a-co-ordinated-farce-say-student-leaders


--------------------------
Takani,20151029,479947082,http://www.iol.co.za:80/news/south-africa/western-cape/why-we-ve-joined-feesmustfall-protest-1.1933239


--------------------------
Conradie,20151013,476132767,http://www.timeslive.co.za/thetimes/2015/10/15/Counting-high-cost-of-negligence-Doctors-fleeing-high-insurance-fees


--------------------------
Port Elizabeth,20151028,479727409,http://voices.news24.com/lina-mpolase/2015/10/fees-must-fall-from-a-birds-view/


--------------------------
France,20151023,478059187,http://www.timeslive.co.za/politics/2015/10/22/FeesMustFall-protests-continue-across-South-Africa-for-a-9th-day


--------------------------
Paris,20151023,478075298,http://ewn.co.za/2015/10/22/South-Africans-from-across-the-world-pledge-their-support-for-FeesMustFall


--------------------------
Harare,20151023,478180709,http://www.news24.com/Africa/Zimbabwe/Zimbabweans-watch-FeesMustFall-with-admiration-envy-20151023-2


--------------------------
North Carolina,20151023,478216440,http://ewn.co.za/2015/10/23/FeesMustFall-goes-global


--------------------------
Wynberg,20151028,479629721,http://www.news24.com/SouthAfrica/News/UCT-drops-charges-against-FeesMustFall-protesters-20151028


--------------------------
University of Witwatersrand,20151006,1,protest of outsourced workers with students


--------------------------
Rhodes University,20151016,2,students build barricades on campus


--------------------------
