protest,numberOfProtests,startOfOfflineProtest,numberOfTweets,numberOfUsers,startOfOnlineProtest,dateMaxTweets,originalTweetRatio,averageTweetsPerUser,supportFromOutside,supportingFromAbroad,numberOfStudents,usersPerStudent
0,0,none,1529,228,20.625,23.5,0.36102027468933945,6.706140350877193,0.21929824561403508,0.03070175438596491,5060,0.045059288537549404
1,1,20151021,7527,2916,20.833333333333332,21.208333333333332,0.23209778132057926,2.581275720164609,0.789437585733882,0.22805212620027435,26000,0.11215384615384616
1,8,20151021,10507,2500,20.708333333333332,23.416666666666668,0.29532692490720475,4.2028,0.4504,0.1148,25000,0.1
1,1,20151023,73,35,20.791666666666668,21.5,0.8767123287671232,2.085714285714286,0.8,0.2,16100,0.002173913043478261
1,17,20151006,109173,23349,14.666666666666666,22.583333333333332,0.2503549412400502,4.675703456250803,0.6556597712964153,0.19816694505117993,32703,0.7139711953031832
1,4,20151022,613,277,21.0,23.333333333333332,0.5970636215334421,2.2129963898916967,0.8339350180505415,0.17328519855595667,25000,0.01108
1,5,20151019,32754,7806,20.083333333333332,23.5,0.267784087439702,4.196003074558032,0.6603894440174225,0.19395336920317705,30150,0.2589054726368159
1,5,20151021,22700,3235,20.083333333333332,23.458333333333332,0.3655066079295154,7.017001545595054,0.28346213292117467,0.06584234930448223,400000,0.0080875
1,2,20151022,28786,5751,21.458333333333332,22.833333333333332,0.2456055026749114,5.005390366892715,0.5367762128325508,0.1650147800382542,15200,0.37835526315789475
1,5,20151020,6765,1773,20.791666666666668,22.375,0.3163340724316334,3.8155668358714045,0.49858996051889454,0.14213197969543148,33000,0.05372727272727273
1,11,20151019,69770,17577,19.666666666666668,21.541666666666668,0.24233911423247814,3.9693918188541844,0.6353188826307106,0.22535131137281675,26322,0.6677684066560292
1,3,20151021,4339,1820,21.333333333333332,21.458333333333332,0.2717215948375202,2.384065934065934,0.6747252747252748,0.18021978021978022,40000,0.0455
0,0,none,6739,757,19.541666666666668,23.458333333333332,0.33269031013503486,8.902245706737121,0.095112285336856,0.023778071334214,17000,0.04452941176470588
1,1,20151022,88261,11277,19.791666666666668,23.458333333333332,0.28638923193709565,7.826638290325441,0.30300611864857674,0.07945375543140906,48500,0.23251546391752578
1,5,20151019,1941,1138,19.333333333333332,21.666666666666668,0.28851107676455434,1.7056239015817223,0.79701230228471,0.20826010544815465,12000,0.09483333333333334
1,5,20151021,16163,2470,20.541666666666668,23.5,0.2817546247602549,6.543724696356275,0.302834008097166,0.09068825910931175,33000,0.07484848484848484
0,0,none,194,112,21.416666666666668,23.375,0.5103092783505154,1.7321428571428572,0.7321428571428571,0.125,13534,0.008275454411112753
1,2,20151021,70016,20060,20.625,23.458333333333332,0.2828353519195612,3.4903290129611166,0.6677467597208375,0.18783649052841475,50000,0.4012
1,4,20151021,1383,685,21.291666666666668,21.5,0.4671005061460593,2.0189781021897812,0.7956204379562044,0.1635036496350365,74355,0.009212561361038263
0,0,none,1238,389,20.333333333333332,21.541666666666668,0.8529886914378029,3.1825192802056557,0.8457583547557841,0.13367609254498714,12000,0.03241666666666667
0,0,none,270,73,20.458333333333332,21.291666666666668,0.937037037037037,3.6986301369863015,0.7945205479452054,0.136986301369863,10000,0.0073
1,5,20151016,10293,4551,19.333333333333332,19.25,0.2740697561449529,2.261700725115359,0.7837837837837838,0.25422983959569323,7000,0.6501428571428571
1,4,20151021,839,499,21.333333333333332,22.708333333333332,0.36829558998808104,1.6813627254509018,0.811623246492986,0.1903807615230461,20000,0.02495
1,2,20151021,1625,1042,21.333333333333332,21.333333333333332,0.37538461538461537,1.5595009596928984,0.8051823416506718,0.17946257197696738,50000,0.02084
0,0,none,94,50,20.791666666666668,23.416666666666668,0.7446808510638298,1.88,0.84,0.18,140,0.35714285714285715
1,1,20151022,122,26,20.708333333333332,22.875,0.8360655737704918,4.6923076923076925,0.8846153846153846,0.19230769230769232,135,0.1925925925925926
