ID,T1_tweetRatio,T1_TweetsPerUser,T1_decision,T2_usersPerStudent,T2_decision,T4_tweetRatio,T4_decision,T5_fractionOfUsersSupportingFromAbroad,T5_decision,T3_morningProtests,T3_positiveRelation,T3_reciprocalRelation,T3_reciprocalRelationOnlyNotEventDays,protestReality,protestPrediction,prediction
20,0.5,0.9,protest,0.75,protest,0.5,protest,0.1,no protest,0,0,0,0,NO PROTEST,protest,wrong
16,0.9,0.5,protest,0.5,protest,0.9,protest,0.75,protest,1.0,0.0,1.0,1.0,PROTEST,protest,correct
6,0.5,0.5,protest,0.75,protest,0.5,protest,0.5,protest,0.4,0.6,0.6,0.8,PROTEST,protest,correct
7,0.75,0.75,protest,0.5,protest,0.75,protest,0.25,no protest,1.0,1.0,1.0,1.0,PROTEST,protest,correct
21,0.75,0.5,protest,0.25,no protest,0.75,protest,0.75,protest,0.4666666666666667,0.5333333333333333,0.4,0.8,PROTEST,protest,correct
10,0.5,0.75,protest,0.5,protest,0.5,protest,0.25,no protest,0.0,0.6666666666666666,0.3333333333333333,0.3333333333333333,PROTEST,protest,correct
0,0.5,0.25,no protest,0.25,no protest,0.5,protest,0.9,protest,0.6,0.6,0.8,0.8,PROTEST,no protest,wrong
26,0.1,0.5,no protest,0.9,protest,0.1,no protest,0.5,protest,0.2,0.6,0.6,0.6,PROTEST,no protest,wrong
1,0.75,0.5,protest,0.25,no protest,0.75,protest,0.5,protest,0.0,0.5,0.5,0.5,PROTEST,protest,correct
11,0.25,0.5,no protest,0.5,protest,0.25,no protest,0.5,protest,0.2,0.4,0.8,1.0,PROTEST,no protest,wrong
2,1,0.5,protest,0.1,no protest,1,protest,0.9,protest,0.4444444444444444,0.4444444444444444,0.5555555555555556,0.8888888888888888,PROTEST,protest,correct
12,0.75,0.25,no protest,0.5,protest,0.75,protest,0.5,protest,0.6666666666666666,0.6666666666666666,0.6666666666666666,0.6666666666666666,PROTEST,protest,correct
24,0.25,0.5,no protest,0.9,protest,0.25,no protest,0.25,no protest,0,0,0,0,NO PROTEST,no protest,correct
25,0.5,0.9,protest,0.75,protest,0.5,protest,0.5,protest,0.0,1.0,1.0,1.0,PROTEST,protest,correct
13,0.5,0.1,no protest,0.25,no protest,0.5,protest,0.75,protest,0.75,0.25,0.75,0.75,PROTEST,no protest,wrong
3,0.5,0.75,protest,0.5,protest,0.5,protest,0.5,protest,0.4,0.8,0.4,0.4,PROTEST,protest,correct
8,0.1,0.5,no protest,0.5,protest,0.1,no protest,0.5,protest,0,0,0,0,NO PROTEST,no protest,correct
22,0.5,0.25,no protest,0.1,no protest,0.5,protest,0.75,protest,0.5,0.5,1.0,1.0,PROTEST,no protest,wrong
18,0.25,0.25,no protest,0.5,protest,0.25,no protest,0.5,protest,0.75,0.5,0.25,0.25,PROTEST,no protest,wrong
4,0.1,0.5,no protest,1,protest,0.1,no protest,0.5,protest,0,0,0,0,NO PROTEST,no protest,correct
14,0.5,0.75,protest,0.5,protest,0.5,protest,0.1,no protest,0,0,0,0,NO PROTEST,protest,wrong
15,0.5,0.1,no protest,0.1,no protest,0.5,protest,1,protest,0.6,0.4,0.8,0.8,PROTEST,no protest,wrong
5,0.25,0.5,no protest,0.5,protest,0.25,no protest,0.5,protest,0.0,0.6666666666666666,0.6666666666666666,0.6666666666666666,PROTEST,no protest,wrong
19,0.5,0.1,no protest,0.5,protest,0.5,protest,0.5,protest,0.5,0.0,1.0,1.0,PROTEST,protest,correct
23,0.5,0.5,protest,0.5,protest,0.5,protest,0.1,no protest,0,0,0,0,NO PROTEST,protest,wrong
9,0.9,1,protest,0.75,protest,0.9,protest,0.25,no protest,0.0,1.0,1.0,1.0,PROTEST,protest,correct
