22:46:52.736   Start of loop 0
22:46:54.165   Endpoint Response Code: 200
22:46:54.191   Result count 0: 486
22:46:54.192   Next_token 0: 1jzu9lk96gu5npw2csajnib8vr0zd8na87a1sgb1yh6l
22:46:54.262   Data added to file
22:46:54.265   End of loop 0
22:46:54.266   --------------------------------------------------------
22:46:59.267   Start of loop 1
22:47:00.772   Endpoint Response Code: 200
22:47:00.780   Result count 1: 494
22:47:00.781   Next_token 1: 1jzu9lk96gu5npw2csajlcztbm3n82z9zyabu9wahda5
22:47:00.854   Data added to file
22:47:00.855   End of loop 1
22:47:00.855   --------------------------------------------------------
22:47:05.856   Start of loop 2
22:47:07.405   Endpoint Response Code: 200
22:47:07.414   Result count 2: 485
22:47:07.414   Next_token 2: 1jzu9lk96gu5npw2csa4qedui9a1l7es35n1zwsekoe5
22:47:07.475   Data added to file
22:47:07.476   End of loop 2
22:47:07.477   --------------------------------------------------------
22:47:12.477   Start of loop 3
22:47:13.924   Endpoint Response Code: 200
22:47:13.933   Result count 3: 492
22:47:13.934   Next_token 3: 1jzu9lk96gu5npw2csa4o85qzx7bzai66v4lrvs3t1ml
22:47:13.996   Data added to file
22:47:13.997   End of loop 3
22:47:13.997   --------------------------------------------------------
22:47:19.000   Start of loop 4
22:47:20.521   Endpoint Response Code: 200
22:47:20.529   Result count 4: 473
22:47:20.530   Next_token 4: 1jzu9lk96gu5npw2csa4m3qfn8r679lmpb9o9n3v4dj1
22:47:20.590   Data added to file
22:47:20.591   End of loop 4
22:47:20.591   --------------------------------------------------------
22:47:25.592   Start of loop 5
22:47:27.032   Endpoint Response Code: 200
22:47:27.040   Result count 5: 489
22:47:27.040   Next_token 5: 1jzu9lk96gu5npw2csa4frn80exgf42yutuz03jkinp9
22:47:27.102   Data added to file
22:47:27.103   End of loop 5
22:47:27.103   --------------------------------------------------------
22:47:32.104   Start of loop 6
22:47:33.447   Endpoint Response Code: 200
22:47:33.456   Result count 6: 491
22:47:33.456   Next_token 6: 1jzu9lk96gu5npw2cs9pp1ak69ge6z1pucaw4jk715kt
22:47:33.520   Data added to file
22:47:33.521   End of loop 6
22:47:33.522   --------------------------------------------------------
22:47:38.522   Start of loop 7
22:47:39.965   Endpoint Response Code: 200
22:47:39.974   Result count 7: 482
22:47:39.974   Next_token 7: 1jzu9lk96gu5npw2cs9pinf17bsm4uqzf5pn2ei742gt
22:47:40.036   Data added to file
22:47:40.037   End of loop 7
22:47:40.037   --------------------------------------------------------
22:47:45.038   Start of loop 8
22:47:46.396   Endpoint Response Code: 200
22:47:46.405   Result count 8: 489
22:47:46.405   Next_token 8: 1jzu9lk96gu5npw2cs9pgja4khvow8j67m3kh8mzr62l
22:47:46.470   Data added to file
22:47:46.471   End of loop 8
22:47:46.472   --------------------------------------------------------
22:47:51.473   Start of loop 9
22:47:53.025   Endpoint Response Code: 200
22:47:53.033   Result count 9: 477
22:47:53.033   Next_token 9: 1jzu9lk96gu5npw2cs9pgie3f54qri5xchj9imjqktj1
22:47:53.095   Data added to file
22:47:53.096   End of loop 9
22:47:53.096   --------------------------------------------------------
22:47:58.097   Start of loop 10
22:47:59.637   Endpoint Response Code: 200
22:47:59.647   Result count 10: 489
22:47:59.648   Next_token 10: 1jzu9lk96gu5npw2cs9pgi31wvpkmdjtpwfcbwv69kl9
22:47:59.712   Data added to file
22:47:59.713   End of loop 10
22:47:59.714   --------------------------------------------------------
22:48:04.715   Start of loop 11
22:48:05.949   Endpoint Response Code: 200
22:48:05.957   Result count 11: 451
22:48:05.957   Next_token 11: 1jzu9lk96gu5npw2cs9peek29s3zssq6dxlvim3lwm0t
22:48:06.016   Data added to file
22:48:06.017   End of loop 11
22:48:06.018   --------------------------------------------------------
22:48:11.020   Start of loop 12
22:48:12.294   Endpoint Response Code: 200
22:48:12.302   Result count 12: 447
22:48:12.303   Next_token 12: 1jzu9lk96gu5npw2cs9pa5ek1g6tjg53gdq3v59t07el
22:48:12.363   Data added to file
22:48:12.364   End of loop 12
22:48:12.364   --------------------------------------------------------
22:48:17.365   Start of loop 13
22:48:18.572   Endpoint Response Code: 200
22:48:18.581   Result count 13: 488
22:48:18.582   Next_token 13: 1jzu9lk96gu5npw2cs9p80dtud97ojl979rzky90bp8d
22:48:18.646   Data added to file
22:48:18.647   End of loop 13
22:48:18.647   --------------------------------------------------------
22:48:23.649   Start of loop 14
22:48:24.865   Endpoint Response Code: 200
22:48:24.874   Result count 14: 477
22:48:24.875   Next_token 14: 1jzu9lk96gu5npw2cs9p5v2562fn52ylttihv85nr3p9
22:48:24.936   Data added to file
22:48:24.937   End of loop 14
22:48:24.938   --------------------------------------------------------
22:48:29.939   Start of loop 15
22:48:31.304   Endpoint Response Code: 200
22:48:31.312   Result count 15: 478
22:48:31.313   Next_token 15: 1jzu9lk96gu5npw2cs9ahamku6vg447w6503c27eyt8d
22:48:31.408   Data added to file
22:48:31.409   End of loop 15
22:48:31.410   --------------------------------------------------------
22:48:36.411   Start of loop 16
22:48:37.745   Endpoint Response Code: 200
22:48:37.753   Result count 16: 475
22:48:37.754   Next_token 16: 1jzu9lk96gu5npw2cs9af6i3fi6h12am7yy5gzji25j1
22:48:37.812   Data added to file
22:48:37.813   End of loop 16
22:48:37.813   --------------------------------------------------------
22:48:42.815   Start of loop 17
22:48:44.166   Endpoint Response Code: 200
22:48:44.175   Result count 17: 479
22:48:44.175   Next_token 17: 1jzu9lk96gu5npw2cs9aavu9crm6a2o43z38722ucvwd
22:48:44.236   Data added to file
22:48:44.237   End of loop 17
22:48:44.237   --------------------------------------------------------
22:48:49.239   Start of loop 18
22:48:50.595   Endpoint Response Code: 200
22:48:50.603   Result count 18: 485
22:48:50.604   Next_token 18: 1jzu9lk96gu5npw2cs9a6mzo56704mukrngdcqppgmt9
22:48:50.691   Data added to file
22:48:50.692   End of loop 18
22:48:50.693   --------------------------------------------------------
22:48:55.693   Start of loop 19
22:48:57.094   Endpoint Response Code: 200
22:48:57.102   Result count 19: 493
22:48:57.103   Next_token 19: 1jzu9lk96gu5npw2cs8vduwr8drni65ogfws56onhwn1
22:48:57.164   Data added to file
22:48:57.165   End of loop 19
22:48:57.165   --------------------------------------------------------
22:49:02.166   Start of loop 20
22:49:03.488   Endpoint Response Code: 200
22:49:03.496   Result count 20: 434
22:49:03.496   No next token. End of search reached.
22:49:03.548   Data added to file
22:49:03.549   End of loop 20
22:49:03.549   --------------------------------------------------------
22:49:03.550   --------------------------------------------------------
22:49:03.550   10054 results found in 21 loops
22:49:03.550   Exit
