Name,Fitting Windows Score,Trace Support Score,Aggregated Score
BPI_Challenge_2012.e7c90d39-8fa9-49c3-ade5-477c5ae002e3.pnml,0.025049328023598282,0.38213494307327883,0.8764269886146557
BPI_Challenge_2012.43c8aa74-a6f7-4ac1-9538-a5986ec9f4aa.pnml,0.025049328023598282,0.38213494307327883,0.8764269886146557
BPI_Challenge_2012.3c900653-3559-4c4b-99a1-450e3809ac4c.pnml,0.0015295251176702786,0.06067089478108046,0.6243462839374703
BPI_Challenge_2012.8dd76103-bafb-44e6-9846-82efd111ccf7.pnml,0.0015295251176702786,0.06067089478108046,0.6243462839374703
BPI_Challenge_2012.ad1bf3ca-655d-4ea2-9473-bf66c02e7092.pnml,0.0011588836143751854,0.051883548559639336,0.6189162549480172
BPI_Challenge_2012.ed1fce6d-1c1e-4d4b-8b68-f48f4bf79640.pnml,5.299670363857605E-4,0.024146099182394742,0.6090606070887556
BPI_Challenge_2012.162d629b-9220-4c6d-9b71-b3bc6949b7a1.pnml,5.064874841408216E-4,0.023076335294567128,0.6086591877873551
BPI_Challenge_2012.f0bf0a5d-1dfa-4880-a132-0be5f80354cf.pnml,4.04183720787873E-4,0.017345457324062046,0.6066961937679728
BPI_Challenge_2012.612a8436-d4af-4f20-b99f-9a0d232df47e.pnml,4.04183720787873E-4,0.017345457324062046,0.6066961937679728
BPI_Challenge_2012.a2859b40-7f76-4c87-a156-f2efe35b6bf5.pnml,7.429601174648497E-4,0.02873080155879881,0.6051095092935597
BPI_Challenge_2012.bd28b87c-883f-46e7-980e-e7d3c881e7af.pnml,0.0012611873777281302,0.03751814778023993,0.6046907328320996
BPI_Challenge_2012.512eca77-bc93-41c9-8f0f-416bba7f4bb5.pnml,2.6330640731824087E-4,0.01199663788492397,0.6045016307371349
BPI_Challenge_2012.e7cb3bd3-ae71-4082-866c-b57882a73b73.pnml,2.6330640731824087E-4,0.01199663788492397,0.6045016307371349
BPI_Challenge_2012.a251888a-c848-436c-ad70-c7ed35c1965e.pnml,2.5827507469432514E-4,0.006953465270879498,0.6034528248163613
BPI_Challenge_2012.608ddf76-3edc-4ddf-9ec5-b0ee2c3fdbd1.pnml,1.6771108746384763E-4,0.005348819439138076,0.6024088104866494
BPI_Challenge_2012.28e062b2-6736-4d93-965e-c796b0063e42.pnml,1.0565798510222417E-4,0.004813937495224269,0.6018063868563026
BPI_Challenge_2012.9bb8d0cf-c586-48f5-9c1d-32e008557adc.pnml,1.0062665247830871E-4,0.0036677619011232523,0.6015369803395176
BPI_Challenge_2012.f576ee6a-4ad7-4050-b116-d2640003a3d7.pnml,8.217843285728548E-5,0.0037441736073966533,0.601404967554902
BPI_Challenge_2012.19b0bbee-d7b8-4667-bf8d-b39ea17f819d.pnml,8.0501321982647E-5,0.0036677619011232523,0.6013762947476591
BPI_Challenge_2012.59c5682d-b8f2-4923-b110-cfeb99da5e09.pnml,8.385554373192396E-5,0.0030564682509360433,0.601280816949598
BPI_Challenge_2012.c0bb00d8-1916-4c98-b241-048b66ba25ab.pnml,6.373021323626219E-5,0.002903644838389241,0.6010895666752301
BPI_Challenge_2012.a90ce7e4-81e1-4089-a259-d8b411318672.pnml,6.373021323626219E-5,0.002903644838389241,0.6010895666752301
BPI_Challenge_2012.b90f09a3-c8b8-4afc-a379-1f7bd06f6972.pnml,5.869888061234672E-5,0.002674409719569038,0.6010035482535014
BPI_Challenge_2012.dc0aa59e-61bf-411b-8567-a3b26c3592a7.pnml,5.869888061234672E-5,0.002674409719569038,0.6010035482535014
BPI_Challenge_2012.8da129a6-99e6-481a-a3c0-5c008765975b.pnml,5.031332623915432E-5,0.0022923511882020327,0.6008601842172869
BPI_Challenge_2012.2d62f1dc-d53c-42a2-a272-db4ef00346f2.pnml,5.031332623915432E-5,0.0022923511882020327,0.6008601842172869
BPI_Challenge_2012.095a9248-4c32-4aca-b60b-2481ece88852.pnml,5.031332623915432E-5,0.0021395277756552306,0.6008296195347775
BPI_Challenge_2012.c6ff70a1-7215-4587-9879-bcddb5808011.pnml,4.528199361523888E-5,0.002063116069381829,0.6007741657955582
BPI_Challenge_2012.bfc1c94b-6ac2-4396-a6e3-81d17d5dddfa.pnml,4.528199361523888E-5,0.002063116069381829,0.6007741657955582
BPI_Challenge_2012.556b3e57-a88f-406f-9dcc-cb6a9930bc56.pnml,4.528199361523888E-5,0.002063116069381829,0.6007741657955582
BPI_Challenge_2012.eb904056-a521-40b2-b062-3a1631ce37d1.pnml,2.3479552244938682E-5,0.0010697638878276153,0.6004014193014006
BPI_Challenge_2012.fca66884-d13e-48c0-9f07-d464ed54ff5f.pnml,2.1802441370300204E-5,9.93352181554214E-4,0.6003727464941576
BPI_Challenge_2012.de927382-50d5-4217-b33e-9b1c084d5c44.pnml,1.8867497339682875E-5,6.877053564606098E-4,0.6002881838136596
BPI_Challenge_2012.4e949a7e-3d6a-4192-a3a0-83b8673711a8.pnml,1.6771108746384774E-5,7.641170627340108E-4,0.600286728072429
BPI_Challenge_2012.657dbf1d-d38b-4348-ae4f-ce19325ee3ff.pnml,1.1739776122469345E-5,5.348819439138076E-4,0.6002007096507003
BPI_Challenge_2012.2792e49b-02b3-4958-9190-20c73d1c2fe5.pnml,8.385554373192388E-6,3.820585313670054E-4,0.6001433640362145
BPI_Challenge_2012.a169bda7-f582-4589-919f-927bc53322df.pnml,8.385554373192388E-6,3.820585313670054E-4,0.6001433640362145
BPI_Challenge_2012.3304a063-1c03-4fa7-b8b3-34737579e674.pnml,3.3542217492769552E-6,1.5282341254680218E-4,0.6000573456144858
BPI_Challenge_2012.420f65f1-c007-48db-a393-0975c4a9a589.pnml,3.3542217492769552E-6,1.5282341254680218E-4,0.6000573456144858
BPI_Challenge_2012.966a8360-77db-4cd8-bf1d-bf5cf7cb1f4c.pnml,3.3542217492769552E-6,1.5282341254680218E-4,0.6000573456144858
BPI_Challenge_2012.94b5033c-8ea2-4093-8061-8a128c05c252.pnml,1.6771108746384776E-6,7.641170627340109E-5,0.6000286728072429
BPI_Challenge_2012.420e6f2f-c72a-45ed-847b-2fae6303034e.pnml,4.863621536451584E-5,0.0019102926568350272,0.5947097759844192
BPI_Challenge_2012.3b50dd9f-e80d-4031-8242-42e7ea704a81.pnml,9.894954160367028E-5,0.0033621150760296476,0.5913273253733756
BPI_Challenge_2012.7c928206-afc8-425a-9694-4facad47a1ad.pnml,3.3542217492769552E-6,7.641170627340109E-5,0.5833753966065645
BPI_Challenge_2012.580b0ccb-a018-4472-80dd-a44e8d49537c.pnml,3.3542217492769552E-6,7.641170627340109E-5,0.5833753966065645
BPI_Challenge_2012.98d91d50-ff6d-4854-a6d6-332f1f05555d.pnml,3.3542217492769552E-6,7.641170627340109E-5,0.5833753966065645
BPI_Challenge_2012.a8e2053f-f7f0-41b0-840b-8fb83e1a2a70.pnml,3.3542217492769552E-6,7.641170627340109E-5,0.5833753966065645
BPI_Challenge_2012.430b2104-4320-44fd-9192-247d89797f8f.pnml,3.3542217492769552E-6,7.641170627340109E-5,0.5833753966065645
BPI_Challenge_2012.fc3d48a0-17da-4b37-93f1-59329737450e.pnml,3.3542217492769552E-6,7.641170627340109E-5,0.5833753966065645
BPI_Challenge_2012.3776bb87-0ceb-44cc-b8aa-1ea5a48ad231.pnml,3.3542217492769552E-6,7.641170627340109E-5,0.5833753966065645
BPI_Challenge_2012.5fbd385b-aa68-4e9b-bd1a-eea17edc30f7.pnml,3.3542217492769552E-6,7.641170627340109E-5,0.5833753966065645
BPI_Challenge_2012.b7117f80-cb38-490a-92cf-83844582f96f.pnml,0.001963896834201639,0.04752808130205548,0.5808159453885733
BPI_Challenge_2012.dcaae451-0d80-45e1-a21f-580a09d87397.pnml,0.001101861844637477,0.015893634904867424,0.5805041819169582
BPI_Challenge_2012.5172eb7f-11cb-4f53-9de6-ba496d6ea5bc.pnml,0.001101861844637477,0.015893634904867424,0.5805041819169582
BPI_Challenge_2012.f75500b7-06db-4fb0-8cce-afb9189d5402.pnml,2.9349440306173357E-5,0.0010697638878276153,0.5804482859323594
BPI_Challenge_2012.c9f44678-e401-4446-8ca8-6143ed0b57e8.pnml,2.7253051712875262E-5,9.93352181554214E-4,0.5804162655086194
BPI_Challenge_2012.9ed36524-63c3-4756-a096-fd28dd360e30.pnml,4.192777186596194E-6,1.5282341254680218E-4,0.5800640408474799
BPI_Challenge_2012.f31e8d0a-4a24-405e-b7ab-b9a6353a15c2.pnml,2.64983518192879E-4,0.007106288683426301,0.5782244513628236
BPI_Challenge_2012.0064a212-a5ed-4a12-947a-b4ee3d1b4564.pnml,1.6771108746384763E-4,0.005348819439138076,0.5774088104866493
BPI_Challenge_2012.2d68ed30-cf88-49c7-879c-4571858a1c13.pnml,6.876154586017763E-5,0.0022159394819286317,0.5759921970019026
BPI_Challenge_2012.08db9bfd-b112-4197-92ad-150d2f30c6e2.pnml,6.876154586017763E-5,0.0022159394819286317,0.5759921970019026
BPI_Challenge_2012.5a14d014-04fe-479a-a0dc-e277c7ffd98c.pnml,8.720976548120093E-5,0.0032092916634828455,0.5758664644508764
BPI_Challenge_2012.f58b8813-8f72-48b2-a3b5-fb768238d7b4.pnml,4.528199361523888E-5,0.002063116069381829,0.5757741657955583
BPI_Challenge_2012.2bb9c72f-fc09-4417-9417-54dab403be22.pnml,3.354221749276955E-5,7.641170627340108E-4,0.575420632732311
BPI_Challenge_2012.98b2528d-c5ae-456e-8fbe-2f880487c632.pnml,2.3479552244938682E-5,0.0010697638878276153,0.5754014193014007
BPI_Challenge_2012.9c259212-6496-4770-9fd6-15d75a764d96.pnml,2.1802441370300204E-5,9.93352181554214E-4,0.5753727464941576
BPI_Challenge_2012.fba096f9-bb46-4110-bf70-92d2150b2835.pnml,1.0062665247830865E-5,4.5847023764040653E-4,0.5751720368434574
BPI_Challenge_2012.11fbb10c-0881-415e-8674-8907bc2de899.pnml,1.0062665247830865E-5,4.5847023764040653E-4,0.5751720368434574
BPI_Challenge_2012.5851cec6-79d9-48ee-bb59-83a1f180a338.pnml,1.0062665247830865E-5,4.5847023764040653E-4,0.5751720368434574
BPI_Challenge_2012.1fba2b4d-0560-4d2c-a1c6-0eba6a4f177c.pnml,1.0062665247830865E-5,4.5847023764040653E-4,0.5751720368434574
BPI_Challenge_2012.cd76a7f0-e1d5-4042-bd92-7cc6e89c4757.pnml,1.0062665247830865E-5,4.5847023764040653E-4,0.5751720368434574
BPI_Challenge_2012.3aaa7e17-b984-4cf8-9301-a1d2b46ee1fa.pnml,8.385554373192388E-6,3.820585313670054E-4,0.5751433640362145
BPI_Challenge_2012.daff0008-2f9e-4487-a96a-370fa3a7835a.pnml,8.385554373192388E-6,3.820585313670054E-4,0.5751433640362145
BPI_Challenge_2012.2dd224a2-1c9d-41fc-b77f-fdc8b2d288c6.pnml,1.844821962102325E-5,6.877053564606098E-4,0.5674723361971625
BPI_Challenge_2012.76c87124-025d-4aa6-9154-b84d86f9ec0a.pnml,6.7084434985539105E-6,1.5282341254680218E-4,0.5667507932131288
BPI_Challenge_2012.5477599c-71a1-43ec-9eaf-530c9d37429f.pnml,3.3542217492769552E-6,1.5282341254680218E-4,0.5667240122811524
BPI_Challenge_2012.c8a738c7-a15e-475c-83db-e5f782ce8d0e.pnml,3.3542217492769552E-6,1.5282341254680218E-4,0.5667240122811524
BPI_Challenge_2012.1e813ca7-6dab-419f-bf2b-2a00917fb07c.pnml,3.018799574349259E-5,8.405287690074119E-4,0.5568472612318904
BPI_Challenge_2012.3226b1bc-bf69-4279-8d3f-3da3e311d875.pnml,8.385554373192396E-5,0.0019102926568350272,0.5343849151641112
