{
    "32073":{
        "item number":32073,
        "item description":"Axle 5 studs",
        "category":"axle",
        "price [Euro]":0.001,
        "mass [g]":0.66,
        "delivery time [days]":3,
        "data source":"https://www.bricklink.com/v2/catalog/catalogitem.page?P=32073#T=S&O={%22iconly%22:0}",
        "dimension [studs]":5
    },
    "44294":{
        "item number":44294,
        "item description":"Axle 7 studs",
        "category":"axle",
        "price [Euro]":0.01,
        "mass [g]":1.05,
        "delivery time [days]":3,
        "data source":"https://www.bricklink.com/v2/catalog/catalogitem.page?P=44294#T=S&O={%22iconly%22:0}",
        "dimension [studs]":7
    },
    "3707":{
        "item number":3707,
        "item description":"Axle 8 studs",
        "category":"axle",
        "price [Euro]":0.01,
        "mass [g]":1.18,
        "delivery time [days]":3,
        "data source":"https://www.bricklink.com/v2/catalog/catalogitem.page?P=3707#T=S&O={%22iconly%22:0}",
        "dimension [studs]":8
    },
    "60485":{
        "item number":60485,
        "item description":"Axle 9 studs",
        "category":"axle",
        "price [Euro]":0.01,
        "mass [g]":1.3,
        "delivery time [days]":7,
        "data source":"https://www.bricklink.com/v2/catalog/catalogitem.page?P=60485#T=S&O={%22iconly%22:0}",
        "dimension [studs]":9
    },
    "3737":{
        "item number":3737,
        "item description":"Axle 10 studs",
        "category":"axle",
        "price [Euro]":0.01,
        "mass [g]":1.49,
        "delivery time [days]":7,
        "data source":"https://www.bricklink.com/v2/catalog/catalogitem.page?P=3737#T=S&O={%22iconly%22:0}",
        "dimension [studs]":10
    },
    "23948":{
        "item number":23948,
        "item description":"Axle 11 studs",
        "category":"axle",
        "price [Euro]":0.15,
        "mass [g]":1.65,
        "delivery time [days]":3,
        "data source":"https://www.bricklink.com/v2/catalog/catalogitem.page?P=23948#T=S&O={%22iconly%22:0}",
        "dimension [studs]":11
    },
    "3708":{
        "item number":3708,
        "item description":"Axle 12 studs",
        "category":"axle",
        "price [Euro]":0.02,
        "mass [g]":1.82,
        "delivery time [days]":7,
        "data source":"https://www.bricklink.com/v2/catalog/catalogitem.page?P=3708#T=S&O={%22iconly%22:0}",
        "dimension [studs]":12
    },
    "50451":{
        "item number":50451,
        "item description":"Axle 16 studs",
        "category":"axle",
        "price [Euro]":0.75,
        "mass [g]":2.37,
        "delivery time [days]":3,
        "data source":"https://www.bricklink.com/v2/catalog/catalogitem.page?P=50451#T=S&O={%22iconly%22:0}",
        "dimension [studs]":16
    }
}