{
	"JSON": {
		"ID": "1ee82402-4f35-66bf-8b8c-4139ef94845e",
		"label": "",
		"comment": "UUID6 is used"
	},
	"part": {
		"name": "disk_testrig_2",
		"mass": {
			"value": 500,
			"unit": "gramm"
		},
		"material": "S235",
		"young's modulus": {
			"value": 210000,
			"unit": "N/mm**2"
		},
		"dimensions": {
			"thickness": {
				"value": 7,
				"unit": "millimeter"
			},
			"diameter": {
				"value": 99,
				"unit": "millimeter"
			}
		}
	}
}