{
	"JSON": {
		"ID": "1ee57b2f-bfd6-6c0e-a6ed-d099248c61ab",
		"label": "PDC004",
		"comment": "UUID6 is used"
	},
	"probe": {
		"material": "Edelstahl",
		"mass": {
			"value": 637,
			"unit": "gramm",
			"uncertainty": {
				"value": 1,
				"type": "absolut",
				"unit": "gramm"
			}
		},
		"dimensions": {
			"height": {
				"value": 40,
				"unit": "millimeter"
			},
			"diameter": {
				"value": 60,
				"unit": "millimeter"
			},
			"volume": {
				"value": 80570,
				"unit": "cubic millimeter"
			}
		}
	}
}