{
	"JSON": {
		"ID": "1ee5ec0a-1830-63f5-ac3e-6f8ce4468546",
		"label": "",
		"comment": "UUID6 is used"
	},
	"group": {
		"number": "Group18",
		"author": [
			"Jonathan Ewald",
			"Paul Braun",
			"Noah Michel"
		],
		"experiment": "calorimetry",
		"testrig_number": "4"
	}
}
