{
	"JSON": {
		"ID": "1ee83042-e77f-6934-9254-2944abdefe49",
		"label": "",
		"comment": "UUID6 is used"
	},
	"sensor": {
		"name": "Temperature_Sensor",
		"type": "DS18B20",
		"manufacturer": "keyestudio",
		"serial": "3ce1e380ce6c",
		"comment": "",
		"range": {
			"min": -55,
			"max": 125,
			"units": "°C"
		},
		"accuracy": {
			"value": 0.5,
			"type": "absolute",
			"unit": "degree_celsius"
		}
	}
}
