{
	"JSON": {
		"ID": "1ee83044-3f46-6c35-b02e-5bb0ca7890d8",
		"label": "",
		"comment": "UUID6 is used"
	},
    "comment": "here you can write down something important about this setup file",
    "info": "List below ALL components, you used in your experiment. By using the UUID there is no possibility to mix something up.",
	"setup": {
		"1ee8303c-603e-621f-90d6-1dacb2b3cbed": {
            "type": "group_info",
			"name": "group_info",
            "comment": ""
        },
		"1ee8303f-0f58-6f6a-8a37-5c2df1a68313": {
            "type": "instrument",
			"name": "raspberry_pi",
            "comment": ""
        },
		"1ee83042-1281-64ab-a49f-ff0058239098": {
            "type": "sensor",
			"name": " sensor2_temp_cup",
            "comment": ""
        },
		"1ee83042-e77f-6934-9254-2944abdefe49": {
            "type": "sensor",
			"name": " sensor1_temp_env",
            "comment": ""
        },
		"1ee83041-5403-6263-b4aa-546c96b1f357": {
            "type": "probe",
			"name": "probe_description",
            "comment": ""
		}
	}
}