{
	"JSON": {
		"ID": "1ee83041-5403-6263-b4aa-546c96b1f357",
		"label": "",
		"comment": "UUID6 is used"
	},
	"probe": {
		"metadata": "define your own metadata here",
		"info": "think about all necessary things you should write down, that someone else can understand what you were doing"
	}
}