{
	"JSON": {
		"ID": "1ee83042-1281-64ab-a49f-ff0058239098",
		"label": "",
		"comment": "UUID6 is used"
	},
	"sensor": {
		"name": "Temperature_Sensor",
		"type": "DS18B20",
		"manufacturer": "keyestudio",
		"serial": "3ce1045733d2",
		"comment": "",
		"range": {
			"min": -55,
			"max": 125,
			"units": "°C"
		},
		"accuracy": {
			"value": 0.5,
			"type": "absolute",
			"unit": "degree_celsius"
		}
	}
}
