{
    "8882-1":{
        "item number":"8882-1",
        "item description":"Power Functions XL-Motor",
        "category":"motor",
        "related items":8881,
        "idle current [mA]":80,
        "idle speed [rev per min]":220,
        "locking torque [Ncm]":40,
        "price [Euro]":30,
        "mass [g]":72.85,
        "delivery time [days]":3,
        "data source":"https://www.bricklink.com/v2/catalog/catalogitem.page?S=8882-1&name=Power%20Functions%20XL-Motor&category=%5BPower%20Functions%5D#T=S&O={%22iconly%22:0}",
        "compatible battery":8881,
        "input voltage [V]":9,
        "dimensions [cm]":"13.6 x 12.2 x 3.9"
    },
    "8883-1":{
        "item number":"8883-1",
        "item description":"Power Functions M-Motor",
        "category":"motor",
        "related items":"8881, 8878, 45517, 88000",
        "idle current [mA]":65,
        "idle speed [rev per min]":405,
        "locking torque [Ncm]":11,
        "price [Euro]":20,
        "mass [g]":35.0,
        "delivery time [days]":5,
        "data source":"https://www.bricklink.com/v2/catalog/catalogitem.page?S=8883-1&name=Power%20Functions%20M-Motor&category=%5BPower%20Functions%5D#T=S&O={%22iconly%22:0}",
        "compatible battery":"8881, 8878, 45517, 88000",
        "input voltage [V]":9,
        "dimensions [cm]":"13.8 x 11.9 x 2.3"
    },
    "88003-1":{
        "item number":"88003-1",
        "item description":"Power Functions L-Motor",
        "category":"motor",
        "related items":"8881, 8878, 88000",
        "idle current [mA]":120,
        "idle speed [rev per min]":390,
        "locking torque [Ncm]":18,
        "price [Euro]":15,
        "mass [g]":48.0,
        "delivery time [days]":3,
        "data source":"https://www.bricklink.com/v2/catalog/catalogitem.page?S=88003-1&name=Power%20Functions%20L-Motor&category=%5BPower%20Functions%5D#T=S&O={%22iconly%22:0}",
        "compatible battery":"8881, 8878, 88000",
        "input voltage [V]":9,
        "dimensions [cm]":"13 x 11 x 2.5"
    }
}