{
	"JSON": {
		"ID": "1ee823b6-50dc-6670-aea5-35f6dd717e83",
		"label": "",
		"comment": "UUID6 is used"
	},
	"instrument": {
		"name": "motor_controller",
		"type": "BLDC-8015A",
		"manufacturer": "ACT",
		"power": {
			"value": 24,
			"unit": "Volt"
		},
		"current output": {
			"value": "15",
			"unit": "Ampere"
		}
	}
}
