{
	"JSON": {
		"ID": "1ee5ec0d-e77c-68b7-90f7-2e33485ff91c",
		"label": "",
		"comment": "UUID6 is used"
	},
	"instrument": {
		"name": "raspberry_pi",
		"type": "single_board_computer",
		"manufacturer": "Raspberry Pi Foundation",
		"model": "Raspberry Pi 4 Model B Rev. 1.5",
		"serial": "100000007900556a",
		"operating_system": "Raspberry Pi OS",
		"comment": "to get model and serial number put this code in the terminal: cat /proc/cpuinfo"
	}
}
