{
	"JSON": {
		"ID": "1ee822d4-cd68-648a-ae3d-af241cf42fcf",
		"label": "",
		"comment": "UUID6 is used"
	},
	"group": {
		"number": "99",
		"author": "Paul Zuendel",
		"experiment": "Kalorimetrie"
	}
}