{
	"JSON": {
		"ID": "1ee21750-5282-63bc-86e9-b4de622ee43e",
		"label": "",
		"comment": "UUID6 is used"
	},
	"actor": {
		"type": "Sous Vide cooker",
		"model": "DE310B",
		"manufacturer": "KitchenBoss",
		"power_supply": {
			"voltage": "230 V",
			"type": "AC voltage",
			"power": "1100 W"
		},
		"temperature_range": {
			"min": 40,
			"max": 90,
			"unit": "degree Celsius"
		},
		"circulation": "available"
	}
}