{
	"JSON": {
		"ID": "1ee83a4b-b7ef-6141-b3b6-669f57bfd9eb",
		"label": "",
		"comment": "UUID6 is used"
	},
	"instrument": {
		"name": "raspberry_pi",
		"type": "single_board_computer",
		"manufacturer": "Raspberry Pi Foundation",
		"model": "xxxxxxxxxxx",
		"serial": "xxxxxxxxxxx",
		"operating_system": "Raspberry Pi OS",
		"comment": "to get model and serial number put this code in the terminal: cat /proc/cpuinfo"
	}
}