{
	"JSON": {
		"ID": "1ee83a1b-4ed8-64e9-9864-8f66857af102",
		"label": "Sensor 1",
		"comment": "UUID6 is used"
	},
	"sensor": {
		"name": "Temperature_Sensor1",
		"type": "DS18B20",
		"manufacturer": "keyestudio",
		"serial": "3ce104573d08",
		"comment": "Sensor 1",
		"range": {
			"min": -50,
			"max": 125,
			"units": "degree_celsius"
		},
		"accuracy": {
			"value": 0.5,
			"type": "absolute",
			"unit": "degree_celsius"
		}
	}
}
