{
	"JSON": {
		"ID": "1ee83a43-3e9c-6001-9dc4-29c27d8995e7",
		"label": "",
		"comment": "UUID6 is used"
	},
	"probe": {
		"metadata": "define your own metadata here",
		"info": "think about all necessary things you should write down, that someone else can understand what you were doing"
	}
}