{
	"JSON": {
		"ID": "1ee83a48-158d-68f6-bd41-31da42bc73f9",
		"label": "",
		"comment": "UUID6 is used"
	},
    "comment": "here you can write down something important about this setup file",
    "info": "List below ALL components, you used in your experiment. By using the UUID there is no possibility to mix something up.",
	"setup": {
		"1ee83a4f-2ae4-632d-a8c4-49e9757d7941": {
            "type": "group_info",
			"name": "group_info",
            "comment": "group.json"
        },
		"1ee83a4b-b7ef-6141-b3b6-669f57bfd9eb": {
            "type": "instrument",
			"name": "raspberry_pi",
            "comment": "instrument_raspPI"
        },
		"1ee83a1b-4ed8-64e9-9864-8f66857af102": {
            "type": "sensor",
			"name": "temperature_cup",
            "comment": "Sensor 1"
        },
		"1ee83a43-3e9c-6001-9dc4-29c27d8995e7": {
            "type": "probe",
			"name": "probe_description",
            "comment": "Probe Newton"
        },
		"1ee83a1b-f9e6-6682-88f6-8a009854ff8b": {
			"type": "sensor",
			"name": "temperature_environment",
			"comment": "Sensor 2"
		}
	}
}