{
  "group": "de/hechler/patrick/profiler",
  "name": "patr-java-profiler",
  "version": "1.3.0",
  "props": {
    "java.release": "8"
  },
  "compilers": {
    "java": {},
    "javadoc": {}
  },
  "children": {
    "patr-java-profiler-bootstrap": {},
    "patr-java-profiler-agent": {},
    "patr-java-profiler-server": {},
    "patr-java-profiler-client": {},
    "patr-java-profiler-test": {}
  }
}