{
	"JSON": {
		"ID": "1ee57b31-ca65-62c8-bc60-327f1cbaf2f2",
		"label": "PDC006",
		"comment": "UUID6 is used"
	},
	"probe": {
		"material": "PVC",
		"mass": {
			"value": 110,
			"unit": "gramm",
			"uncertainty": {
				"value": 1,
				"type": "absolut",
				"unit": "gramm"
			}
		},
		"dimensions": {
			"height": {
				"value": 40,
				"unit": "millimeter"
			},
			"diameter": {
				"value": 60,
				"unit": "millimeter"
			},
			"volume": {
				"value": 80570,
				"unit": "cubic millimeter"
			}
		}
	}
}