{
	"JSON": {
		"ID": "1ee8493c-56b2-6175-a5c3-c779b519ae83",
		"label": "",
		"comment": "UUID6 is used"
	},
	"instrument": {
		"name": "raspberry_pi",
		"type": "single_board_computer",
		"manufacturer": "Raspberry Pi Foundation",
		"model": "Raspberry Pi 4 Model B Rev 1.5",
		"serial": "1000000017a886e6",
		"operating_system": "Raspberry Pi OS",
		"comment": "to get model and serial number put this code in the terminal: cat /proc/cpuinfo"
	}
}