{
    "JSON": {
        "ID": "1eead644-86cd-6c73-96b4-a720b876cc5f",
        "label": "setup_compressor",
        "comment": "auto generated with s_create_json_setup_from_template.py"
    },
    "setup": {
        "1ee846ef-4df0-632a-bfdb-ef2ea3181b39": {
            "type": "general",
            "name": "general_info",
            "comment": ""
        },
        "1ee846f1-b588-6d3c-9659-7c3266d530e8": {
            "type": "instrument",
            "name": "raspberry_pi",
            "comment": ""
        },
        "1ee847be-fddd-6ee4-892a-68c4555b0981": {
            "type": "sensor",
            "name": "accelerometer",
            "range": {
                "min": -2,
                "max": 2,
                "units": "standard_gravity"
            },
            "frequency": {
                "value": 800,
                "units": "Hertz"
            },
            "comment": ""
        },
        "1eead63e-ea50-67c3-9bf4-bcf3919ec79d": {
            "type": "probe",
            "name": "handy",
            "comment": ""
        }
    }
}