{
	"JSON": {
		"ID": "1ee5ec0a-1830-63f5-ac3e-6f8ce4468546",
		"label": "",
		"comment": "UUID6 is used"
	},
	"group": {
		"number": "48",
		"author": [
			"Ole Quiring",
			"Nilay Kuslugil",
			"Christoph Fröhlich"
		],
		"experiment": "calorimetry",
		"testrig_number": "4"
	}
}
