{
	"JSON": {
		"ID": "1ee57b3b-1882-62e4-8374-424a3fe06b1b",
		"label": "PDC015",
		"comment": "UUID6 is used"
	},
	"probe": {
		"material": "Messing",
		"mass": {
			"value": 678,
			"unit": "gramm",
			"uncertainty": {
				"value": 1,
				"type": "absolut",
				"unit": "gramm"
			}
		},
		"dimensions": {
			"height": {
				"value": 40,
				"unit": "millimeter"
			},
			"diameter": {
				"value": 60,
				"unit": "millimeter"
			},
			"volume": {
				"value": 80570,
				"unit": "cubic millimeter"
			}
		}
	}
}