{
	"JSON": {
		"ID": "1ee84815-4403-6a4a-9f28-ae7864daef2e",
		"label": "",
		"comment": "UUID6 is used"
	},
	"group": {
		"number": "48",
		"author": "Ole Quiring",
		"experiment": "Küchentischversuch Kalorimetrie"
	}
}