{
	"JSON": {
		"ID": "1ee84817-5d13-6122-980f-f4aff37931b2",
		"label": "Heat Capacity Versuch",
		"comment": "UUID6 is used"
	},
    "comment": "here you can write down something important about this setup file",
    "info": "List below ALL components, you used in your experiment. By using the UUID there is no possibility to mix something up.",
	"setup": {
		"1ee84815-4403-6a4a-9f28-ae7864daef2e": {
            "type": "group_info",
			"name": "gruppe 48 Ole Quiring",
            "comment": ""
        },
		"1ee84816-0dba-6a3d-8d35-dd395bac45d5": {
            "type": "instrument",
			"name": "raspberry_pi",
            "comment": ""
        },
		"1ee84803-1859-6ec0-9be8-241a2d55088d": {
            "type": "sensor",
            "serial": "3ce10457b25f",
			"name": "sensor1 use this field to name the sensor, that it is understandable where you used it. Exapmle: temperature_cup or temperature_environment",
            "comment": ""
        },
        "1ee84803-df2a-63db-af40-02124c894d76": {
            "type": "sensor",
            "serial": "3ce10457aa3e",
			"name": "sensor2 use this field to name the sensor, that it is understandable where you used it. Exapmle: temperature_cup or temperature_environment",
            "comment": ""
        },
		"1ee84816-8769-6222-94c3-af6e7dedb2fd": {
            "type": "probe",
			"name": "probe_description heat capacity versuch",
            "comment": ""
        }
	}
}