{
    "all": {
        "values": [
            "1ee84815-4403-6a4a-9f28-ae7864daef2e",
            "1ee84816-0dba-6a3d-8d35-dd395bac45d5",
            "1ee84803-1859-6ec0-9be8-241a2d55088d",
            "1ee84803-df2a-63db-af40-02124c894d76",
            "1ee84816-8769-6222-94c3-af6e7dedb2fd"
        ],
        "names": []
    },
    "setup_path": "/path/to/setup_up.json",
    "sensor": {
        "values": [
            "1ee84803-1859-6ec0-9be8-241a2d55088d",
            "1ee84803-df2a-63db-af40-02124c894d76"
        ],
        "names": [
            "sensor1 use this field to name the sensor, that it is understandable where you used it. Exapmle: temperature_cup or temperature_environment",
            "sensor2 use this field to name the sensor, that it is understandable where you used it. Exapmle: temperature_cup or temperature_environment"
        ],
        "serials": [
            "3ce10457b25f",
            "3ce10457aa3e"
        ]
    },
    "group_info": {
        "values": [
            "1ee84815-4403-6a4a-9f28-ae7864daef2e"
        ],
        "names": [
            "group_info"
        ]
    },
    "instrument": {
        "values": [
            "1ee84816-0dba-6a3d-8d35-dd395bac45d5"
        ],
        "names": [
            "raspberry_pi"
        ]
    },
    "probe": {
        "values": [
            "1ee84816-8769-6222-94c3-af6e7dedb2fd"
        ],
        "names": [
            "probe_description"
        ]
    }
}