2.000000000000000000e+01,1.050000000000000044e+00,8.175063504299303054e-10,1.907098809273490968e-03,4.442711906470927737e-05,9.980479185543851273e-01,5.545360179001952153e-07,1.637525252246590817e-10
2.000000000000000000e+01,1.189285714285714279e+00,7.609290783204689241e-10,1.775124614158938652e-03,4.363921295012805136e-05,9.981806835014189749e-01,5.517476137753921422e-07,1.629291193465119187e-10
2.000000000000000000e+01,1.328571428571428736e+00,8.710803458457906679e-10,1.830710204624789918e-03,4.257043341988778293e-05,9.981261666144913836e-01,5.517134645339284632e-07,1.629190351962607592e-10
2.000000000000000000e+01,1.467857142857142971e+00,8.912765145639014195e-10,1.787338591161598050e-03,4.088705670380127834e-05,9.981712215578329994e-01,5.517400982127121290e-07,1.629269000274278555e-10
2.000000000000000000e+01,1.607142857142857206e+00,6.904107156855446245e-10,1.488254087096956002e-03,3.675936266609506318e-05,9.984744337730493413e-01,5.519237957517927582e-07,1.629811452611565817e-10
2.000000000000000000e+01,1.746428571428571441e+00,6.591123402013197274e-10,1.404232244741404709e-03,3.487224806869582816e-05,9.985603427096827467e-01,5.519753984551213695e-07,1.629963833569803580e-10
2.000000000000000000e+01,1.885714285714285676e+00,7.534158138622131083e-10,1.480084692433704776e-03,3.475975900775767660e-05,9.984846027033555949e-01,5.519288044799859853e-07,1.629826243208809937e-10
2.000000000000000000e+01,2.025000000000000355e+00,9.935592083061247977e-10,1.718473045855575506e-03,3.638946481764417285e-05,9.982445845504495097e-01,5.517823786653717816e-07,1.629393852955928711e-10
2.000000000000000000e+01,2.164285714285714590e+00,7.727184007718951712e-10,1.436979608382559078e-03,3.274450461769473365e-05,9.985297229960179433e-01,5.519552729415455475e-07,1.629904403639859841e-10
2.000000000000000000e+01,2.303571428571428825e+00,6.061175993078164337e-10,1.212253506229106319e-03,2.962926304120658063e-05,9.987575643682814475e-01,5.520932994454477632e-07,1.630311991025211324e-10
2.000000000000000000e+01,2.442857142857143060e+00,1.038770893366291901e-09,1.677748634344192798e-03,3.403091282445335879e-05,9.982876674437306530e-01,5.518073831015777251e-07,1.629467690171878109e-10
2.000000000000000000e+01,2.582142857142857295e+00,8.862655023739209806e-10,1.489167419158763262e-03,3.153955824078952247e-05,9.984787400501439203e-01,5.519232101041138810e-07,1.629809723214678811e-10
2.000000000000000000e+01,2.721428571428571530e+00,7.608779760752466380e-10,1.328724350643748723e-03,2.927774139812120417e-05,9.986414449623162159e-01,5.520217539640841081e-07,1.630100719748620885e-10
2.000000000000000000e+01,2.860714285714285765e+00,6.565911766510378888e-10,1.191108662575405749e-03,2.721828097114327609e-05,9.987811201305505371e-01,5.521062767774318027e-07,1.630350312627676937e-10
2.000000000000000000e+01,3.000000000000000000e+00,5.686173218953448911e-10,1.072172469541026862e-03,2.545868721154252647e-05,9.989018159322469170e-01,5.521793266068321403e-07,1.630566026190825143e-10
2.571428571428571530e+01,1.050000000000000044e+00,1.019480466906103700e-09,1.886575035536914918e-03,5.500152345086350975e-05,9.980578690161580058e-01,5.532388809400423097e-07,1.664927803096056000e-10
2.571428571428571530e+01,1.189285714285714279e+00,9.482330795761905097e-10,1.755671692778232882e-03,5.402380174267949655e-05,9.981897529466802199e-01,5.504449137803027705e-07,1.656519584213674557e-10
2.571428571428571530e+01,1.328571428571428736e+00,1.085522040420701557e-09,1.810650651009126618e-03,5.270069192949927928e-05,9.981360969946809769e-01,5.504112164608468903e-07,1.656418174847874652e-10
2.571428571428571530e+01,1.467857142857142971e+00,1.110689214127532216e-09,1.767748702682508076e-03,5.061666304246444998e-05,9.981810829204390556e-01,5.504374969907952107e-07,1.656497263983686592e-10
2.571428571428571530e+01,1.607142857142857206e+00,8.603177813328654015e-10,1.471914525869102985e-03,4.550647195829817481e-05,9.984820273573900007e-01,5.506187604215974592e-07,1.657042761662943161e-10
2.571428571428571530e+01,1.746428571428571441e+00,1.345433668351715437e-09,1.873090030740469630e-03,4.918644460613002205e-05,9.980771716406523497e-01,5.503729370362470122e-07,1.656302976006110714e-10
2.571428571428571530e+01,1.885714285714285676e+00,9.388409332164389170e-10,1.463831050634784199e-03,4.303097228510340780e-05,9.984925862488310822e-01,5.506237023347171116e-07,1.657057633951997086e-10
2.571428571428571530e+01,2.025000000000000355e+00,1.238160422273681278e-09,1.699626222034136607e-03,4.504863701093695261e-05,9.982547732579158950e-01,5.504792163356916026e-07,1.656622814988212822e-10
2.571428571428571530e+01,2.164285714285714590e+00,9.628934941017343070e-10,1.421192329879487600e-03,4.053608063525466457e-05,9.985377198110584329e-01,5.506498196943318089e-07,1.657136232039846969e-10
2.571428571428571530e+01,2.303571428571428825e+00,7.552338885784718635e-10,1.198909326934492672e-03,3.667934895258642989e-05,9.987638596171075633e-01,5.507860167110735428e-07,1.657546105979810478e-10
2.571428571428571530e+01,2.442857142857143060e+00,1.294505137168763393e-09,1.659341655742700965e-03,4.212873907563546350e-05,9.982979776411177175e-01,5.505038890260347074e-07,1.656697065460376450e-10
2.571428571428571530e+01,2.582142857142857295e+00,1.104414743891207668e-09,1.472809951704660012e-03,3.904437862668091227e-05,9.984875937813684210e-01,5.506181813234013704e-07,1.657041018913615976e-10
2.571428571428571530e+01,2.721428571428571530e+00,9.481252703223706215e-10,1.314110797131848437e-03,3.624420205262041057e-05,9.986490931715377162e-01,5.507154191854938656e-07,1.657333648419041262e-10
2.571428571428571530e+01,2.860714285714285765e+00,8.181366449239424749e-10,1.177991021443746495e-03,3.369455447552467784e-05,9.987877626413639298e-01,5.507988216105366303e-07,1.657584641292252023e-10
2.571428571428571530e+01,3.000000000000000000e+00,7.084815610484278919e-10,1.060347944558433968e-03,3.151615020449628264e-05,9.989075841600723038e-01,5.508709029973221074e-07,1.657801564413673233e-10
3.142857142857143060e+01,1.050000000000000044e+00,1.318618554290476748e-09,1.910257530674547115e-03,6.806165799043353978e-05,9.980211276869682679e-01,5.516364512993045169e-07,1.692970397085835433e-10
3.142857142857143060e+01,1.189285714285714279e+00,1.171220526129217730e-09,1.732825045375669705e-03,6.622149011873147673e-05,9.982004032429262486e-01,5.488819071201574051e-07,1.684516710347445704e-10
3.142857142857143060e+01,1.328571428571428736e+00,1.341304504638690217e-09,1.787284022038751127e-03,6.460115878708305118e-05,9.981475644503808864e-01,5.488590442134091361e-07,1.684446544164219267e-10
3.142857142857143060e+01,1.467857142857142971e+00,1.371914723913974440e-09,1.744741148928295217e-03,6.204497593912198779e-05,9.981926634601622217e-01,5.488746063073054028e-07,1.684494304177577629e-10
3.142857142857143060e+01,1.607142857142857206e+00,1.625983685346867622e-09,1.872681950762978718e-03,6.210296865417443189e-05,9.980646644897448461e-01,5.487964290185290647e-07,1.684254378343613961e-10
3.142857142857143060e+01,1.746428571428571441e+00,1.661926350813628027e-09,1.848719012017508703e-03,6.029185972254994858e-05,9.980904384868408696e-01,5.488110629475002033e-07,1.684299289821967060e-10
3.142857142857143060e+01,1.885714285714285676e+00,1.159575913763565929e-09,1.444741909807395691e-03,5.274610261817018638e-05,9.985019616016170829e-01,5.490578758442153339e-07,1.685056757764438217e-10
3.142857142857143060e+01,2.025000000000000355e+00,1.529379100644776812e-09,1.677491359847255864e-03,5.521953557735121397e-05,9.982667384910672848e-01,5.489156669995085353e-07,1.684620319302611934e-10
3.142857142857143060e+01,2.164285714285714590e+00,1.189282610800816812e-09,1.402650916699112746e-03,4.968779035676329937e-05,9.985471108515669991e-01,5.490835810596489177e-07,1.685135646983374456e-10
3.142857142857143060e+01,2.303571428571428825e+00,1.888514055027040220e-09,1.856171462796153606e-03,5.581471377877403317e-05,9.980874629599943981e-01,5.488064882008589024e-07,1.684285249940049069e-10
3.142857142857143060e+01,2.442857142857143060e+00,1.598979932491265648e-09,1.637723373562990220e-03,5.164023406710588744e-05,9.983100856849703719e-01,5.489399502691078942e-07,1.684694844574608126e-10
3.142857142857143060e+01,2.582142857142857295e+00,1.364120186107415897e-09,1.453598831301062882e-03,4.785925436101385672e-05,9.984979913292728604e-01,5.490524409808756077e-07,1.685040078187291072e-10
3.142857142857143060e+01,2.721428571428571530e+00,1.171021781166992430e-09,1.296947899397899590e-03,4.442665774307105920e-05,9.986580749551582370e-01,5.491481457460676902e-07,1.685333795786896410e-10
3.142857142857143060e+01,2.860714285714285765e+00,1.009981213482818817e-09,1.162585966066387961e-03,4.147386052364563427e-05,9.987953897646372203e-01,5.492302329859661994e-07,1.685585721247585727e-10
3.142857142857143060e+01,3.000000000000000000e+00,8.749375365078664632e-10,1.046460729775844714e-03,3.863079966571067789e-05,9.989143581258630444e-01,5.493011775194621289e-07,1.685803449780138106e-10
3.714285714285713880e+01,1.050000000000000044e+00,1.568545800227489590e-09,1.886083471881699067e-03,8.031702645753716714e-05,9.980330476447774046e-01,5.501253288234106903e-07,1.630088719409681096e-10
3.714285714285713880e+01,1.189285714285714279e+00,1.644197611564302837e-09,1.875831761303058251e-03,8.085754047179202449e-05,9.980427616207865338e-01,5.472710778371618822e-07,1.621631224196728155e-10
3.714285714285713880e+01,1.328571428571428736e+00,1.593464204832592512e-09,1.764072217725644797e-03,7.637538717142609054e-05,9.981590033078447943e-01,5.473316129172344449e-07,1.621810597052302277e-10
3.714285714285713880e+01,1.467857142857142971e+00,1.630623402700987010e-09,1.722260088304031819e-03,7.321320024546324205e-05,9.982039775615625388e-01,5.473570760233375379e-07,1.621886047353979245e-10
3.714285714285713880e+01,1.607142857142857206e+00,1.932668612751971083e-09,1.848564000688752030e-03,7.328173900467046522e-05,9.980776048853579052e-01,5.472801143098939961e-07,1.621658000372068678e-10
3.714285714285713880e+01,1.746428571428571441e+00,1.975391761885528141e-09,1.824905588560394795e-03,7.114453931813513577e-05,9.981034004400393123e-01,5.472945203332265308e-07,1.621700687183410740e-10
3.714285714285713880e+01,1.885714285714285676e+00,1.378155791546311365e-09,1.426089722476536021e-03,6.223995502296408367e-05,9.985111212446093898e-01,5.475374933787754551e-07,1.622420646072627585e-10
3.714285714285713880e+01,2.025000000000000355e+00,1.817796898832114564e-09,1.655863011370430462e-03,6.515886299427605896e-05,9.982784287481409891e-01,5.473974968464882660e-07,1.622005819203038164e-10
3.714285714285713880e+01,2.164285714285714590e+00,1.413461017606237940e-09,1.384533925408804999e-03,5.863099831397915824e-05,9.985562859377685729e-01,5.475627981989794737e-07,1.622495627353801351e-10
3.714285714285713880e+01,2.303571428571428825e+00,2.244750730639080437e-09,1.832257664788457035e-03,6.586132387509469684e-05,9.981013313144012633e-01,5.472900157574731103e-07,1.621687339573808373e-10
3.714285714285713880e+01,2.442857142857143060e+00,1.900527743804418823e-09,1.616599782903602872e-03,6.093510916073459501e-05,9.983219156237984615e-01,5.474214017983475722e-07,1.622076652502873961e-10
3.714285714285713880e+01,2.582142857142857295e+00,1.621306141655043265e-09,1.434827413455058015e-03,5.647327908471197114e-05,9.985081499917713987e-01,5.475321422320225153e-07,1.622404789969480384e-10
3.714285714285713880e+01,2.721428571428571530e+00,1.391733733346054539e-09,1.280177900677242171e-03,5.242258324916705594e-05,9.986668503357140070e-01,5.476263575700762098e-07,1.622683961554044933e-10
3.714285714285713880e+01,2.860714285714285765e+00,1.200274840663033945e-09,1.147532947283540824e-03,4.893809117476811179e-05,9.988029798918075519e-01,5.477071670970050909e-07,1.622923410078528037e-10
3.714285714285713880e+01,3.000000000000000000e+00,2.541627888090033710e-09,1.873534431254706908e-03,6.211522421623300700e-05,9.980638003758932619e-01,5.472648466994032517e-07,1.621612760572464289e-10
4.285714285714286120e+01,1.050000000000000044e+00,1.856780444960986326e-09,1.914175423256813660e-03,9.117758042150329780e-05,9.979940960934822192e-01,5.488837136472088202e-07,1.623453867930973843e-10
4.285714285714286120e+01,1.189285714285714279e+00,1.858955446368665279e-09,1.855727596770440080e-03,9.103825309336509113e-05,9.980526860657434884e-01,5.460639258239027584e-07,1.615113676129558400e-10
4.285714285714286120e+01,1.328571428571428736e+00,1.802178714325675581e-09,1.745284563658494820e-03,8.588579858770874664e-05,9.981682815429935296e-01,5.461310502163104346e-07,1.615312212452967762e-10
4.285714285714286120e+01,1.467857142857142971e+00,1.844203133537936458e-09,1.703912233919671311e-03,8.232973579173840056e-05,9.982132098683590415e-01,5.461561877112225966e-07,1.615386562560887506e-10
4.285714285714286120e+01,1.607142857142857206e+00,2.186358613182239604e-09,1.829024021015849492e-03,8.240851873432879454e-05,9.980880190245247086e-01,5.460878479881306503e-07,1.615184431608504798e-10
4.285714285714286120e+01,1.746428571428571441e+00,2.234193300126742612e-09,1.805470257905432896e-03,8.000350059078532199e-05,9.981139777513594602e-01,5.460944305254327130e-07,1.615203901025028068e-10
4.285714285714286120e+01,1.885714285714285676e+00,1.558585078459976947e-09,1.410866884062941763e-03,6.998957944559049181e-05,9.985185954820158249e-01,5.463342992100243336e-07,1.615913369595717001e-10
4.285714285714286120e+01,2.025000000000000355e+00,2.055907045677607907e-09,1.638211088265480739e-03,7.327218408119593710e-05,9.982879683141046012e-01,5.461960912429314467e-07,1.615504586727548520e-10
4.285714285714286120e+01,2.164285714285714590e+00,1.598511356935115044e-09,1.369747887116523838e-03,6.593110071025058022e-05,9.985637728927827528e-01,5.463592803346426655e-07,1.615987257201376481e-10
4.285714285714286120e+01,2.303571428571428825e+00,2.538873039028618893e-09,1.812740378046400576e-03,7.406225282754287436e-05,9.981126485787512603e-01,5.460899826953356223e-07,1.615190745511764436e-10
4.285714285714286120e+01,2.442857142857143060e+00,2.149478733166498085e-09,1.599359815375849588e-03,6.852232651989419035e-05,9.983315693273777658e-01,5.462196903486000265e-07,1.615574386684123574e-10
4.285714285714286120e+01,2.582142857142857295e+00,1.833615530007205430e-09,1.419507234163197920e-03,6.350465986653332944e-05,9.985164397817491988e-01,5.463290157575437802e-07,1.615897742530908428e-10
4.285714285714286120e+01,2.721428571428571530e+00,1.573916564928866997e-09,1.266491222307956563e-03,5.894936036309635210e-05,9.986740112597680685e-01,5.464220269627584358e-07,1.616172845247772254e-10
4.285714285714286120e+01,2.860714285714285765e+00,1.357333017870061949e-09,1.135247612041955781e-03,5.503080518559676573e-05,9.988091735619950562e-01,5.465018035212194534e-07,1.616408803355443560e-10
4.285714285714286120e+01,3.000000000000000000e+00,2.874686330104953622e-09,1.853577651670735736e-03,6.984958215820333217e-05,9.980760236648386075e-01,5.460651344119492820e-07,1.615117250815580701e-10
4.857142857142856940e+01,1.050000000000000044e+00,2.114017938106568720e-09,1.890366737741509470e-03,1.030571256237863430e-04,9.980060263084944427e-01,5.475538216663575836e-07,1.603006542273959646e-10
4.857142857142856940e+01,1.189285714285714279e+00,2.114895559670186833e-09,1.832252647526259317e-03,1.028948830610773265e-04,9.980643054666329395e-01,5.447284106479076617e-07,1.594734931031424816e-10
4.857142857142856940e+01,1.328571428571428736e+00,2.050270294677948772e-09,1.723193706494114980e-03,9.707112016851334347e-05,9.981791881690476043e-01,5.447945265689435637e-07,1.594928490549732279e-10
4.857142857142856940e+01,1.467857142857142971e+00,2.098583557161744115e-09,1.682468767077260332e-03,9.305342548831734104e-05,9.982239307231728365e-01,5.448261758568380259e-07,1.595021146309852207e-10
4.857142857142856940e+01,1.607142857142857206e+00,2.486388957897014529e-09,1.805736724451682297e-03,9.338436591765950730e-05,9.981003315193154313e-01,5.447444480675899813e-07,1.594781881829053910e-10
4.857142857142856940e+01,1.746428571428571441e+00,2.541840878017505505e-09,1.782617775002980640e-03,9.042261019638361092e-05,9.981264121550217361e-01,5.447584557626992992e-07,1.594822890449602111e-10
4.857142857142856940e+01,1.885714285714285676e+00,1.773028475086983167e-09,1.392967709069165309e-03,7.910382720333990192e-05,9.985273815364261729e-01,5.449947213473943484e-07,1.595514576386206191e-10
4.857142857142856940e+01,2.025000000000000355e+00,2.338943905072820550e-09,1.617455640359427875e-03,8.281424746825008531e-05,9.982991827551275232e-01,5.448585892937612832e-07,1.595116039175885857e-10
4.857142857142856940e+01,2.164285714285714590e+00,1.818446563798734775e-09,1.352362310464315246e-03,7.451661939725833981e-05,9.985725740728065292e-01,5.450193267790054908e-07,1.595586610707376801e-10
4.857142857142856940e+01,2.303571428571428825e+00,2.888517599923757035e-09,1.789791488397597967e-03,8.370739158942865196e-05,9.981259533179406285e-01,5.447540738087824305e-07,1.594810061937557111e-10
4.857142857142856940e+01,2.442857142857143060e+00,2.445403131846866769e-09,1.579088750293394013e-03,7.744558399516140784e-05,9.983429181789564844e-01,5.448818334240327648e-07,1.595184088181153018e-10
4.857142857142856940e+01,2.582142857142857295e+00,2.085963667690542039e-09,1.401493567786565994e-03,7.177411783333089606e-05,9.985261850793499816e-01,5.449895164764054785e-07,1.595499338720214671e-10
4.857142857142856940e+01,2.721428571428571530e+00,1.790436382371737206e-09,1.250398309385621293e-03,6.662528551715347859e-05,9.986824293739540170e-01,5.450811301025752969e-07,1.595767544760060531e-10
4.857142857142856940e+01,2.860714285714285765e+00,1.543973162669054179e-09,1.120802461931518163e-03,6.219617190221350483e-05,9.988164545028856978e-01,5.451597077472197909e-07,1.595997586946705171e-10
4.857142857142856940e+01,3.000000000000000000e+00,3.270628788568942067e-09,1.830111942061640870e-03,7.894594776009166380e-05,9.980903939504778277e-01,5.447295978487463380e-07,1.594738406654525983e-10
5.428571428571428470e+01,1.050000000000000044e+00,2.477262886251983056e-09,1.914841883819554461e-03,1.157744582260955291e-04,9.979688347066297816e-01,5.463135763106237914e-07,1.604853298006677854e-10
5.428571428571428470e+01,1.189285714285714279e+00,2.368514362637732259e-09,1.809341735103997539e-03,1.145023730740141822e-04,9.980756098317739022e-01,5.435318655550752350e-07,1.596681731577209329e-10
5.428571428571428470e+01,1.328571428571428736e+00,2.295835339544573098e-09,1.701575608391217489e-03,1.080205793691952238e-04,9.981898577629588765e-01,5.435937590100498238e-07,1.596863550077880502e-10
5.428571428571428470e+01,1.467857142857142971e+00,2.348988633717457692e-09,1.661227830840324637e-03,1.037898664671068634e-04,9.982344361758550555e-01,5.436181552959086019e-07,1.596935216720478033e-10
5.428571428571428470e+01,1.607142857142857206e+00,2.784280121597641804e-09,1.783087397280423226e-03,1.039179419535450453e-04,9.981124481723997466e-01,5.435444142037402555e-07,1.596718594545784466e-10
5.428571428571428470e+01,1.746428571428571441e+00,2.846376403942687670e-09,1.760254270730531251e-03,1.006219777734556915e-04,9.981385771872275381e-01,5.435582161791925913e-07,1.596759139292948419e-10
5.428571428571428470e+01,1.885714285714285676e+00,1.985259068889577465e-09,1.375451700385341277e-03,8.802568172898637120e-05,9.985359766818663330e-01,5.437910160143213226e-07,1.597443013169385463e-10
5.428571428571428470e+01,2.025000000000000355e+00,2.619102359935680039e-09,1.597144368487150726e-03,9.215496755359518528e-05,9.983101542282712959e-01,5.436568807416638986e-07,1.597048976769709768e-10
5.428571428571428470e+01,2.164285714285714590e+00,2.036976888091282114e-09,1.335551210450023870e-03,8.292411454076168938e-05,9.985809786523603959e-01,5.438259173240485265e-07,1.597545539418868101e-10
5.428571428571428470e+01,2.303571428571428825e+00,3.234635917824734948e-09,1.767333597064910155e-03,9.314905393635386282e-05,9.981389704007904706e-01,5.435538976014657294e-07,1.596746453018968989e-10
5.428571428571428470e+01,2.442857142857143060e+00,2.738319401990842919e-09,1.559251492863046379e-03,8.618049439569040748e-05,9.983540214349267972e-01,5.436797834340877779e-07,1.597116255825299374e-10
5.428571428571428470e+01,2.582142857142857295e+00,2.335723838486077519e-09,1.383865479705567768e-03,7.986893743222395691e-05,9.985357193015088617e-01,5.437858867386636907e-07,1.597427945385401056e-10
5.428571428571428470e+01,2.721428571428571530e+00,2.004713553066299069e-09,1.234649925287062237e-03,7.413902180129109483e-05,9.986906650122726603e-01,5.438761560671108465e-07,1.597693120983718581e-10
5.428571428571428470e+01,2.860714285714285765e+00,1.728658732849525575e-09,1.106666617331641391e-03,6.921006096836973987e-05,9.988235774796685451e-01,5.439535805077641308e-07,1.597920563380021761e-10
5.428571428571428470e+01,3.000000000000000000e+00,3.662590778055622247e-09,1.807148231895404529e-03,8.785037271996088673e-05,9.981044540433464674e-01,5.435297797829371068e-07,1.596675604403293750e-10
6.000000000000000000e+01,1.050000000000000044e+00,2.741623113007796923e-09,1.891426393264937847e-03,1.272761284266764445e-04,9.979807492992317508e-01,5.452712108465554922e-07,1.662428316739836597e-10
6.000000000000000000e+01,1.189285714285714279e+00,2.620500361988939807e-09,1.787067848853724980e-03,1.258751897606586671e-04,9.980865116811210580e-01,5.424943680377551158e-07,1.653962250634277997e-10
6.000000000000000000e+01,1.328571428571428736e+00,2.539620984551181837e-09,1.680538319023584326e-03,1.187482309398713476e-04,9.982001681944198124e-01,5.425505824933900127e-07,1.654133637828390885e-10
6.000000000000000000e+01,1.467857142857142971e+00,2.597742548777579000e-09,1.640553859900130374e-03,1.140952293405704174e-04,9.982448055799284514e-01,5.425676697704345223e-07,1.654185733689403951e-10
6.000000000000000000e+01,1.607142857142857206e+00,3.079234801161535500e-09,1.760907784030360523e-03,1.142361746097142965e-04,9.981243103017465312e-01,5.424949822728333381e-07,1.653964123320322515e-10
6.000000000000000000e+01,1.746428571428571441e+00,3.148659737252633583e-09,1.738506630270782519e-03,1.106153084838506709e-04,9.981503322306063408e-01,5.425165763457111874e-07,1.654029959545510682e-10
6.000000000000000000e+01,1.885714285714285676e+00,2.196195050459865270e-09,1.358473629836169563e-03,9.676798075457873638e-05,9.985442132805182336e-01,5.427472227112028438e-07,1.654733156489561799e-10
6.000000000000000000e+01,2.025000000000000355e+00,2.896483954170760380e-09,1.577254387533294456e-03,1.013046071934904109e-04,9.983208953375184436e-01,5.426058406614598972e-07,1.654302109483419147e-10
6.000000000000000000e+01,2.164285714285714590e+00,2.250929067665126792e-09,1.318690379704779737e-03,9.147490301622352240e-05,9.985892895389164581e-01,5.427619557459067115e-07,1.654778074713000230e-10
6.000000000000000000e+01,2.303571428571428825e+00,3.577353095206855219e-09,1.745341407731981504e-03,1.023976110908241178e-04,9.981517147340959184e-01,5.425043289927325905e-07,1.653992619693356838e-10
6.000000000000000000e+01,2.442857142857143060e+00,3.028333681831570071e-09,1.539825692211903123e-03,9.473665654586996623e-05,9.983648918290560781e-01,5.426284154856937246e-07,1.654370935833142180e-10
6.000000000000000000e+01,2.582142857142857295e+00,2.582986787462460476e-09,1.366603103157366852e-03,8.779801750586523545e-05,9.985450533978792453e-01,5.427330018077356713e-07,1.654689799656956350e-10
6.000000000000000000e+01,2.721428571428571530e+00,2.217097701655837553e-09,1.219285644811910103e-03,8.149991530773021710e-05,9.986986692323018833e-01,5.428249838182270605e-07,1.654970235329755175e-10
6.000000000000000000e+01,2.860714285714285765e+00,1.911457245124426126e-09,1.092824140335873183e-03,7.608018841940040610e-05,9.988305506959708202e-01,5.428982973107432356e-07,1.655193754238389143e-10
6.000000000000000000e+01,3.000000000000000000e+00,4.050713801398524949e-09,1.784660658660987059e-03,9.657263858643359291e-05,9.981182200060917387e-01,5.424805550947438903e-07,1.653920137595586773e-10
6.571428571428572241e+01,1.050000000000000044e+00,2.960273036153688787e-09,1.872270399967714211e-03,1.366869344925246887e-04,9.979904950212801218e-01,5.445227175004914040e-07,1.612690638487903033e-10
6.571428571428572241e+01,1.189285714285714279e+00,2.826050424136002724e-09,1.768383519040775528e-03,1.353358784843695223e-04,9.980957358911644040e-01,5.417248195805591023e-07,1.604404218770409092e-10
6.571428571428572241e+01,1.328571428571428736e+00,2.741514714374059599e-09,1.663410741461769518e-03,1.275265332380926908e-04,9.982085180181640149e-01,5.418051572300992666e-07,1.604642151497855723e-10
6.571428571428572241e+01,1.467857142857142971e+00,2.803201099227605976e-09,1.623643139100365692e-03,1.225263663670726104e-04,9.982532857188117781e-01,5.418120535254586243e-07,1.604662575973472325e-10
6.571428571428572241e+01,1.607142857142857206e+00,3.322868960458397484e-09,1.742765428045529863e-03,1.226778609785674845e-04,9.981340114874504010e-01,5.417402114779820720e-07,1.604449804322829301e-10
6.571428571428572241e+01,1.746428571428571441e+00,3.398840020538130523e-09,1.720787431766067225e-03,1.187927934656037650e-04,9.981598744436286363e-01,5.417718452386650681e-07,1.604543492736689791e-10
6.571428571428572241e+01,1.885714285714285676e+00,2.370877693572391475e-09,1.344652751954590391e-03,1.039219227566866364e-04,9.985508807932765851e-01,5.420006123151369728e-07,1.605221022820859503e-10
6.571428571428572241e+01,2.025000000000000355e+00,3.125591039019078191e-09,1.560984940841766977e-03,1.087901357873146541e-04,9.983296797875230721e-01,5.418497794245243275e-07,1.604774307224155521e-10
6.571428571428572241e+01,2.164285714285714590e+00,2.428826739350499574e-09,1.305062874851928376e-03,9.823353851964030466e-05,9.985961589932011995e-01,5.420040774381582078e-07,1.605231285333842065e-10
6.571428571428572241e+01,2.303571428571428825e+00,3.860447520380548119e-09,1.727352329347671238e-03,1.099640960085524871e-04,9.981621378042999648e-01,5.417494485281056137e-07,1.604477161315995230e-10
6.571428571428572241e+01,2.442857142857143060e+00,3.267875904932150456e-09,1.523935930675748406e-03,1.017366014316640365e-04,9.983737821674415480e-01,5.418720911565657113e-07,1.604840386967452055e-10
6.571428571428572241e+01,2.582142857142857295e+00,2.787200398943048233e-09,1.352483019222510329e-03,9.428486785144979605e-05,9.985526871897507650e-01,5.419754601914202167e-07,1.605146530805829927e-10
6.571428571428572241e+01,2.721428571428571530e+00,2.393441803045616681e-09,1.206894600695140787e-03,8.752564744021073704e-05,9.987050351197754861e-01,5.420781022061621462e-07,1.605450521458505705e-10
6.571428571428572241e+01,2.860714285714285765e+00,2.062398935036396509e-09,1.081501506920683501e-03,8.170058395458838644e-05,9.988362535473315207e-01,5.421388312342410362e-07,1.605630380134589476e-10
6.571428571428572241e+01,3.000000000000000000e+00,4.371324439017930733e-09,1.766266328499437131e-03,1.037085186988783542e-04,9.981294788950858532e-01,5.417259506105782410e-07,1.604407568495709837e-10
7.142857142857143060e+01,1.050000000000000044e+00,3.366967113234882679e-09,1.896954616209115593e-03,1.491819173990609540e-04,9.979533162232986365e-01,5.437209249805449979e-07,1.552009290153933701e-10
7.142857142857143060e+01,1.189285714285714279e+00,3.072543294848545004e-09,1.746700873566060103e-03,1.463130909365754017e-04,9.981064418464253851e-01,5.409621151739632997e-07,1.544134481124401468e-10
7.142857142857143060e+01,1.328571428571428736e+00,2.978320969791857874e-09,1.642681824971714858e-03,1.381161932766453431e-04,9.982186578245674236e-01,5.410244319009682892e-07,1.544312359397611336e-10
7.142857142857143060e+01,1.467857142857142971e+00,3.047617072422747333e-09,1.603711765693584994e-03,1.324639294959362558e-04,9.982632800548802976e-01,5.410478750818353587e-07,1.544379276142627048e-10
7.142857142857143060e+01,1.607142857142857206e+00,3.612718346263733329e-09,1.721382347259509810e-03,1.326278815618069681e-04,9.981454450270322853e-01,5.409770102881836083e-07,1.544176998074891302e-10
7.142857142857143060e+01,1.746428571428571441e+00,3.692557887438857978e-09,1.699329900464146463e-03,1.287780149668615642e-04,9.981713472473162652e-01,5.409902733108832865e-07,1.544214856346478555e-10
7.142857142857143060e+01,1.885714285714285676e+00,4.426574968225530040e-09,1.863401839573667305e-03,1.312784649551569215e-04,9.980047742230282459e-01,5.408914746660390213e-07,1.543932843262912721e-10
7.142857142857143060e+01,2.025000000000000355e+00,3.398165145827469552e-09,1.541813048570515616e-03,1.176131196577293633e-04,9.983400291938800963e-01,5.410852778693398277e-07,1.544486039504155524e-10
7.142857142857143060e+01,2.164285714285714590e+00,2.640428853660767826e-09,1.289001271338087755e-03,1.061995759131145652e-04,9.986042551205436268e-01,5.412372842970530143e-07,1.544919930085031401e-10
7.142857142857143060e+01,2.303571428571428825e+00,4.197252227533494615e-09,1.706149871643413600e-03,1.188824591229790874e-04,9.981744223314403808e-01,5.409861205778339483e-07,1.544203002691457920e-10
7.142857142857143060e+01,2.442857142857143060e+00,3.552843749568852643e-09,1.505207876171123877e-03,1.099871155852357211e-04,9.983842601938507366e-01,5.411070942506661653e-07,1.544548312675815002e-10
7.142857142857143060e+01,2.582142857142857295e+00,3.030119157065214738e-09,1.335840817422859683e-03,1.019305406612337007e-04,9.985616842482565314e-01,5.412090562317210337e-07,1.544839355257715548e-10
7.142857142857143060e+01,2.721428571428571530e+00,2.599463307998049310e-09,1.191748585544367403e-03,9.496650645994120373e-05,9.987127408582220367e-01,5.412958016681566598e-07,1.545086963390934266e-10
7.142857142857143060e+01,2.860714285714285765e+00,5.222219976311971914e-09,1.881443349265133746e-03,1.182086303226615283e-04,9.979998017632527585e-01,5.408805492231932242e-07,1.543901657432063299e-10
7.142857142857143060e+01,3.000000000000000000e+00,4.752774716274065281e-09,1.744586183317120174e-03,1.121193032653317262e-04,9.981427486432874474e-01,5.409629416691858027e-07,1.544136840291033614e-10
7.714285714285713880e+01,1.050000000000000044e+00,3.801359496754643760e-09,1.922059639540484423e-03,1.616895913768455137e-04,9.979157037460405499e-01,5.430664638374646902e-07,1.552187431654316113e-10
7.714285714285713880e+01,1.189285714285714279e+00,3.318108983794112279e-09,1.725630848204017789e-03,1.570863031712797135e-04,9.981167390185907706e-01,5.403574803934412652e-07,1.544444640791002612e-10
7.714285714285713880e+01,1.328571428571428736e+00,4.164472025898515445e-09,1.886444492143537653e-03,1.572773845711422029e-04,9.979557335550992558e-01,5.402493004105286384e-07,1.544135441786801277e-10
7.714285714285713880e+01,1.467857142857142971e+00,3.289754286882474166e-09,1.584154544821995622e-03,1.422131937957535352e-04,9.982730883860926330e-01,5.404310697288851812e-07,1.544654973133700750e-10
7.714285714285713880e+01,1.607142857142857206e+00,3.899886403801197200e-09,1.700400592200760567e-03,1.423893916011849186e-04,9.981566656007218041e-01,5.403611442359913432e-07,1.544455112751133381e-10
7.714285714285713880e+01,1.746428571428571441e+00,3.986074361367519445e-09,1.678613087018572926e-03,1.382560060228525851e-04,9.981825863922036968e-01,5.403742311732610752e-07,1.544492517711486461e-10
7.714285714285713880e+01,1.885714285714285676e+00,4.778593773717691484e-09,1.840700425235072867e-03,1.409408151059869001e-04,9.980178135499017111e-01,5.402767419764592123e-07,1.544213875011054215e-10
7.714285714285713880e+01,2.025000000000000355e+00,3.669690286731059789e-09,1.523233689599979256e-03,1.262740274822704784e-04,9.983499479784485597e-01,5.404802991633196576e-07,1.544795680237683389e-10
7.714285714285713880e+01,2.164285714285714590e+00,2.850028489910328271e-09,1.273241282367779809e-03,1.140144640567023631e-04,9.986122006310621524e-01,5.406179658087899485e-07,1.545189157741978336e-10
7.714285714285713880e+01,2.303571428571428825e+00,4.530951903181432318e-09,1.685345315246504234e-03,1.276317721528608953e-04,9.981864778570678221e-01,5.403701326951846260e-07,1.544480803480204201e-10
7.714285714285713880e+01,2.442857142857143060e+00,3.835160752694474723e-09,1.486831380683216377e-03,1.180811450948992674e-04,9.983945429950765726e-01,5.404895022329506682e-07,1.544821984364277887e-10
7.714285714285713880e+01,2.582142857142857295e+00,3.270755346435598246e-09,1.319511094361379812e-03,1.094311139994008376e-04,9.985705137762610484e-01,5.405901118111049639e-07,1.545109545709184945e-10
7.714285714285713880e+01,2.721428571428571530e+00,2.805760529845807455e-09,1.177160516249169510e-03,1.019541211709105110e-04,9.987203417265774208e-01,5.406757064344677982e-07,1.545354191452290199e-10
7.714285714285713880e+01,2.860714285714285765e+00,5.637599504876269723e-09,1.858516921379440787e-03,1.269085372495895277e-04,9.980140284833928233e-01,5.402659601561047997e-07,1.544183058514070966e-10
7.714285714285713880e+01,3.000000000000000000e+00,5.130720988126825004e-09,1.723312856108932941e-03,1.203706160373346843e-04,9.981557708954307273e-01,5.403472604102393956e-07,1.544415430131655916e-10
8.285714285714286120e+01,1.050000000000000044e+00,4.034815811774745864e-09,1.902945262928342363e-03,1.707760263712484257e-04,9.979257318563726775e-01,5.426630351041869200e-07,1.564768018599479965e-10
8.285714285714286120e+01,1.189285714285714279e+00,4.140629124577367090e-09,1.872431066478283737e-03,1.716624198286382413e-04,9.979553623624761727e-01,5.398549206868240372e-07,1.556670825039919185e-10
8.285714285714286120e+01,1.328571428571428736e+00,4.417934763847102022e-09,1.867388969819240314e-03,1.661099472959516469e-04,9.979659566701462037e-01,5.398391412523960216e-07,1.556625325065262161e-10
8.285714285714286120e+01,1.467857142857142971e+00,3.489809843613485234e-09,1.568128408880829381e-03,1.501990039927824532e-04,9.982811289226583007e-01,5.400189439466104762e-07,1.557143785854673789e-10
8.285714285714286120e+01,1.607142857142857206e+00,4.137162878503463408e-09,1.683207064783548033e-03,1.503852504262527100e-04,9.981658634421581855e-01,5.399497747567205359e-07,1.556944336603093066e-10
8.285714285714286120e+01,1.746428571428571441e+00,4.228596533606382678e-09,1.661636668378582704e-03,1.460196083594647728e-04,9.981917993762473573e-01,5.399627199157596014e-07,1.556981663949069624e-10
8.285714285714286120e+01,1.885714285714285676e+00,5.069473257856756747e-09,1.822097642390935537e-03,1.488554643411418822e-04,9.980285018018393295e-01,5.398662850564372757e-07,1.556703594182042399e-10
8.285714285714286120e+01,2.025000000000000355e+00,3.894212938780822842e-09,1.508008346782625103e-03,1.333689000462934368e-04,9.983580786253744010e-01,5.400778523983966987e-07,1.557313648283874953e-10
8.285714285714286120e+01,2.164285714285714590e+00,3.023178503924001139e-09,1.260326865953792161e-03,1.204156319525972584e-04,9.986187141193308969e-01,5.402038165230333211e-07,1.557676865641556770e-10
8.285714285714286120e+01,2.303571428571428825e+00,4.807948386770210630e-09,1.668481261933053243e-03,1.348028974970707497e-04,9.981961709086704104e-01,5.399682512220161685e-07,1.556997613462066746e-10
8.285714285714286120e+01,2.442857142857143060e+00,4.068417711871562551e-09,1.471772787849538310e-03,1.247110040976237490e-04,9.984029719071609854e-01,5.400767430564566982e-07,1.557310449498114275e-10
8.285714285714286120e+01,2.582142857142857295e+00,3.470526052820202805e-09,1.306274046151761729e-03,1.155784736775833599e-04,9.985776036701258240e-01,5.401837569141779669e-07,1.557619023790588887e-10
8.285714285714286120e+01,2.721428571428571530e+00,2.976176197121043355e-09,1.165206444171293073e-03,1.076775900502325298e-04,9.987265725728863286e-01,5.402609317376221091e-07,1.557841557274085218e-10
8.285714285714286120e+01,2.860714285714285765e+00,5.980845607519800849e-09,1.839729707505500167e-03,1.340347669069682937e-04,9.980256895334557177e-01,5.398556188843666168e-07,1.556672838291448361e-10
8.285714285714286120e+01,3.000000000000000000e+00,5.443023073395523386e-09,1.705880339586259833e-03,1.271293456168553885e-04,9.981664447800435713e-01,5.399360397318189773e-07,1.556904731680129347e-10
8.857142857142856940e+01,1.050000000000000044e+00,4.312896899930115346e-09,1.880375226664827201e-03,1.814979374157141994e-04,9.979375800770302618e-01,5.422837859890679067e-07,1.622062724923957980e-10
8.857142857142856940e+01,1.189285714285714279e+00,4.420235915491239953e-09,1.849525810564788984e-03,1.826294012274541363e-04,9.979673007579091815e-01,5.394487043528153087e-07,1.613582515183048101e-10
8.857142857142856940e+01,1.328571428571428736e+00,4.719806950027233184e-09,1.844932851916304727e-03,1.765322876642188036e-04,9.979779905256417338e-01,5.394536109925177868e-07,1.613597191774109562e-10
8.857142857142856940e+01,1.467857142857142971e+00,3.729042331929639919e-09,1.549373634474398740e-03,1.596251342417250398e-04,9.982904577032200022e-01,5.396376067483692042e-07,1.614147554268475040e-10
8.857142857142856940e+01,1.607142857142857206e+00,4.420018706941287975e-09,1.662983984959858722e-03,1.598211731033806016e-04,9.981766506958910101e-01,5.395646341376790880e-07,1.613929280820514392e-10
8.857142857142856940e+01,1.746428571428571441e+00,4.517120743604138217e-09,1.641593873708885407e-03,1.551796656080526964e-04,9.982026822087002316e-01,5.395734665134539885e-07,1.613955699953608818e-10
8.857142857142856940e+01,1.885714285714285676e+00,5.415550060249906811e-09,1.800134624986515991e-03,1.581937784142223161e-04,9.980411265414245170e-01,5.394782574750990737e-07,1.613670913581267235e-10
8.857142857142856940e+01,2.025000000000000355e+00,4.155702897682831073e-09,1.489374574646202274e-03,1.421593002405066835e-04,9.983679221431546180e-01,5.396648327521547831e-07,1.614228991860802465e-10
8.857142857142856940e+01,2.164285714285714590e+00,6.120593101149548625e-09,1.880902699409287698e-03,1.555758799321889623e-04,9.979629757089782949e-01,5.394297344649374913e-07,1.613525773032872694e-10
8.857142857142856940e+01,2.303571428571428825e+00,5.133506608855529017e-09,1.648171698110025875e-03,1.436925500288745573e-04,9.982075908874971093e-01,5.395694629209281685e-07,1.613943724529726222e-10
8.857142857142856940e+01,2.442857142857143060e+00,4.346730549256454080e-09,1.454106785767667661e-03,1.325362540898155598e-04,9.984128127601106240e-01,5.396918703251505816e-07,1.614309865824697675e-10
8.857142857142856940e+01,2.582142857142857295e+00,3.708848507838315928e-09,1.290718956082596717e-03,1.228339666580311623e-04,9.985859034025209580e-01,5.398044252405532945e-07,1.614646536655540396e-10
8.857142857142856940e+01,2.721428571428571530e+00,3.178867974660281038e-09,1.151093331763500087e-03,1.144302899711165361e-04,9.987339331700295642e-01,5.398678841415804752e-07,1.614836352985256370e-10
8.857142857142856940e+01,2.860714285714285765e+00,6.389238745522177042e-09,1.817548896855730517e-03,1.424427695159987762e-04,9.980394623152997191e-01,5.394677257710174630e-07,1.613639411469159550e-10
8.857142857142856940e+01,3.000000000000000000e+00,5.815878568713690741e-09,1.685474551069677043e-03,1.351084564956785464e-04,9.981788714589368006e-01,5.395562287822589852e-07,1.613904138977684551e-10
9.428571428571429180e+01,1.050000000000000044e+00,4.794831538789465335e-09,1.905555506035523346e-03,1.938513218584315739e-04,9.979000462678965233e-01,5.419475118524772810e-07,1.618661442822218526e-10
9.428571428571429180e+01,1.189285714285714279e+00,4.701102718769546038e-09,1.827501696406205094e-03,1.932199578701110636e-04,9.979787343247971121e-01,5.391587906301637896e-07,1.610332231194492664e-10
9.428571428571429180e+01,1.328571428571428736e+00,5.020139263016837717e-09,1.823019646619391653e-03,1.867707260046803941e-04,9.979896652795022804e-01,5.391666988344226015e-07,1.610355851019357137e-10
9.428571428571429180e+01,1.467857142857142971e+00,5.569462826063043707e-09,1.876404008765527502e-03,1.835541145612636853e-04,9.979394970084297656e-01,5.391377536372388713e-07,1.610269398967061341e-10
9.428571428571429180e+01,1.607142857142857206e+00,4.701340359046614137e-09,1.643244268768713533e-03,1.690907316900016060e-04,9.981871208601215129e-01,5.392770107673267254e-07,1.610685325126295442e-10
9.428571428571429180e+01,1.746428571428571441e+00,4.802866651606573086e-09,1.621894698599061655e-03,1.641745713124880175e-04,9.982133864914560784e-01,5.392746978302794586e-07,1.610678416962799594e-10
9.428571428571429180e+01,1.885714285714285676e+00,5.758319316270207768e-09,1.778548045341601372e-03,1.673637705241280259e-04,9.980535430840978828e-01,5.391806773698882324e-07,1.610397601402725233e-10
9.428571428571429180e+01,2.025000000000000355e+00,4.418468313135776834e-09,1.471483565234740732e-03,1.503987638845314951e-04,9.983775737263950179e-01,5.393649226056111874e-07,1.610947895762540827e-10
9.428571428571429180e+01,2.164285714285714590e+00,6.508095528172984298e-09,1.858353046455452637e-03,1.645941540433779374e-04,9.979765069976204162e-01,5.391327597076637213e-07,1.610254483350558607e-10
9.428571428571429180e+01,2.303571428571428825e+00,5.458325222142309191e-09,1.628389160352845203e-03,1.520211749237547212e-04,9.982190447745878936e-01,5.392707435260932548e-07,1.610666606446874347e-10
9.428571428571429180e+01,2.442857142857143060e+00,4.623417716416403697e-09,1.436864177315372174e-03,1.402241352541799986e-04,9.984223674992231956e-01,5.394036831245296114e-07,1.611063663721807748e-10
9.428571428571429180e+01,2.582142857142857295e+00,3.939101314604733750e-09,1.274807006012329286e-03,1.303791297660606828e-04,9.985942702810994831e-01,5.394828907069797143e-07,1.611300236926569119e-10
9.428571428571429180e+01,2.721428571428571530e+00,3.379554618420316105e-09,1.137222367873922746e-03,1.210609589908361874e-04,9.987411735669893265e-01,5.395654365816462697e-07,1.611546780773831920e-10
9.428571428571429180e+01,2.860714285714285765e+00,6.793742559062631466e-09,1.795748206874948601e-03,1.506991385339147152e-04,9.980530065295358799e-01,5.391702760621536086e-07,1.610366535302380179e-10
9.428571428571429180e+01,3.000000000000000000e+00,6.180931154343102325e-09,1.665072872203827471e-03,1.433726617468452096e-04,9.981910088753745969e-01,5.392486834887969340e-07,1.610600718642210945e-10
1.000000000000000000e+02,1.050000000000000044e+00,5.080392461573797833e-09,1.883174765630662648e-03,2.042932994610532622e-04,9.979119849737293491e-01,5.417213870343102458e-07,1.593993391187633869e-10
1.000000000000000000e+02,1.189285714285714279e+00,4.979800348570519215e-09,1.805900368245699382e-03,2.036241810577009100e-04,9.979899313787830017e-01,5.389335342191634528e-07,1.585790246417448805e-10
1.000000000000000000e+02,1.328571428571428736e+00,5.317696970033874593e-09,1.801473457480750164e-03,1.968279521631557526e-04,9.980011541724811419e-01,5.389415965587658768e-07,1.585813969527430249e-10
1.000000000000000000e+02,1.467857142857142971e+00,5.894404844755586955e-09,1.853732610714998834e-03,1.938095451397472274e-04,9.979519129038370018e-01,5.388873379731865981e-07,1.585654315821856454e-10
1.000000000000000000e+02,1.607142857142857206e+00,4.980071533650844910e-09,1.623835135948001459e-03,1.781962718361386000e-04,9.981974244023096299e-01,5.390512209700921483e-07,1.586136534948233627e-10
1.000000000000000000e+02,1.746428571428571441e+00,5.085750167407755208e-09,1.602526066542584761e-03,1.730096114289283310e-04,9.982239200397023948e-01,5.390379661306760293e-07,1.586097533116413185e-10
1.000000000000000000e+02,1.885714285714285676e+00,6.097680051198978440e-09,1.757323578211100181e-03,1.763708276609882142e-04,9.980657603927621802e-01,5.389451032644670483e-07,1.585824287867902517e-10
1.000000000000000000e+02,2.025000000000000355e+00,4.678585878705406839e-09,1.453892824554233951e-03,1.584916972063090410e-04,9.983870715139383512e-01,5.391270792117330668e-07,1.586359744772945582e-10
1.000000000000000000e+02,2.164285714285714590e+00,6.891758842328581246e-09,1.836181600082983402e-03,1.734521889840782700e-04,9.979898202628304515e-01,5.388977751764292505e-07,1.585685026872572502e-10
1.000000000000000000e+02,2.303571428571428825e+00,5.779900648288724682e-09,1.608938536617694585e-03,1.602017160749823297e-04,9.982303147747381145e-01,5.390340598411294818e-07,1.586086039016548983e-10
1.000000000000000000e+02,2.442857142857143060e+00,4.891525856807728994e-09,1.419343044930295155e-03,1.482264867651719796e-04,9.984318862703746023e-01,5.391477618972912085e-07,1.586420602743261859e-10
1.000000000000000000e+02,2.582142857142857295e+00,4.170820627899416184e-09,1.259540633364872016e-03,1.373936564620662154e-04,9.986025221370886662e-01,5.392435934123395699e-07,1.586702583121571675e-10
1.000000000000000000e+02,2.721428571428571530e+00,3.578177217233876357e-09,1.123584340029714626e-03,1.275735004967196097e-04,9.987482990974800856e-01,5.393251219586525494e-07,1.586942477589699286e-10
1.000000000000000000e+02,2.860714285714285765e+00,7.194237800273348747e-09,1.774313173351743786e-03,1.588087251002733913e-04,9.980663318139016971e-01,5.389348289712899935e-07,1.585794056173501418e-10
1.000000000000000000e+02,3.000000000000000000e+00,6.545181609047362425e-09,1.645183809089754545e-03,1.510874715460890669e-04,9.982031830033094577e-01,5.390122708920224499e-07,1.586021925910238555e-10
