{
	"JSON": {
		"ID": "1ee5ec0a-1830-63f5-ac3e-6f8ce4468546",
		"label": "",
		"comment": "UUID6 is used"
	},
	"group": {
		"number": "Group45",
		"author": [
			"Valentin Kaemmerer",
			"Noel Schwibus",
			"Daniel Burgos"
		],
		"experiment": "calorimetry",
		"testrig_number": "3"
	}
}
