{
	"JSON": {
		"ID": "1ee82ff1-caf0-6add-9f73-e7ed39734462",
		"label": "",
		"comment": "UUID6 is used"
	},
	"probe": {
		"mass cold": "137",
		"mass warm": "150",
		"unit": "gramm",
		"info": "think about all necessary things you should write down, that someone else can understand what you were doing"
	}
}