{
	"JSON": {
		"ID": "1ee82fef-d438-6db2-8b05-54d1a2bb2807",
		"label": "",
		"comment": "UUID6 is used"
	},
	"instrument": {
		"name": "raspberry_pi",
		"type": "single_board_computer",
		"manufacturer": "Raspberry Pi Foundation",
		"model": "Raspberry Pi 4 Model B Rev 1.5",
		"serial": "1000000004b43244",
		"operating_system": "Raspberry Pi OS",
		"comment": "to get model and serial number put this code in the terminal: cat /proc/cpuinfo"
	}
}