{
	"JSON": {
		"ID": "1ee82fa4-3a91-68d3-b598-11bfa8883bb0",
		"label": "",
		"comment": "UUID6 is used"
	},
	"sensor": {
		"name": "Temperature_Sensor",
		"type": "DS18B20",
		"manufacturer": "keyestudio",
		"serial": "3cf2f649ba33",
		"comment": "",
		"range": {
			"min": -55,
			"max": 125,
			"units": "degree_celsius"
		},
		"accuracy": {
			"value": 0.5,
			"type": "absolute",
			"unit": "degree_celsius"
		}
	}
}
