{
	"JSON": {
		"ID": "1ee82ffd-cd2f-6256-9992-b3c2d95034bb",
		"label": "",
		"comment": "UUID6 is used"
	},
    "comment": "here you can write down something important about this setup file",
    "info": "List below ALL components, you used in your experiment. By using the UUID there is no possibility to mix something up.",
	"setup": {
		"1ee82fd6-e27b-6896-8bc5-01b15ed65b6f": {
            "type": "group_info",
			"name": "group_info",
            "comment": ""
        },
		"1ee82fef-d438-6db2-8b05-54d1a2bb2807": {
            "type": "instrument",
			"name": "raspberry_pi",
            "comment": ""
        },
		"1ee82fa1-3f28-6fc6-a136-38b1937390db": {
            "type": "sensor",
			"name": "sensor_1",
            "comment": ""
        },
		"1ee82ff1-caf0-6add-9f73-e7ed39734462": {
            "type": "probe",
			"name": "probe_description",
            "comment": ""
        },
		"1ee82fa4-3a91-68d3-b598-11bfa8883bb0": {
			"type": "sensor",
			"name": "sensor_2",
			"comment": ""
		}
	}
}