{
    "assembly": {
        "uuid": "kpi-6f6c6563-4ab3-4b50-b726-72603c025a04",
        "properties": {
            "label": "car one",
            "manufaacturer": "Noah Waltmann",
            "mass [g]": 385.63,
            "price [Euro]": 48.44,
            "max delivery time [days]": 13,
            "avg delivery time [days]": 4.0,
            "component number": 36
        },
        "layer": "kpi-SYSTEM",
        "components": [],
        "assemblies": [
            {
                "assembly": {
                    "uuid": "kpi-d68cd995-8301-4894-b8f0-4bb6e240991e",
                    "properties": {
                        "label": "frame assembly",
                        "assembly_method": "stick together like lego Blocks"
                    },
                    "layer": "kpi-ASSEMBLY",
                    "components": [
                        {
                            "component": {
                                "uuid": "kpi-bf6d725c-c50c-43af-b8e7-88f63a0b3909",
                                "properties": {
                                    "label": "front frame left",
                                    "item number": 40490,
                                    "item description": "Technic, Liftarm Thick 1 x 9",
                                    "category": "frame",
                                    "price [Euro]": 0.02,
                                    "mass [g]": 2.59,
                                    "delivery time [days]": 3,
                                    "data source": "https://www.bricklink.com/v2/catalog/catalogitem.page?P=40490&name=Technic,%20Liftarm%20Thick%201%20x%209&category=%5BTechnic,%20Liftarm%5D#T=S&O={%22iconly%22:0}",
                                    "dimension [studs]": "1 x 9",
                                    "color": "grey"
                                },
                                "layer": "kpi-COMPONENT"
                            }
                        },
                        {
                            "component": {
                                "uuid": "kpi-472b6f13-5c4a-4499-b904-72f9c8ea2085",
                                "properties": {
                                    "label": "front frame right",
                                    "item number": 40490,
                                    "item description": "Technic, Liftarm Thick 1 x 9",
                                    "category": "frame",
                                    "price [Euro]": 0.02,
                                    "mass [g]": 2.59,
                                    "delivery time [days]": 3,
                                    "data source": "https://www.bricklink.com/v2/catalog/catalogitem.page?P=40490&name=Technic,%20Liftarm%20Thick%201%20x%209&category=%5BTechnic,%20Liftarm%5D#T=S&O={%22iconly%22:0}",
                                    "dimension [studs]": "1 x 9",
                                    "color": "grey"
                                },
                                "layer": "kpi-COMPONENT"
                            }
                        },
                        {
                            "component": {
                                "uuid": "kpi-1744f0e9-6509-4a16-aa50-14809d8a29c0",
                                "properties": {
                                    "label": "middle beam",
                                    "item number": 40490,
                                    "item description": "Technic, Liftarm Thick 1 x 9",
                                    "category": "frame",
                                    "price [Euro]": 0.02,
                                    "mass [g]": 2.59,
                                    "delivery time [days]": 3,
                                    "data source": "https://www.bricklink.com/v2/catalog/catalogitem.page?P=40490&name=Technic,%20Liftarm%20Thick%201%20x%209&category=%5BTechnic,%20Liftarm%5D#T=S&O={%22iconly%22:0}",
                                    "dimension [studs]": "1 x 9",
                                    "color": "grey"
                                },
                                "layer": "kpi-COMPONENT"
                            }
                        },
                        {
                            "component": {
                                "uuid": "kpi-b3528b90-4da3-42e1-9832-6112dda49f53",
                                "properties": {
                                    "label": "motor mount",
                                    "item number": 32524,
                                    "item description": "Technic, Liftarm Thick 1 x 7",
                                    "category": "frame",
                                    "price [Euro]": 0.01,
                                    "mass [g]": 1.79,
                                    "delivery time [days]": 3,
                                    "data source": "https://www.bricklink.com/v2/catalog/catalogitem.page?P=32524&name=Technic,%20Liftarm%20Thick%201%20x%207&category=%5BTechnic,%20Liftarm%5D#T=S&O={%22iconly%22:0}",
                                    "dimension [studs]": "1 x 7",
                                    "color": "grey"
                                },
                                "layer": "kpi-COMPONENT"
                            }
                        },
                        {
                            "component": {
                                "uuid": "kpi-222c66dc-6dd1-4800-a6b1-e8d75b7b6155",
                                "properties": {
                                    "label": "battery mount left",
                                    "item number": 32524,
                                    "item description": "Technic, Liftarm Thick 1 x 7",
                                    "category": "frame",
                                    "price [Euro]": 0.01,
                                    "mass [g]": 1.79,
                                    "delivery time [days]": 3,
                                    "data source": "https://www.bricklink.com/v2/catalog/catalogitem.page?P=32524&name=Technic,%20Liftarm%20Thick%201%20x%207&category=%5BTechnic,%20Liftarm%5D#T=S&O={%22iconly%22:0}",
                                    "dimension [studs]": "1 x 7",
                                    "color": "grey"
                                },
                                "layer": "kpi-COMPONENT"
                            }
                        },
                        {
                            "component": {
                                "uuid": "kpi-4e7cd866-899c-418c-9242-a726ce4fb3c5",
                                "properties": {
                                    "label": "battery mount right",
                                    "item number": 32524,
                                    "item description": "Technic, Liftarm Thick 1 x 7",
                                    "category": "frame",
                                    "price [Euro]": 0.01,
                                    "mass [g]": 1.79,
                                    "delivery time [days]": 3,
                                    "data source": "https://www.bricklink.com/v2/catalog/catalogitem.page?P=32524&name=Technic,%20Liftarm%20Thick%201%20x%207&category=%5BTechnic,%20Liftarm%5D#T=S&O={%22iconly%22:0}",
                                    "dimension [studs]": "1 x 7",
                                    "color": "grey"
                                },
                                "layer": "kpi-COMPONENT"
                            }
                        },
                        {
                            "component": {
                                "uuid": "kpi-c5e42fce-fc0b-4a07-8aea-42077e9821e3",
                                "properties": {
                                    "label": "main frame",
                                    "item number": 39790,
                                    "item description": "Technic, Liftarm, Modified Frame Thick 11 x 15 Open Center",
                                    "category": "frame",
                                    "price [Euro]": 2.19,
                                    "mass [g]": 12.96,
                                    "delivery time [days]": 3,
                                    "data source": "https://www.bricklink.com/v2/catalog/catalogitem.page?P=39790#T=C",
                                    "dimension [studs]": "11 x 15 x 1",
                                    "color": "grey"
                                },
                                "layer": "kpi-COMPONENT"
                            }
                        },
                        {
                            "component": {
                                "uuid": "kpi-89e5fd6c-f16f-4d70-8f62-416852e393a2",
                                "properties": {
                                    "label": "beam connector left",
                                    "item number": 55615,
                                    "item description": "Technic, Pin Connector Perpendicular 3 x 3 Bent with 4 Pins",
                                    "category": "frame",
                                    "price [Euro]": 0.1,
                                    "mass [g]": 1.9,
                                    "delivery time [days]": 5,
                                    "data source": "https://www.bricklink.com/v2/catalog/catalogitem.page?P=55615&name=Technic,%20Pin%20Connector%20Perpendicular%203%20x%203%20Bent%20with%204%20Pins&category=%5BTechnic,%20Connector%5D#T=S&O={%22iconly%22:0}",
                                    "dimension [studs]": "4 x 4 x 1",
                                    "color": "grey"
                                },
                                "layer": "kpi-COMPONENT"
                            }
                        },
                        {
                            "component": {
                                "uuid": "kpi-58ddc8c6-465f-4acf-a836-4021a2da94a3",
                                "properties": {
                                    "label": "beam connector right",
                                    "item number": 55615,
                                    "item description": "Technic, Pin Connector Perpendicular 3 x 3 Bent with 4 Pins",
                                    "category": "frame",
                                    "price [Euro]": 0.1,
                                    "mass [g]": 1.9,
                                    "delivery time [days]": 5,
                                    "data source": "https://www.bricklink.com/v2/catalog/catalogitem.page?P=55615&name=Technic,%20Pin%20Connector%20Perpendicular%203%20x%203%20Bent%20with%204%20Pins&category=%5BTechnic,%20Connector%5D#T=S&O={%22iconly%22:0}",
                                    "dimension [studs]": "4 x 4 x 1",
                                    "color": "grey"
                                },
                                "layer": "kpi-COMPONENT"
                            }
                        },
                        {
                            "component": {
                                "uuid": "kpi-ea5e3611-8f2c-41fc-bb7c-a19e5145d835",
                                "properties": {
                                    "label": "long pin one",
                                    "item number": 32556,
                                    "item description": "Technic, Pin 3L without Friction Ridges",
                                    "category": "frame",
                                    "price [Euro]": 0.1,
                                    "mass [g]": 0.25,
                                    "delivery time [days]": 3,
                                    "data source": "https://www.bricklink.com/v2/catalog/catalogitem.page?P=32556&name=Technic,%20Pin%203L%20without%20Friction%20Ridges&category=%5BTechnic,%20Pin%5D#T=S&O={%22iconly%22:0}",
                                    "dimension [studs]": 1,
                                    "color": "grey"
                                },
                                "layer": "kpi-COMPONENT"
                            }
                        },
                        {
                            "component": {
                                "uuid": "kpi-3d408058-b13d-4294-91cc-922246405c61",
                                "properties": {
                                    "label": "long pin two",
                                    "item number": 32556,
                                    "item description": "Technic, Pin 3L without Friction Ridges",
                                    "category": "frame",
                                    "price [Euro]": 0.1,
                                    "mass [g]": 0.25,
                                    "delivery time [days]": 3,
                                    "data source": "https://www.bricklink.com/v2/catalog/catalogitem.page?P=32556&name=Technic,%20Pin%203L%20without%20Friction%20Ridges&category=%5BTechnic,%20Pin%5D#T=S&O={%22iconly%22:0}",
                                    "dimension [studs]": 1,
                                    "color": "grey"
                                },
                                "layer": "kpi-COMPONENT"
                            }
                        },
                        {
                            "component": {
                                "uuid": "kpi-350913d0-320f-4ca0-93b8-5db46bcc8c9d",
                                "properties": {
                                    "label": "long pin three",
                                    "item number": 32556,
                                    "item description": "Technic, Pin 3L without Friction Ridges",
                                    "category": "frame",
                                    "price [Euro]": 0.1,
                                    "mass [g]": 0.25,
                                    "delivery time [days]": 3,
                                    "data source": "https://www.bricklink.com/v2/catalog/catalogitem.page?P=32556&name=Technic,%20Pin%203L%20without%20Friction%20Ridges&category=%5BTechnic,%20Pin%5D#T=S&O={%22iconly%22:0}",
                                    "dimension [studs]": 1,
                                    "color": "grey"
                                },
                                "layer": "kpi-COMPONENT"
                            }
                        },
                        {
                            "component": {
                                "uuid": "kpi-a1bcd1cc-b374-4c01-8417-5666d47b702c",
                                "properties": {
                                    "label": "long pin four",
                                    "item number": 32556,
                                    "item description": "Technic, Pin 3L without Friction Ridges",
                                    "category": "frame",
                                    "price [Euro]": 0.1,
                                    "mass [g]": 0.25,
                                    "delivery time [days]": 3,
                                    "data source": "https://www.bricklink.com/v2/catalog/catalogitem.page?P=32556&name=Technic,%20Pin%203L%20without%20Friction%20Ridges&category=%5BTechnic,%20Pin%5D#T=S&O={%22iconly%22:0}",
                                    "dimension [studs]": 1,
                                    "color": "grey"
                                },
                                "layer": "kpi-COMPONENT"
                            }
                        },
                        {
                            "component": {
                                "uuid": "kpi-b70418ce-e38a-4420-b17a-02f090e330da",
                                "properties": {
                                    "label": "pin one",
                                    "item number": 3673,
                                    "item description": "Technic, Pin without Friction Ridges",
                                    "category": "frame",
                                    "price [Euro]": 0.01,
                                    "mass [g]": 0.16,
                                    "delivery time [days]": 3,
                                    "data source": "https://www.bricklink.com/v2/catalog/catalogitem.page?P=3673&name=Technic,%20Pin%20without%20Friction%20Ridges&category=%5BTechnic,%20Pin%5D#T=S&O={%22iconly%22:0}",
                                    "dimension [studs]": 1,
                                    "color": "grey"
                                },
                                "layer": "kpi-COMPONENT"
                            }
                        },
                        {
                            "component": {
                                "uuid": "kpi-f640d248-e5b9-4dd6-b5d8-e9940294cfb9",
                                "properties": {
                                    "label": "pin two",
                                    "item number": 3673,
                                    "item description": "Technic, Pin without Friction Ridges",
                                    "category": "frame",
                                    "price [Euro]": 0.01,
                                    "mass [g]": 0.16,
                                    "delivery time [days]": 3,
                                    "data source": "https://www.bricklink.com/v2/catalog/catalogitem.page?P=3673&name=Technic,%20Pin%20without%20Friction%20Ridges&category=%5BTechnic,%20Pin%5D#T=S&O={%22iconly%22:0}",
                                    "dimension [studs]": 1,
                                    "color": "grey"
                                },
                                "layer": "kpi-COMPONENT"
                            }
                        },
                        {
                            "component": {
                                "uuid": "kpi-be54ee4b-3e16-4e43-b60c-b9fb10841e7c",
                                "properties": {
                                    "label": "pin three",
                                    "item number": 3673,
                                    "item description": "Technic, Pin without Friction Ridges",
                                    "category": "frame",
                                    "price [Euro]": 0.01,
                                    "mass [g]": 0.16,
                                    "delivery time [days]": 3,
                                    "data source": "https://www.bricklink.com/v2/catalog/catalogitem.page?P=3673&name=Technic,%20Pin%20without%20Friction%20Ridges&category=%5BTechnic,%20Pin%5D#T=S&O={%22iconly%22:0}",
                                    "dimension [studs]": 1,
                                    "color": "grey"
                                },
                                "layer": "kpi-COMPONENT"
                            }
                        },
                        {
                            "component": {
                                "uuid": "kpi-551de5cd-1d25-4218-b769-0e39115e0257",
                                "properties": {
                                    "label": "pin four",
                                    "item number": 3673,
                                    "item description": "Technic, Pin without Friction Ridges",
                                    "category": "frame",
                                    "price [Euro]": 0.01,
                                    "mass [g]": 0.16,
                                    "delivery time [days]": 3,
                                    "data source": "https://www.bricklink.com/v2/catalog/catalogitem.page?P=3673&name=Technic,%20Pin%20without%20Friction%20Ridges&category=%5BTechnic,%20Pin%5D#T=S&O={%22iconly%22:0}",
                                    "dimension [studs]": 1,
                                    "color": "grey"
                                },
                                "layer": "kpi-COMPONENT"
                            }
                        },
                        {
                            "component": {
                                "uuid": "kpi-9d1c35bd-734a-4815-8384-404c72496a55",
                                "properties": {
                                    "label": "pin five",
                                    "item number": 3673,
                                    "item description": "Technic, Pin without Friction Ridges",
                                    "category": "frame",
                                    "price [Euro]": 0.01,
                                    "mass [g]": 0.16,
                                    "delivery time [days]": 3,
                                    "data source": "https://www.bricklink.com/v2/catalog/catalogitem.page?P=3673&name=Technic,%20Pin%20without%20Friction%20Ridges&category=%5BTechnic,%20Pin%5D#T=S&O={%22iconly%22:0}",
                                    "dimension [studs]": 1,
                                    "color": "grey"
                                },
                                "layer": "kpi-COMPONENT"
                            }
                        },
                        {
                            "component": {
                                "uuid": "kpi-2bba572f-fd67-4aa7-9747-616ce3e07af7",
                                "properties": {
                                    "label": "pin six",
                                    "item number": 3673,
                                    "item description": "Technic, Pin without Friction Ridges",
                                    "category": "frame",
                                    "price [Euro]": 0.01,
                                    "mass [g]": 0.16,
                                    "delivery time [days]": 3,
                                    "data source": "https://www.bricklink.com/v2/catalog/catalogitem.page?P=3673&name=Technic,%20Pin%20without%20Friction%20Ridges&category=%5BTechnic,%20Pin%5D#T=S&O={%22iconly%22:0}",
                                    "dimension [studs]": 1,
                                    "color": "grey"
                                },
                                "layer": "kpi-COMPONENT"
                            }
                        },
                        {
                            "component": {
                                "uuid": "kpi-5a4e2129-0710-4a9d-a779-7d270bb84aaa",
                                "properties": {
                                    "label": "pin seven",
                                    "item number": 3673,
                                    "item description": "Technic, Pin without Friction Ridges",
                                    "category": "frame",
                                    "price [Euro]": 0.01,
                                    "mass [g]": 0.16,
                                    "delivery time [days]": 3,
                                    "data source": "https://www.bricklink.com/v2/catalog/catalogitem.page?P=3673&name=Technic,%20Pin%20without%20Friction%20Ridges&category=%5BTechnic,%20Pin%5D#T=S&O={%22iconly%22:0}",
                                    "dimension [studs]": 1,
                                    "color": "grey"
                                },
                                "layer": "kpi-COMPONENT"
                            }
                        },
                        {
                            "component": {
                                "uuid": "kpi-26bcbe0d-2d65-4d1c-bfd1-6e82a79ab01b",
                                "properties": {
                                    "label": "pin eight",
                                    "item number": 3673,
                                    "item description": "Technic, Pin without Friction Ridges",
                                    "category": "frame",
                                    "price [Euro]": 0.01,
                                    "mass [g]": 0.16,
                                    "delivery time [days]": 3,
                                    "data source": "https://www.bricklink.com/v2/catalog/catalogitem.page?P=3673&name=Technic,%20Pin%20without%20Friction%20Ridges&category=%5BTechnic,%20Pin%5D#T=S&O={%22iconly%22:0}",
                                    "dimension [studs]": 1,
                                    "color": "grey"
                                },
                                "layer": "kpi-COMPONENT"
                            }
                        }
                    ],
                    "assemblies": []
                }
            },
            {
                "assembly": {
                    "uuid": "kpi-8175274c-bb5b-4473-8b1a-21325d97aa82",
                    "properties": {
                        "label": "chassis assembly",
                        "assembly_method": "stick together like lego Blocks"
                    },
                    "layer": "kpi-ASSEMBLY",
                    "components": [
                        {
                            "component": {
                                "uuid": "kpi-1ba81f54-6c3e-4030-b0f1-0ed423b4ca44",
                                "properties": {
                                    "label": "front axle",
                                    "item number": 3708,
                                    "item description": "Axle 12 studs",
                                    "category": "axle",
                                    "price [Euro]": 0.02,
                                    "mass [g]": 1.82,
                                    "delivery time [days]": 7,
                                    "data source": "https://www.bricklink.com/v2/catalog/catalogitem.page?P=3708#T=S&O={%22iconly%22:0}",
                                    "dimension [studs]": 12,
                                    "color": "grey"
                                },
                                "layer": "kpi-COMPONENT"
                            }
                        },
                        {
                            "component": {
                                "uuid": "kpi-acb9abdd-297a-40fb-bb98-cacb5d75f8d0",
                                "properties": {
                                    "label": "back axle",
                                    "item number": 50451,
                                    "item description": "Axle 16 studs",
                                    "category": "axle",
                                    "price [Euro]": 0.75,
                                    "mass [g]": 2.37,
                                    "delivery time [days]": 3,
                                    "data source": "https://www.bricklink.com/v2/catalog/catalogitem.page?P=50451#T=S&O={%22iconly%22:0}",
                                    "dimension [studs]": 16,
                                    "color": "grey"
                                },
                                "layer": "kpi-COMPONENT"
                            }
                        },
                        {
                            "component": {
                                "uuid": "kpi-61c29fe3-178d-4263-91b2-21ce65602dbd",
                                "properties": {
                                    "label": "front bush left",
                                    "item number": 3713,
                                    "item description": "Technic Bush",
                                    "category": "frame",
                                    "price [Euro]": 0.01,
                                    "mass [g]": 0.14,
                                    "delivery time [days]": 3,
                                    "data source": "https://www.bricklink.com/v2/catalog/catalogitem.page?P=3713&name=Technic%20Bush&category=%5BTechnic%5D#T=S&O={%22iconly%22:0}",
                                    "dimension [studs]": 1,
                                    "color": "white"
                                },
                                "layer": "kpi-COMPONENT"
                            }
                        },
                        {
                            "component": {
                                "uuid": "kpi-da9c92e0-3300-4b5d-bbb7-1b7c97892ada",
                                "properties": {
                                    "label": "front bush right",
                                    "item number": 3713,
                                    "item description": "Technic Bush",
                                    "category": "frame",
                                    "price [Euro]": 0.01,
                                    "mass [g]": 0.14,
                                    "delivery time [days]": 3,
                                    "data source": "https://www.bricklink.com/v2/catalog/catalogitem.page?P=3713&name=Technic%20Bush&category=%5BTechnic%5D#T=S&O={%22iconly%22:0}",
                                    "dimension [studs]": 1,
                                    "color": "white"
                                },
                                "layer": "kpi-COMPONENT"
                            }
                        },
                        {
                            "component": {
                                "uuid": "kpi-4eaae060-bab3-4621-bf7f-4ace69cfdc06",
                                "properties": {
                                    "label": "back bush left",
                                    "item number": 3713,
                                    "item description": "Technic Bush",
                                    "category": "frame",
                                    "price [Euro]": 0.01,
                                    "mass [g]": 0.14,
                                    "delivery time [days]": 3,
                                    "data source": "https://www.bricklink.com/v2/catalog/catalogitem.page?P=3713&name=Technic%20Bush&category=%5BTechnic%5D#T=S&O={%22iconly%22:0}",
                                    "dimension [studs]": 1,
                                    "color": "white"
                                },
                                "layer": "kpi-COMPONENT"
                            }
                        },
                        {
                            "component": {
                                "uuid": "kpi-daa16de3-9c05-479d-b2a9-ed25f907a6b9",
                                "properties": {
                                    "label": "back bush right",
                                    "item number": 3713,
                                    "item description": "Technic Bush",
                                    "category": "frame",
                                    "price [Euro]": 0.01,
                                    "mass [g]": 0.14,
                                    "delivery time [days]": 3,
                                    "data source": "https://www.bricklink.com/v2/catalog/catalogitem.page?P=3713&name=Technic%20Bush&category=%5BTechnic%5D#T=S&O={%22iconly%22:0}",
                                    "dimension [studs]": 1,
                                    "color": "white"
                                },
                                "layer": "kpi-COMPONENT"
                            }
                        },
                        {
                            "component": {
                                "uuid": "kpi-18fba273-7f17-473e-9528-fecb8affd9a2",
                                "properties": {
                                    "label": "wheel one",
                                    "item number": "41896c04",
                                    "item description": "wheel 56",
                                    "category": "wheel",
                                    "related items": 41897,
                                    "price [Euro]": 0.45,
                                    "mass [g]": 23.0,
                                    "delivery time [days]": 5,
                                    "data source": "https://www.bricklink.com/v2/catalog/catalogitem.page?P=41896c04#T=C",
                                    "diameter [mm]": 56.0,
                                    "color": "white"
                                },
                                "layer": "kpi-COMPONENT"
                            }
                        },
                        {
                            "component": {
                                "uuid": "kpi-2ca3f2d1-842e-4fc7-ae9f-2df0c0ac4684",
                                "properties": {
                                    "label": "wheel two",
                                    "item number": "41896c04",
                                    "item description": "wheel 56",
                                    "category": "wheel",
                                    "related items": 41897,
                                    "price [Euro]": 0.45,
                                    "mass [g]": 23.0,
                                    "delivery time [days]": 5,
                                    "data source": "https://www.bricklink.com/v2/catalog/catalogitem.page?P=41896c04#T=C",
                                    "diameter [mm]": 56.0,
                                    "color": "white"
                                },
                                "layer": "kpi-COMPONENT"
                            }
                        },
                        {
                            "component": {
                                "uuid": "kpi-685d8bb7-23c0-4c57-9e9b-f3e47d572a59",
                                "properties": {
                                    "label": "wheel three",
                                    "item number": "41896c04",
                                    "item description": "wheel 56",
                                    "category": "wheel",
                                    "related items": 41897,
                                    "price [Euro]": 0.45,
                                    "mass [g]": 23.0,
                                    "delivery time [days]": 5,
                                    "data source": "https://www.bricklink.com/v2/catalog/catalogitem.page?P=41896c04#T=C",
                                    "diameter [mm]": 56.0,
                                    "color": "white"
                                },
                                "layer": "kpi-COMPONENT"
                            }
                        },
                        {
                            "component": {
                                "uuid": "kpi-683ce61f-dc47-4db6-85d5-a2cc122e9e69",
                                "properties": {
                                    "label": "wheel four",
                                    "item number": "41896c04",
                                    "item description": "wheel 56",
                                    "category": "wheel",
                                    "related items": 41897,
                                    "price [Euro]": 0.45,
                                    "mass [g]": 23.0,
                                    "delivery time [days]": 5,
                                    "data source": "https://www.bricklink.com/v2/catalog/catalogitem.page?P=41896c04#T=C",
                                    "diameter [mm]": 56.0,
                                    "color": "white"
                                },
                                "layer": "kpi-COMPONENT"
                            }
                        }
                    ],
                    "assemblies": []
                }
            },
            {
                "assembly": {
                    "uuid": "kpi-aadca6ec-cec1-474e-9b43-720e741bd78c",
                    "properties": {
                        "label": "drive assembly",
                        "assembly_method": "stick together like lego Blocks"
                    },
                    "layer": "kpi-ASSEMBLY",
                    "components": [
                        {
                            "component": {
                                "uuid": "kpi-5abbef20-0664-4fc8-a614-ace7cc4ffb3f",
                                "properties": {
                                    "label": "battery",
                                    "item number": "8881-1",
                                    "item description": "Power Functions Battery Box",
                                    "category": "battery",
                                    "price [Euro]": 12,
                                    "mass [g]": 179.4,
                                    "delivery time [days]": 3,
                                    "data source": "https://www.bricklink.com/v2/catalog/catalogitem.page?S=8881-1#T=S&O={%22iconly%22:0}",
                                    "output voltage [V]": 9.0,
                                    "dimensions [cm]": "8,8 x 6,3 x 3,2",
                                    "color": "grey"
                                },
                                "layer": "kpi-COMPONENT"
                            }
                        },
                        {
                            "component": {
                                "uuid": "kpi-3003b531-4f8d-449e-92c1-dd740ec1b60c",
                                "properties": {
                                    "label": "motor",
                                    "item number": "8882-1",
                                    "item description": "Power Functions XL-Motor",
                                    "category": "motor",
                                    "related items": 8881,
                                    "idle current [mA]": 80,
                                    "idle speed [rev per min]": 220,
                                    "locking torque [Ncm]": 40,
                                    "price [Euro]": 30,
                                    "mass [g]": 72.85,
                                    "delivery time [days]": 3,
                                    "data source": "https://www.bricklink.com/v2/catalog/catalogitem.page?S=8882-1&name=Power%20Functions%20XL-Motor&category=%5BPower%20Functions%5D#T=S&O={%22iconly%22:0}",
                                    "compatible battery": 8881,
                                    "input voltage [V]": 9,
                                    "dimensions [cm]": "13.6 x 12.2 x 3.9",
                                    "color": "grey"
                                },
                                "layer": "kpi-COMPONENT"
                            }
                        }
                    ],
                    "assemblies": [
                        {
                            "assembly": {
                                "uuid": "kpi-7eead25d-b20f-4c6f-8dea-adb66a203708",
                                "properties": {
                                    "label": "gearbox subassembly",
                                    "assembly_method": "stick together like lego blocks"
                                },
                                "layer": "kpi-SUBASSEMBLY",
                                "components": [
                                    {
                                        "component": {
                                            "uuid": "kpi-dc4a081e-2510-4cbf-85bf-8e9afdb52d39",
                                            "properties": {
                                                "label": "driveshaft",
                                                "item number": 23948,
                                                "item description": "Axle 11 studs",
                                                "category": "axle",
                                                "price [Euro]": 0.15,
                                                "mass [g]": 1.65,
                                                "delivery time [days]": 3,
                                                "data source": "https://www.bricklink.com/v2/catalog/catalogitem.page?P=23948#T=S&O={%22iconly%22:0}",
                                                "dimension [studs]": 11,
                                                "color": "grey"
                                            },
                                            "layer": "kpi-COMPONENT"
                                        }
                                    },
                                    {
                                        "component": {
                                            "uuid": "kpi-cbe36336-fff6-4e4f-9504-4cc66be876fd",
                                            "properties": {
                                                "label": "gear one",
                                                "item number": 32269,
                                                "item description": "Gear 20 Tooth",
                                                "category": "gear",
                                                "price [Euro]": 0.36,
                                                "mass [g]": 1.4,
                                                "delivery time [days]": 13,
                                                "data source": "https://www.bricklink.com/v2/catalog/catalogitem.page?P=32269#T=C",
                                                "color": "white"
                                            },
                                            "layer": "kpi-COMPONENT"
                                        }
                                    },
                                    {
                                        "component": {
                                            "uuid": "kpi-dfe5be6d-fca3-4b99-b6cb-613ed0bbd340",
                                            "properties": {
                                                "label": "gear two",
                                                "item number": 32269,
                                                "item description": "Gear 20 Tooth",
                                                "category": "gear",
                                                "price [Euro]": 0.36,
                                                "mass [g]": 1.4,
                                                "delivery time [days]": 13,
                                                "data source": "https://www.bricklink.com/v2/catalog/catalogitem.page?P=32269#T=C",
                                                "color": "white"
                                            },
                                            "layer": "kpi-COMPONENT"
                                        }
                                    }
                                ],
                                "assemblies": []
                            }
                        }
                    ]
                }
            }
        ]
    }
}