{
	"JSON": {
		"ID": "1ee57b37-1b00-6b47-b00e-8332e0df15ea",
		"label": "PDC011",
		"comment": "UUID6 is used"
	},
	"probe": {
		"material": "Messing",
		"mass": {
			"value": 0,
			"unit": "gramm",
			"uncertainty": {
				"value": 679,
				"type": "absolut",
				"unit": "gramm"
			}
		},
		"dimensions": {
			"height": {
				"value": 40,
				"unit": "millimeter"
			},
			"diameter": {
				"value": 60,
				"unit": "millimeter"
			},
			"volume": {
				"value": 80570,
				"unit": "cubic millimeter"
			}
		}
	}
}