{
	"JSON": {
		"ID": "1ee5ec0a-1830-63f5-ac3e-6f8ce4468546",
		"label": "",
		"comment": "UUID6 is used"
	},
	"group": {
		"number": "Group13",
		"author": [
			"David_Buening_member01",
			"Noah_Waltmann_member02",
			"xxxxxxxxxxxx_member03"
		],
		"experiment": "calorimetry",
		"testrig_number": "2"
	}
}
