{
	"JSON": {
		"ID": "1ee7d44b-07b6-6af8-adbe-d5e4818c9942",
		"label": "PDC028",
		"comment": "UUID6 is used"
	},
	"probe": {
		"material": "PA_6_6",
		"mass": {
			"value": 0,
			"unit": "gramm",
			"uncertainty": {
				"value": 93,
				"type": "absolut",
				"unit": "gramm"
			}
		},
		"dimensions": {
			"height": {
				"value": 40,
				"unit": "millimeter"
			},
			"diameter": {
				"value": 60,
				"unit": "millimeter"
			},
			"volume": {
				"value": 80570,
				"unit": "cubic millimeter"
			}
		}
	}
}