{
	"JSON": {
		"ID": "1ee82690-bbb7-62cc-a6a2-bb1204f8e66a",
		"label": "",
		"comment": "UUID6 is used"
	},
	"sensor": {
		"name": "Temperature_Sensor",
		"type": "DS18B20",
		"manufacturer": "keyestudio",
		"serial": "3ce1045793f0",
		"comment": "",
		"range": {
			"min": -55,
			"max": 125,
			"units": "degree_celcius"
		},
		"accuracy": {
			"value": 0.5,
			"type": "absolute",
			"unit": "degree_celsius"
		}
	}
}

