{
	"JSON": {
		"ID": "1ee82f61-76bc-60d0-9bc0-ef93ac4acfbf",
		"label": "",
		"comment": "UUID6 is used"
	},
    "comment": "here you can write down something important about this setup file",
    "info": "List below ALL components, you used in your experiment. By using the UUID there is no possibility to mix something up.",
	"setup": {
         "1ee82f5c-0031-67b2-af74-1ac8e8039219": {
            "type": "group_info",
			"name": "group_info",
            "comment": ""
        },
		"1ee82f65-1281-6d61-ab1f-55eeff55b557": {
            "type": "instrument",
			"name": "raspberry_pi",
            "comment": ""
        },
		"1ee82690-bbb7-62cc-a6a2-bb1204f8e66a": {
            "type": "sensor",
			"name": "temperature_hot_cup",
            "comment": ""
        },
        "1ee82692-6912-6f1a-8e6a-cd1047f3d786": {
            "type": "sensor",
			"name": "temperature_cold_cup",
            "comment": ""
        },
		"1ee82f5e-c2d8-6316-a26a-0534c4e5161b": {
            "type": "probe",
			"name": "heat_capacity_probe",
            "comment": "200 ml hot water and 200 ml cold water"
        }
	}
}