{
	"JSON": {
		"ID": "1ee82f5c-0031-67b2-af74-1ac8e8039219",
		"label": "",
		"comment": "UUID6 is used"
	},
	"group": {
		"number": "13",
		"author": "Noah Waltmann",
		"experiment": "Kalorimetrie Kuechentisch"
	}
}