{
	"JSON": {
		"ID": "1eeafc6b-18d9-603c-b588-fc9a093ec219",
		"label": "",
		"comment": "UUID6 is used"
	},
	"probe": {
		"name": "Huawei-P30-Lite",
		"type": "Handy",
		"manufacturer": "Huawei"
	}
}
