{
	"JSON": {
		"ID": "1ee8208d-52e2-6049-86d9-bd272fd8c829",
		"label": "",
		"comment": "UUID6 is used"
	},
    "comment": "here you can write down something important about this setup file",
    "info": "List below ALL components, you used in your experiment. By using the UUID there is no possibility to mix something up.",
	"setup": {
		"1ee848ea-a8ce-68b0-812d-c5537e93bfb5": {
            "type": "group_info",
			"name": "group_18",
            "comment": ""
        },
		"1ee848eb-633e-6df1-8b33-83b69a1e6eff": {
            "type": "instrument",
			"name": "raspberry_pi",
            "comment": ""
        },
		"1ee8208f-4247-6be9-a8da-c74b4386659c": {
            "type": "sensor1",
			"name": "use this field to name the sensor, that it is understandable where you used it. Exapmle: temperature_cup or temperature_environment",
            "comment": ""
        },
		"1ee848f7-7c67-6f2d-adeb-5a41c855702c": {
            "type": "probe",
			"name": "probe_newton",
            "comment": ""
        },
		"1ee82e2c-9cef-605f-a738-9532adab09b0": {
			"type": "sensor2",
			"name": "",
			"comment": ""
		}
	}
}