{
    "assembly": {
        "uuid": "kpi-5c0c4ccd-66bf-4202-8e66-614a841902ee",
        "properties": {
            "label": "AutoEins",
            "price [Euro]": 50.701,
            "mass [g]": 156.82999999999998,
            "delivery time [days]": 11,
            "price[Euro]": 50.701,
            "mass[g]": 156.82999999999998,
            "delivery time[days]": 11,
            "Gesamtpreis": 50.701,
            "Gesamtmasse": 156.82999999999998,
            "Lieferzeit": 11
        },
        "layer": "kpi-SYSTEM",
        "components": [],
        "assemblies": [
            {
                "assembly": {
                    "uuid": "kpi-8bad49b7-1e63-4720-ad34-b5eb56010cb5",
                    "properties": {
                        "label": "fahrwerk assembly"
                    },
                    "layer": "kpi-SUBASSEMBLY",
                    "components": [
                        {
                            "component": {
                                "uuid": "kpi-611797c5-ebc6-4c8b-b940-409f3e1c0450",
                                "properties": {
                                    "label": "front axle",
                                    "item number": 60485,
                                    "item description": "Axle 9 studs",
                                    "category": "axle",
                                    "price [Euro]": 0.01,
                                    "mass [g]": 1.3,
                                    "delivery time [days]": 7,
                                    "data source": "https://www.bricklink.com/v2/catalog/catalogitem.page?P=60485#T=S&O={%22iconly%22:0}",
                                    "dimension [studs]": 9
                                },
                                "layer": "kpi-COMPONENT"
                            }
                        },
                        {
                            "component": {
                                "uuid": "kpi-1d5b5049-c292-4a9e-9dc1-c0e55a7c3f63",
                                "properties": {
                                    "label": "back axle",
                                    "item number": 60485,
                                    "item description": "Axle 9 studs",
                                    "category": "axle",
                                    "price [Euro]": 0.01,
                                    "mass [g]": 1.3,
                                    "delivery time [days]": 7,
                                    "data source": "https://www.bricklink.com/v2/catalog/catalogitem.page?P=60485#T=S&O={%22iconly%22:0}",
                                    "dimension [studs]": 9
                                },
                                "layer": "kpi-COMPONENT"
                            }
                        },
                        {
                            "component": {
                                "uuid": "kpi-436d377b-c638-4ced-b2c6-ebf402d2a2ae",
                                "properties": {
                                    "label": "front left wheel",
                                    "item number": "3482c01",
                                    "item description": "wheel 24",
                                    "category": "wheel",
                                    "related items": 3483,
                                    "price [Euro]": 0.01,
                                    "mass [g]": 3.0,
                                    "delivery time [days]": 5,
                                    "data source": "https://www.bricklink.com/v2/catalog/catalogitem.page?P=3482c01#T=C",
                                    "diameter [mm]": 24.0
                                },
                                "layer": "kpi-COMPONENT"
                            }
                        },
                        {
                            "component": {
                                "uuid": "kpi-cf8dbf18-16c6-4190-a61f-e53e31853df1",
                                "properties": {
                                    "label": "front right wheel",
                                    "item number": "3482c01",
                                    "item description": "wheel 24",
                                    "category": "wheel",
                                    "related items": 3483,
                                    "price [Euro]": 0.01,
                                    "mass [g]": 3.0,
                                    "delivery time [days]": 5,
                                    "data source": "https://www.bricklink.com/v2/catalog/catalogitem.page?P=3482c01#T=C",
                                    "diameter [mm]": 24.0
                                },
                                "layer": "kpi-COMPONENT"
                            }
                        },
                        {
                            "component": {
                                "uuid": "kpi-4a5a9134-dc78-4e02-8e2e-a714b9e1f450",
                                "properties": {
                                    "label": "back right wheel",
                                    "item number": "3482c01",
                                    "item description": "wheel 24",
                                    "category": "wheel",
                                    "related items": 3483,
                                    "price [Euro]": 0.01,
                                    "mass [g]": 3.0,
                                    "delivery time [days]": 5,
                                    "data source": "https://www.bricklink.com/v2/catalog/catalogitem.page?P=3482c01#T=C",
                                    "diameter [mm]": 24.0
                                },
                                "layer": "kpi-COMPONENT"
                            }
                        },
                        {
                            "component": {
                                "uuid": "kpi-bc3ad7c0-5343-46ae-9b94-5fb621c147e1",
                                "properties": {
                                    "label": "back left wheel",
                                    "item number": "3482c01",
                                    "item description": "wheel 24",
                                    "category": "wheel",
                                    "related items": 3483,
                                    "price [Euro]": 0.01,
                                    "mass [g]": 3.0,
                                    "delivery time [days]": 5,
                                    "data source": "https://www.bricklink.com/v2/catalog/catalogitem.page?P=3482c01#T=C",
                                    "diameter [mm]": 24.0
                                },
                                "layer": "kpi-COMPONENT"
                            }
                        },
                        {
                            "component": {
                                "uuid": "kpi-d4a8d1e3-0d7d-4331-b4cb-96c28144f52d",
                                "properties": {
                                    "label": "reifenzahnrad hinten rechts",
                                    "item number": 3647,
                                    "item description": "Gear 8 Tooth",
                                    "category": "gear",
                                    "price [Euro]": 0.14,
                                    "mass [g]": 0.16,
                                    "delivery time [days]": 11,
                                    "data source": "https://www.bricklink.com/v2/catalog/catalogitem.page?P=3647#T=C"
                                },
                                "layer": "kpi-COMPONENT"
                            }
                        }
                    ],
                    "assemblies": []
                }
            },
            {
                "assembly": {
                    "uuid": "kpi-a8da7bdd-8e1e-4bef-a3fa-9df4eb3c04c5",
                    "properties": {
                        "label": "antrieb assembly"
                    },
                    "layer": "kpi-SUBASSEMBLY",
                    "components": [
                        {
                            "component": {
                                "uuid": "kpi-532162cb-86ff-4e5a-b11c-d3d807571139",
                                "properties": {
                                    "label": "motor",
                                    "item number": "8883-1",
                                    "item description": "Power Functions M-Motor",
                                    "category": "motor",
                                    "related items": "8881, 8878, 45517, 88000",
                                    "idle current [mA]": 65,
                                    "idle speed [rev per min]": 405,
                                    "locking torque [Ncm]": 11,
                                    "price [Euro]": 20,
                                    "mass [g]": 35.0,
                                    "delivery time [days]": 5,
                                    "data source": "https://www.bricklink.com/v2/catalog/catalogitem.page?S=8883-1&name=Power%20Functions%20M-Motor&category=%5BPower%20Functions%5D#T=S&O={%22iconly%22:0}",
                                    "compatible battery": "8881, 8878, 45517, 88000",
                                    "input voltage [V]": 9,
                                    "dimensions [cm]": "13.8 x 11.9 x 2.3"
                                },
                                "layer": "kpi-COMPONENT"
                            }
                        },
                        {
                            "component": {
                                "uuid": "kpi-ccac7c16-0815-4a98-91e7-33814bd4e9c2",
                                "properties": {
                                    "label": "motor axle",
                                    "item number": 32073,
                                    "item description": "Axle 5 studs",
                                    "category": "axle",
                                    "price [Euro]": 0.001,
                                    "mass [g]": 0.66,
                                    "delivery time [days]": 3,
                                    "data source": "https://www.bricklink.com/v2/catalog/catalogitem.page?P=32073#T=S&O={%22iconly%22:0}",
                                    "dimension [studs]": 5
                                },
                                "layer": "kpi-COMPONENT"
                            }
                        },
                        {
                            "component": {
                                "uuid": "kpi-c295590f-6512-43b1-adc4-402e71a66572",
                                "properties": {
                                    "label": "motorzahnrad",
                                    "item number": 3648,
                                    "item description": "Gear 24 Tooth",
                                    "category": "gear",
                                    "price [Euro]": 0.32,
                                    "mass [g]": 1.17,
                                    "delivery time [days]": 11,
                                    "data source": "https://www.bricklink.com/v2/catalog/catalogitem.page?P=3648#T=C",
                                    "color": "pink"
                                },
                                "layer": "kpi-COMPONENT"
                            }
                        },
                        {
                            "component": {
                                "uuid": "kpi-e4f025f7-5fd6-480b-a1be-854f97a93e74",
                                "properties": {
                                    "label": "batterie",
                                    "item number": "88000-1",
                                    "item description": "Lego AAA Battery Box",
                                    "category": "battery",
                                    "price [Euro]": 30,
                                    "mass [g]": 97.24,
                                    "delivery time [days]": 6,
                                    "data source": "https://www.brickowl.de/catalog/lego-aaa-battery-box-set-88000",
                                    "output voltage [V]": 9.0,
                                    "dimensions [cm]": "15,3 x 15,1 x 3,9"
                                },
                                "layer": "kpi-COMPONENT"
                            }
                        }
                    ],
                    "assemblies": []
                }
            },
            {
                "assembly": {
                    "uuid": "kpi-9c05770c-71b3-43dd-b61c-85bcf6ba73e3",
                    "properties": {
                        "label": "fahrgestell assembly"
                    },
                    "layer": "kpi-SUBASSEMBLY",
                    "components": [
                        {
                            "component": {
                                "uuid": "kpi-7df049ea-f882-4875-a6df-0fb12c3c7e81",
                                "properties": {
                                    "label": "frame",
                                    "item number": 32532,
                                    "item description": "Technic, Brick 6 x 8 Open Center",
                                    "category": "frame",
                                    "price [Euro]": 0.18,
                                    "mass [g]": 8.0,
                                    "delivery time [days]": 3,
                                    "data source": "https://www.bricklink.com/v2/catalog/catalogitem.page?P=32532#T=C",
                                    "dimension [studs]": "6 x 8 x 1",
                                    "color": "orange"
                                },
                                "layer": "kpi-COMPONENT"
                            }
                        }
                    ],
                    "assemblies": []
                }
            }
        ]
    }
}