{
	"JSON": {
		"ID": "1ee4d7f7-565f-6f82-8db2-2cf8a3c4cb18",
		"label": "",
		"comment": "UUID6 is used"
	},
	"group": {
		"number": "48",
		"author": "Gruppe 48",
		"members": "Ole Quiring, Christoph Fröhlich, Nilay Kuslugil",
		"experiment": "lavalrotor",
		"testrig_number": "03"
	}
}