{
	"JSON": {
		"ID": "1ee8466a-0d2a-6858-9abd-b96d03edee10",
		"label": "setup_testrig_4",
		"comment": "UUID6 is used"
	},
	"setup": {
		"1ee4d7f7-565f-6f82-8db2-2cf8a3c4cb18": {
            "type": "group",
			"name": "group_info",
            "comment": ""
        },
		"1ee823ce-82b9-6d4e-a621-60af4e6f5cc1": {
            "type": "instrument",
			"name": "raspberry_pi",
            "comment": ""
        },
		"1ee823b6-50dc-6670-aea5-35f6dd717e83": {
            "type": "instrument",
			"name": "motor_controller",
            "comment": ""
        },
		"1ee8239b-46ec-63dc-8aa4-b8751ac37fd3": {
            "type": "actor",
			"name": "brushless_DC_motor",
            "comment": ""
        },
		"1ee823d6-3d20-6332-83f5-6876b760dcf3": {
            "type": "sensor",
			"name": "accelerometer",
            "range": {
                    "min": -4,
                    "max": 4,
                    "units": "standard_gravity"
            },
            "frequency": {
				    "value": 800,
				    "units": "Hertz"
			},
            "comment": ""
        },
		"1ee82409-3a6d-68d1-a097-317cd197966f": {
            "type": "part",
			"name": "disk_1",
            "comment": ""
        },
		"1ee5305e-4442-69e5-983a-4ea49e1bf973": {
            "type": "part",
			"name": "shaft",
            "comment": ""
        },
		"1ee82416-7ea1-6536-8659-54e002633707": {
            "type": "part",
			"name": "touchdown_bearing_1",
            "comment": ""
        },
		"1ee823a5-7a86-66bd-aa74-aa5aa4e2ec74": {
            "type": "instrument",
			"name": "digital_analog_converter",
            "comment": ""
        }
	}
}