{
	"JSON": {
		"ID": "1ee823a3-c13f-68e5-b5c0-f853874e2380",
		"label": "",
		"comment": "UUID6 is used"
	},
	"instrument": {
		"name": "digital analog converter",
		"type": "MCP4725",
		"model": "com-dac01",
		"manufacturer": "joy-it",
		"bus": "i2c",
		"voltage": "5"
	}
}
