{
	"JSON": {
		"ID": "1ee5ec04-30cd-678f-a64b-0ce7544ef5e8",
		"label": "",
		"comment": "UUID6 is used"
	},
	"sensor": {
		"name": "Temperature_Sensor",
		"type": "DS18B20",
		"manufacturer": "keyestudio",
		"serial": "3cc2e3814cc6",
		"comment": "",
		"range": {
			"min": -55,
			"max": 125,
			"units": "degree_celsius"
		},
		"accuracy": {
			"value": 0.5,
			"type": "absolute",
			"unit": "degree_celsius"
		}
	}
}
