<?xml version="1.0" encoding="UTF-8" standalone="no"?>
<svg
   xmlns:dc="http://purl.org/dc/elements/1.1/"
   xmlns:cc="http://creativecommons.org/ns#"
   xmlns:rdf="http://www.w3.org/1999/02/22-rdf-syntax-ns#"
   xmlns:svg="http://www.w3.org/2000/svg"
   xmlns="http://www.w3.org/2000/svg"
   xmlns:sodipodi="http://sodipodi.sourceforge.net/DTD/sodipodi-0.dtd"
   xmlns:inkscape="http://www.inkscape.org/namespaces/inkscape"
   width="160mm"
   height="90mm"
   viewBox="0 0 160 90"
   version="1.1"
   id="svg8"
   inkscape:version="1.0.1 (3bc2e813f5, 2020-09-07)"
   sodipodi:docname="background_circuit2.svg">
  <defs
     id="defs2" />
  <sodipodi:namedview
     id="base"
     pagecolor="#ffffff"
     bordercolor="#666666"
     borderopacity="1.0"
     inkscape:pageopacity="0.0"
     inkscape:pageshadow="2"
     inkscape:zoom="1.979899"
     inkscape:cx="289.70915"
     inkscape:cy="228.20604"
     inkscape:document-units="mm"
     inkscape:current-layer="layer1"
     inkscape:document-rotation="0"
     showgrid="true"
     inkscape:snap-global="true"
     inkscape:snap-object-midpoints="true"
     inkscape:window-width="1920"
     inkscape:window-height="1017"
     inkscape:window-x="-8"
     inkscape:window-y="-8"
     inkscape:window-maximized="1">
    <inkscape:grid
       type="xygrid"
       id="grid849"
       units="mm"
       spacingx="1"
       spacingy="1" />
  </sodipodi:namedview>
  <metadata
     id="metadata5">
    <rdf:RDF>
      <cc:Work
         rdf:about="">
        <dc:format>image/svg+xml</dc:format>
        <dc:type
           rdf:resource="http://purl.org/dc/dcmitype/StillImage" />
        <dc:title></dc:title>
      </cc:Work>
    </rdf:RDF>
  </metadata>
  <g
     inkscape:label="Layer 1"
     inkscape:groupmode="layer"
     id="layer1">
    <rect
       style="fill:#191921;fill-opacity:1;stroke:none;stroke-width:1.065"
       id="rect833"
       width="160"
       height="90"
       x="-1.2633475e-16"
       y="0" />
    <path
       style="fill:none;stroke:#1c1c27;stroke-width:0.365;stroke-linecap:butt;stroke-linejoin:miter;stroke-miterlimit:4;stroke-dasharray:none;stroke-opacity:1"
       d="m 0,5 h 15 l 5,5 h 10"
       id="path851"
       sodipodi:nodetypes="cccc" />
    <path
       style="fill:#191921;fill-opacity:1;stroke:#1c1c27;stroke-width:0.365001;stroke-linecap:butt;stroke-linejoin:miter;stroke-miterlimit:4;stroke-dasharray:none;stroke-opacity:1"
       d="M -1,14 H 9 l 20,19 v 6"
       id="path851-8"
       sodipodi:nodetypes="cccc" />
    <circle
       style="fill:#1c1c27;fill-opacity:1;stroke:#1c1c27;stroke-width:0.365001;stroke-miterlimit:4;stroke-dasharray:none;stroke-opacity:1"
       id="path853-3"
       cx="29"
       cy="39"
       r="0.48216528" />
    <path
       style="fill:none;stroke:#1c1c27;stroke-width:0.365001;stroke-linecap:butt;stroke-linejoin:miter;stroke-miterlimit:4;stroke-dasharray:none;stroke-opacity:1"
       d="M 20,17 H 32 L 55,40"
       id="path851-2"
       sodipodi:nodetypes="ccc" />
    <path
       style="fill:none;stroke:#1c1c27;stroke-width:0.365001;stroke-linecap:butt;stroke-linejoin:miter;stroke-miterlimit:4;stroke-dasharray:none;stroke-opacity:1"
       d="M 45,-2e-7 V 17.706606 L 47,20"
       id="path851-2-9"
       sodipodi:nodetypes="ccc" />
    <path
       style="fill:none;stroke:#1c1c27;stroke-width:0.365001;stroke-linecap:butt;stroke-linejoin:miter;stroke-miterlimit:4;stroke-dasharray:none;stroke-opacity:1"
       d="M 75,0 V 17.706606 30"
       id="path851-2-9-9"
       sodipodi:nodetypes="ccc" />
    <path
       style="fill:none;stroke:#1c1c27;stroke-width:0.365001;stroke-linecap:butt;stroke-linejoin:miter;stroke-miterlimit:4;stroke-dasharray:none;stroke-opacity:1"
       d="M 73.022478,-0.05997445 V 11.756205 L 73,20"
       id="path851-2-9-7"
       sodipodi:nodetypes="ccc" />
    <path
       style="fill:none;stroke:#1c1c27;stroke-width:0.365001;stroke-linecap:butt;stroke-linejoin:miter;stroke-miterlimit:4;stroke-dasharray:none;stroke-opacity:1"
       d="M 121,-1 111,9 v 3"
       id="path851-2-9-7-1"
       sodipodi:nodetypes="ccc" />
    <path
       style="fill:none;stroke:#1c1c27;stroke-width:0.365001;stroke-linecap:butt;stroke-linejoin:miter;stroke-miterlimit:4;stroke-dasharray:none;stroke-opacity:1"
       d="M -12,19 H 5.0113036 L 16,29"
       id="path851-2-8"
       sodipodi:nodetypes="ccc" />
    <path
       style="fill:none;stroke:#1c1c27;stroke-width:0.365001;stroke-linecap:butt;stroke-linejoin:miter;stroke-miterlimit:4;stroke-dasharray:none;stroke-opacity:1"
       d="M -4.9999998,47 H 34.962798 L 39,51"
       id="path851-2-5"
       sodipodi:nodetypes="ccc" />
    <path
       style="fill:none;stroke:#1c1c27;stroke-width:0.365001;stroke-linecap:butt;stroke-linejoin:miter;stroke-miterlimit:4;stroke-dasharray:none;stroke-opacity:1"
       d="M 71.000002,49.999998 V 80.691447 102"
       id="path851-2-9-9-3"
       sodipodi:nodetypes="ccc" />
    <path
       style="fill:none;stroke:#1c1c27;stroke-width:0.365001;stroke-linecap:butt;stroke-linejoin:miter;stroke-miterlimit:4;stroke-dasharray:none;stroke-opacity:1"
       d="m 65.01124,78.969764 v 11.816179 l -0.02248,8.243796"
       id="path851-2-9-7-18"
       sodipodi:nodetypes="ccc" />
    <circle
       style="fill:#e8f1fa;fill-opacity:1;stroke:#1c1c27;stroke-width:0.365001;stroke-miterlimit:4;stroke-dasharray:none;stroke-opacity:1"
       id="path853-4-6-4-4"
       cx="69"
       cy="92"
       r="0.48216528" />
    <circle
       style="fill:#e8f1fa;fill-opacity:1;stroke:#1c1c27;stroke-width:0.365001;stroke-miterlimit:4;stroke-dasharray:none;stroke-opacity:1"
       id="path853-4-6-2-4"
       cx="71"
       cy="102"
       r="0.48216528" />
    <path
       style="fill:none;stroke:#1c1c27;stroke-width:0.365001;stroke-linecap:butt;stroke-linejoin:miter;stroke-miterlimit:4;stroke-dasharray:none;stroke-opacity:1"
       d="M -19.962799,55 H 20 l 10,10 h 15"
       id="path851-2-5-1"
       sodipodi:nodetypes="cccc" />
    <path
       style="fill:none;stroke:#1c1c27;stroke-width:0.365001;stroke-linecap:butt;stroke-linejoin:miter;stroke-miterlimit:4;stroke-dasharray:none;stroke-opacity:1"
       d="M -1,71 4,66"
       id="path851-2-58"
       sodipodi:nodetypes="cc" />
    <path
       style="fill:none;stroke:#1c1c27;stroke-width:0.365001;stroke-linecap:butt;stroke-linejoin:miter;stroke-miterlimit:4;stroke-dasharray:none;stroke-opacity:1"
       d="M 4.5,90.5 15,80 h 3.993304 L 26,74"
       id="path851-2-58-3"
       sodipodi:nodetypes="cccc" />
    <path
       style="fill:none;stroke:#1c1c27;stroke-width:0.365001;stroke-linecap:butt;stroke-linejoin:miter;stroke-miterlimit:4;stroke-dasharray:none;stroke-opacity:1"
       d="M 37.5,90 V 80 l 3,-3 H 49"
       id="path851-2-3"
       sodipodi:nodetypes="cccc" />
    <path
       style="fill:none;stroke:#1c1c27;stroke-width:0.365001;stroke-linecap:butt;stroke-linejoin:miter;stroke-miterlimit:4;stroke-dasharray:none;stroke-opacity:1"
       d="m 54,54 5,6.035418 V 72.96663"
       id="path851-2-94"
       sodipodi:nodetypes="ccc" />
    <path
       style="fill:none;stroke:#1c1c27;stroke-width:0.365001;stroke-linecap:butt;stroke-linejoin:miter;stroke-miterlimit:4;stroke-dasharray:none;stroke-opacity:1"
       d="M 62.02248,-15.059975 V -3.243796 L 62.00416,3.4743152 58,7"
       id="path851-2-9-7-18-7"
       sodipodi:nodetypes="cccc" />
    <circle
       style="fill:#1c1c27;fill-opacity:1;stroke:#1c1c27;stroke-width:0.365001;stroke-miterlimit:4;stroke-dasharray:none;stroke-opacity:1"
       id="path853-4-6-2-7"
       cx="111"
       cy="12"
       r="0.48216528" />
    <path
       style="fill:none;stroke:#1c1c27;stroke-width:0.365001;stroke-linecap:butt;stroke-linejoin:miter;stroke-miterlimit:4;stroke-dasharray:none;stroke-opacity:1"
       d="m 161,52 h -21 l -3,3 v 6"
       id="path851-2-5-0"
       sodipodi:nodetypes="cccc" />
    <circle
       style="fill:#1c1c27;fill-opacity:1;stroke:#1c1c27;stroke-width:0.365001;stroke-miterlimit:4;stroke-dasharray:none;stroke-opacity:1"
       id="path853-4-6-2-7-2"
       cx="137"
       cy="61"
       r="0.48216528" />
    <path
       style="fill:none;stroke:#1c1c27;stroke-width:0.365001;stroke-linecap:butt;stroke-linejoin:miter;stroke-miterlimit:4;stroke-dasharray:none;stroke-opacity:1"
       d="m 145,77.999999 10,10 V 91"
       id="path851-2-9-7-1-5"
       sodipodi:nodetypes="ccc" />
    <circle
       style="fill:#1c1c27;fill-opacity:1;stroke:#1c1c27;stroke-width:0.365001;stroke-miterlimit:4;stroke-dasharray:none;stroke-opacity:1"
       id="path853-4-6-2-7-2-2"
       cx="145"
       cy="78"
       r="0.48216528" />
    <path
       style="fill:none;stroke:#1c1c27;stroke-width:0.365001;stroke-linecap:butt;stroke-linejoin:miter;stroke-miterlimit:4;stroke-dasharray:none;stroke-opacity:1"
       d="M 106.02673,-1.4354767 96.026727,8.564523 96,15 91,19"
       id="path851-2-9-7-1-4"
       sodipodi:nodetypes="cccc" />
    <circle
       style="fill:#1c1c27;fill-opacity:1;stroke:#1c1c27;stroke-width:0.365001;stroke-miterlimit:4;stroke-dasharray:none;stroke-opacity:1"
       id="path853-4-6-2-7-5"
       cx="91"
       cy="19"
       r="0.48216528" />
    <path
       style="fill:none;stroke:#1c1c27;stroke-width:0.365001;stroke-linecap:butt;stroke-linejoin:miter;stroke-miterlimit:4;stroke-dasharray:none;stroke-opacity:1"
       d="M 128.01124,-0.03023633 V 11.785943 L 128,20 118,30 h -6"
       id="path851-2-9-7-9"
       sodipodi:nodetypes="ccccc" />
    <circle
       style="fill:#1c1c27;fill-opacity:1;stroke:#1c1c27;stroke-width:0.365001;stroke-miterlimit:4;stroke-dasharray:none;stroke-opacity:1"
       id="path853-4-6-2-7-54"
       cx="112"
       cy="30"
       r="0.48216528" />
    <path
       style="fill:none;stroke:#1c1c27;stroke-width:0.365001;stroke-linecap:butt;stroke-linejoin:miter;stroke-miterlimit:4;stroke-dasharray:none;stroke-opacity:1"
       d="m 75.01124,84.969763 v 11.816179 l -0.02248,8.243798"
       id="path851-2-9-7-18-0"
       sodipodi:nodetypes="ccc" />
    <circle
       style="fill:#1c1c27;fill-opacity:1;stroke:#1c1c27;stroke-width:0.365001;stroke-miterlimit:4;stroke-dasharray:none;stroke-opacity:1"
       id="path853"
       cx="30"
       cy="10"
       r="0.48216528" />
    <circle
       style="fill:#1c1c27;fill-opacity:1;stroke:#1c1c27;stroke-width:0.365001;stroke-miterlimit:4;stroke-dasharray:none;stroke-opacity:1"
       id="path853-0"
       cx="20"
       cy="17"
       r="0.48216528" />
    <circle
       style="fill:#1c1c27;fill-opacity:1;stroke:#1c1c27;stroke-width:0.365001;stroke-miterlimit:4;stroke-dasharray:none;stroke-opacity:1"
       id="path853-4-6"
       cx="47"
       cy="20"
       r="0.48216528" />
    <circle
       style="fill:#1c1c27;fill-opacity:1;stroke:#1c1c27;stroke-width:0.365001;stroke-miterlimit:4;stroke-dasharray:none;stroke-opacity:1"
       id="path853-4-6-4"
       cx="73"
       cy="20"
       r="0.48216528" />
    <circle
       style="fill:#1c1c27;fill-opacity:1;stroke:#1c1c27;stroke-width:0.365001;stroke-miterlimit:4;stroke-dasharray:none;stroke-opacity:1"
       id="path853-4-8"
       cx="16"
       cy="29"
       r="0.48216528" />
    <circle
       style="fill:#1c1c27;fill-opacity:1;stroke:#1c1c27;stroke-width:0.365001;stroke-miterlimit:4;stroke-dasharray:none;stroke-opacity:1"
       id="path853-3-4"
       cx="39"
       cy="51"
       r="0.48216528" />
    <circle
       style="fill:#1c1c27;fill-opacity:1;stroke:#1c1c27;stroke-width:0.365001;stroke-miterlimit:4;stroke-dasharray:none;stroke-opacity:1"
       id="path853-4-6-2-42"
       cx="71"
       cy="50"
       r="0.48216528" />
    <circle
       style="fill:#1c1c27;fill-opacity:1;stroke:#1c1c27;stroke-width:0.365001;stroke-miterlimit:4;stroke-dasharray:none;stroke-opacity:1"
       id="path853-4-6-2-6"
       cx="65"
       cy="79"
       r="0.48216528" />
    <circle
       style="fill:#1c1c27;fill-opacity:1;stroke:#1c1c27;stroke-width:0.365001;stroke-miterlimit:4;stroke-dasharray:none;stroke-opacity:1"
       id="path853-3-4-8"
       cx="45"
       cy="65"
       r="0.48216528" />
    <circle
       style="fill:#1c1c27;fill-opacity:1;stroke:#1c1c27;stroke-width:0.365001;stroke-miterlimit:4;stroke-dasharray:none;stroke-opacity:1"
       id="path853-4-8-6"
       cx="4"
       cy="66"
       r="0.48216528" />
    <circle
       style="fill:#1c1c27;fill-opacity:1;stroke:#1c1c27;stroke-width:0.365001;stroke-miterlimit:4;stroke-dasharray:none;stroke-opacity:1"
       id="path853-3-4-8-1"
       cx="26"
       cy="74"
       r="0.48216528" />
    <circle
       style="fill:#1c1c27;fill-opacity:1;stroke:#1c1c27;stroke-width:0.365001;stroke-miterlimit:4;stroke-dasharray:none;stroke-opacity:1"
       id="path853-3-4-8-3"
       cx="49"
       cy="77"
       r="0.48216528" />
    <circle
       style="fill:#1c1c27;fill-opacity:1;stroke:#1c1c27;stroke-width:0.365001;stroke-miterlimit:4;stroke-dasharray:none;stroke-opacity:1"
       id="path853-3-3"
       cx="59"
       cy="73"
       r="0.48216528" />
    <circle
       style="fill:#1c1c27;fill-opacity:1;stroke:#1c1c27;stroke-width:0.365001;stroke-miterlimit:4;stroke-dasharray:none;stroke-opacity:1"
       id="path853-3-1"
       cx="54"
       cy="54"
       r="0.48216528" />
    <circle
       style="fill:#1c1c27;fill-opacity:1;stroke:#1c1c27;stroke-width:0.365001;stroke-miterlimit:4;stroke-dasharray:none;stroke-opacity:1"
       id="path853-4-6-4-0"
       cx="58"
       cy="7"
       r="0.48216528" />
    <circle
       style="fill:#1c1c27;fill-opacity:1;stroke:#1c1c27;stroke-width:0.365001;stroke-miterlimit:4;stroke-dasharray:none;stroke-opacity:1"
       id="path853-4-64"
       cx="55"
       cy="40"
       r="0.48216528" />
    <circle
       style="fill:#1c1c27;fill-opacity:1;stroke:#1c1c27;stroke-width:0.365001;stroke-miterlimit:4;stroke-dasharray:none;stroke-opacity:1"
       id="path853-4-6-2"
       cx="75"
       cy="30"
       r="0.48216528" />
    <circle
       style="fill:#1c1c27;fill-opacity:1;stroke:#1c1c27;stroke-width:0.365001;stroke-miterlimit:4;stroke-dasharray:none;stroke-opacity:1"
       id="path853-4-6-2-6-4"
       cx="75"
       cy="85"
       r="0.48216528" />
    <path
       style="fill:none;stroke:#1c1c27;stroke-width:0.365001;stroke-linecap:butt;stroke-linejoin:miter;stroke-miterlimit:4;stroke-dasharray:none;stroke-opacity:1"
       d="m 161.02673,18.564523 -10,10 L 142,38"
       id="path851-2-9-7-1-53"
       sodipodi:nodetypes="ccc" />
    <circle
       style="fill:#1c1c27;fill-opacity:1;stroke:#1c1c27;stroke-width:0.365001;stroke-miterlimit:4;stroke-dasharray:none;stroke-opacity:1"
       id="path853-4-6-2-7-2-4"
       cx="142"
       cy="38"
       r="0.48216528" />
    <path
       style="fill:none;stroke:#1c1c27;stroke-width:0.365001;stroke-linecap:butt;stroke-linejoin:miter;stroke-miterlimit:4;stroke-dasharray:none;stroke-opacity:1"
       d="m 100,42 h 21 l 4,4 h 35.9628 L 165,50"
       id="path851-2-5-9"
       sodipodi:nodetypes="ccccc" />
    <circle
       style="fill:#1c1c27;fill-opacity:1;stroke:#1c1c27;stroke-width:0.365001;stroke-miterlimit:4;stroke-dasharray:none;stroke-opacity:1"
       id="path853-4-6-2-7-2-8"
       cx="100"
       cy="42"
       r="0.48216528" />
    <path
       style="fill:none;stroke:#1c1c27;stroke-width:0.365001;stroke-linecap:butt;stroke-linejoin:miter;stroke-miterlimit:4;stroke-dasharray:none;stroke-opacity:1"
       d="M 144.98029,-8.0984733 V 3.7177058 l -0.0183,6.7181112 -4.00418,3.525685"
       id="path851-2-9-7-18-7-1"
       sodipodi:nodetypes="cccc" />
    <path
       style="fill:none;stroke:#1c1c27;stroke-width:0.365001;stroke-linecap:butt;stroke-linejoin:miter;stroke-miterlimit:4;stroke-dasharray:none;stroke-opacity:1"
       d="m 136,24.332421 v 4.365645 L 130,35"
       id="path851-2-9-7-18-7-1-2"
       sodipodi:nodetypes="ccc" />
    <path
       style="fill:none;stroke:#1c1c27;stroke-width:0.365001;stroke-linecap:butt;stroke-linejoin:miter;stroke-miterlimit:4;stroke-dasharray:none;stroke-opacity:1"
       d="m 90,45 15.03692,15 H 125 l 10,10 v 21.000001"
       id="path851-2-9-7-1-5-5"
       sodipodi:nodetypes="ccccc" />
    <path
       style="fill:none;stroke:#1c1c27;stroke-width:0.365001;stroke-linecap:butt;stroke-linejoin:miter;stroke-miterlimit:4;stroke-dasharray:none;stroke-opacity:1"
       d="M 90,95 V 83.183821 l -0.01124,-8.214058 -9.999999,-10"
       id="path851-2-9-7-9-0"
       sodipodi:nodetypes="cccc" />
    <path
       style="fill:none;stroke:#1c1c27;stroke-width:0.365001;stroke-linecap:butt;stroke-linejoin:miter;stroke-miterlimit:4;stroke-dasharray:none;stroke-opacity:1"
       d="m 110.02673,91.435477 -10,-10 L 100,72"
       id="path851-2-9-7-1-1"
       sodipodi:nodetypes="ccc" />
    <path
       style="fill:none;stroke:#1c1c27;stroke-width:0.365001;stroke-linecap:butt;stroke-linejoin:miter;stroke-miterlimit:4;stroke-dasharray:none;stroke-opacity:1"
       d="M 117,91 V 79.183821 l -0.0183,-6.718112 -4.00418,-3.525685"
       id="path851-2-9-7-18-7-1-28"
       sodipodi:nodetypes="cccc" />
  </g>
  <g
     inkscape:groupmode="layer"
     id="layer2"
     inkscape:label="Layer 2">
    <circle
       style="fill:#1c1c27;fill-opacity:1;stroke:#1c1c27;stroke-width:0.365001;stroke-miterlimit:4;stroke-dasharray:none;stroke-opacity:1"
       id="path853-4-6-2-7-8"
       cx="141"
       cy="14"
       r="0.48216528" />
    <circle
       style="fill:#1c1c27;fill-opacity:1;stroke:#1c1c27;stroke-width:0.365001;stroke-miterlimit:4;stroke-dasharray:none;stroke-opacity:1"
       id="path853-4-6-2-7-8-8"
       cx="130"
       cy="35"
       r="0.48216528" />
    <circle
       style="fill:#1c1c27;fill-opacity:1;stroke:#1c1c27;stroke-width:0.365001;stroke-miterlimit:4;stroke-dasharray:none;stroke-opacity:1"
       id="path853-4-6-2-7-8-7"
       cx="136"
       cy="24"
       r="0.48216528" />
    <circle
       style="fill:#1c1c27;fill-opacity:1;stroke:#1c1c27;stroke-width:0.365001;stroke-miterlimit:4;stroke-dasharray:none;stroke-opacity:1"
       id="path853-4-6-2-7-2-0"
       cx="90"
       cy="45"
       r="0.48216528" />
    <circle
       style="fill:#1c1c27;fill-opacity:1;stroke:#1c1c27;stroke-width:0.365001;stroke-miterlimit:4;stroke-dasharray:none;stroke-opacity:1"
       id="path853-4-6-2-6-4-4"
       cx="80"
       cy="65"
       r="0.48216528" />
    <circle
       style="fill:#1c1c27;fill-opacity:1;stroke:#1c1c27;stroke-width:0.365001;stroke-miterlimit:4;stroke-dasharray:none;stroke-opacity:1"
       id="path853-4-6-2-6-4-4-0-4"
       cx="113"
       cy="69"
       r="0.48216528" />
    <circle
       style="fill:#1c1c27;fill-opacity:1;stroke:#1c1c27;stroke-width:0.365001;stroke-miterlimit:4;stroke-dasharray:none;stroke-opacity:1"
       id="path853-4-6-2-6-4-4-0"
       cx="100"
       cy="72"
       r="0.48216528" />
  </g>
</svg>
