{
    "modelsDir": "src/models",
    "outputDir": "target/agent",
    "rootModel":"torcs.agent.torcsAgent",
    "generators": ["emadlcpp", "roscpp"],
    "emadlBackend": "GLUON",
    "updateRate": 200
}
