<?xml version="1.0" encoding="UTF-8" standalone="no"?>
<!DOCTYPE svg PUBLIC "-//W3C//DTD SVG 1.1//EN"
 "http://www.w3.org/Graphics/SVG/1.1/DTD/svg11.dtd">
<!-- Generated by graphviz version 5.0.0 (20220707.1540)
 -->
<!-- Title: dependencies Pages: 1 -->
<svg width="456pt" height="174pt"
 viewBox="0.00 0.00 456.00 173.80" xmlns="http://www.w3.org/2000/svg" xmlns:xlink="http://www.w3.org/1999/xlink">
<g id="graph0" class="graph" transform="scale(1 1) rotate(0) translate(4 169.8)">
<title>dependencies</title>
<polygon fill="white" stroke="transparent" points="-4,4 -4,-169.8 452,-169.8 452,4 -4,4"/>
<text text-anchor="middle" x="224" y="-8.2" font-family="sans-serif" font-size="14.00">dependencies</text>
<g id="clust1" class="cluster">
<title>cluster_PProjectOverviewModule</title>
<polygon fill="none" stroke="black" stroke-dasharray="1,5" points="8,-32.8 8,-157.8 440,-157.8 440,-32.8 8,-32.8"/>
</g>
<g id="clust4" class="cluster">
<title>cluster_PProjectOverviewModule_imports</title>
<polygon fill="none" stroke="black" points="208,-40.8 208,-92.8 432,-92.8 432,-40.8 208,-40.8"/>
</g>
<g id="clust2" class="cluster">
<title>cluster_PProjectOverviewModule_declarations</title>
<polygon fill="none" stroke="black" points="16,-40.8 16,-92.8 200,-92.8 200,-40.8 16,-40.8"/>
</g>
<!-- CProjectsTableComponent -->
<g id="node1" class="node">
<title>CProjectsTableComponent</title>
<polygon fill="#ffffb3" stroke="black" points="191.64,-84.8 24.36,-84.8 24.36,-48.8 191.64,-48.8 191.64,-84.8"/>
<text text-anchor="middle" x="108" y="-62.6" font-family="Times,serif" font-size="14.00">CProjectsTableComponent</text>
</g>
<!-- PProjectOverviewModule -->
<g id="node2" class="node">
<title>PProjectOverviewModule</title>
<polygon fill="#8dd3c7" stroke="black" points="295.19,-149.8 292.19,-153.8 271.19,-153.8 268.19,-149.8 132.81,-149.8 132.81,-113.8 295.19,-113.8 295.19,-149.8"/>
<text text-anchor="middle" x="214" y="-127.6" font-family="Times,serif" font-size="14.00">PProjectOverviewModule</text>
</g>
<!-- CProjectsTableComponent&#45;&gt;PProjectOverviewModule -->
<g id="edge1" class="edge">
<title>CProjectsTableComponent&#45;&gt;PProjectOverviewModule</title>
<path fill="none" stroke="black" d="M162.36,-84.91C162.36,-84.91 162.36,-103.79 162.36,-103.79"/>
<polygon fill="black" stroke="black" points="158.86,-103.79 162.36,-113.79 165.86,-103.79 158.86,-103.79"/>
</g>
<!-- PProjectOverviewRoutingModule -->
<g id="node3" class="node">
<title>PProjectOverviewRoutingModule</title>
<polygon fill="#8dd3c7" stroke="black" points="423.81,-84.8 420.81,-88.8 399.81,-88.8 396.81,-84.8 216.19,-84.8 216.19,-48.8 423.81,-48.8 423.81,-84.8"/>
<text text-anchor="middle" x="320" y="-62.6" font-family="Times,serif" font-size="14.00">PProjectOverviewRoutingModule</text>
</g>
<!-- PProjectOverviewRoutingModule&#45;&gt;PProjectOverviewModule -->
<g id="edge2" class="edge">
<title>PProjectOverviewRoutingModule&#45;&gt;PProjectOverviewModule</title>
<path fill="none" stroke="black" d="M255.72,-84.91C255.72,-84.91 255.72,-103.79 255.72,-103.79"/>
<polygon fill="black" stroke="black" points="252.22,-103.79 255.72,-113.79 259.22,-103.79 252.22,-103.79"/>
</g>
</g>
</svg>
