{
  "$schema": "https://json-schema.org/draft/2020-12/schema",
  "$id": "https://nfdi4ing.de/turntable/mapping",
  "type": "object",
  "properties": {
    "clientId": {
      "type": "string"
    },
    "baseUrl": {
      "type": "string"
    },
    "mappings": {
      "type": "object",
      "properties": {
        "doipOpHello": {
          "$ref": "#/$defs/httpCall"
        },
        "doipOpCreate": {
          "$ref": "#/$defs/httpCall"
        },
        "doipOpRetrieve": {
          "type": "array",
          "items": {
            "$ref": "#/$defs/httpCall"
          }
        },
        "doipOpUpdate": {
          "$ref": "#/$defs/httpCall"
        },
        "doipOpDelete": {
          "$ref": "#/$defs/httpCall"
        },
        "doipOpSearch": {
          "$ref": "#/$defs/httpCall"
        },
        "doipOpListOperations": {
          "type": "object"
        },
        "doipOpValidate": {
          "$ref": "#/$defs/httpCall"
        }
      },
      "required": [
        "0.DOIP/Op.Create",
        "0.DOIP/Op.Retrieve"
      ]
    }
  },
  "required": [
    "clientId",
    "mappings"
  ],
  "additionalProperties": false,
  "$defs": {
    "classMapper": {
      "type": "object",
      "properties": {
        "className": {
          "type": "string"
        },
        "mapperClass": {
          "type": "string"
        }
      },
      "required": [
        "className",
        "mapperClass"
      ],
      "additionalProperties": true
    },
    "body": {
      "description": "Put all your elements you want to forward here and their representative in the propritary server.",
      "type": "object",
      "properties": {
        "metadata": {
          "type": "string"
        }
      },
      "additionalProperties": {
        "type": "string"
      }
    },
    "header": {
      "description": "Any header variable which should be added to the HTTP request. In case of an empty value the value will fetched by the response and should be forwarded to the DOIP client.",
      "type": "object",
      "additionalProperties": {
        "type": "string"
      }
    },
    "httpCall": {
      "type": "object",
      "properties": {
        "label": {
          "title": "Label",
          "description": "In case of RETRIEVE 'label' should hold the label of the element this http call is used for.",
          "type": "string"
        },
        "requestUrl": {
          "type": "string"
        },
        "verb": {
          "description": "Use one of the HTTP request methods. See: https://developer.mozilla.org/en-US/docs/Web/HTTP/Methods",
          "type": "string"
        },
        "mimetype": {
          "type": "string"
        },
        "contenttype": {
          "type": "string"
        },
        "body": {
          "$ref": "#/$defs/body"
        },
        "header": {
          "$ref": "#/$defs/header"
        },
        "metadata": {
          "$ref": "#/$defs/classMapper"
        },
        "response": {
          "$ref": "#/$defs/classMapper"
        }
      },
      "required": [
        "requestUrl",
        "verb"],
      "additionalProperties": false
    }
  }
}
