{
  "clientId": "metastore_Schema_ID",
  "baseUrl": "https://nfdi4ing.datamanager.kit.edu/metastore/api/v1",
  "mappings": {
    "doipOpHello": {
      "requestUrl": "https://nfdi4ing.datamanager.kit.edu/metastore/api/v1/schemas"
    },
    "doipOpCreate": {
      "label": "anyLabel",
      "requestUrl": "https://nfdi4ing.datamanager.kit.edu/metastore/api/v1/schemas",
      "verb": "POST",
      "mimetype": "application/json",
      "body": {
        "metadata": "record",
        "additionalProperties": {
          "schema": "schema"
        }
      },
      "header": {
        "additionalProperties": {
          "ETag": ""
        }
      },
      "metadata": {
        "className": "edu.kit.turntable.mapping.SchemaRecordSchema",
        "mapperClass": "edu.kit.metadatahub.doip.mapping.metadata.impl.SchemaRecordMapper"
      },
      "response": {
        "className": "edu.kit.turntable.mapping.SchemaRecordSchema",
        "mapperClass": "edu.kit.metadatahub.doip.mapping.metadata.impl.SchemaRecordMapper"
      }
    },
    "doipOpRetrieve": [
      {
        "label": "schema",
        "requestUrl": "https://nfdi4ing.datamanager.kit.edu/metastore/api/v1/schemas/{url_encode(targetId)}",
        "verb": "GET",
        "mimetype": "text/plain"
      },
      {
        "label": "metadata",
        "requestUrl": "https://nfdi4ing.datamanager.kit.edu/metastore/api/v1/schemas/{url_encode(targetId)}",
        "verb": "GET",
        "mimetype": "application/vnd.datamanager.schema-record+json",
        "header": {
          "additionalProperties": {
            "ETag": ""
          }
        },
        "response": {
          "className": "edu.kit.turntable.mapping.SchemaRecordSchema",
          "mapperClass": "edu.kit.metadatahub.doip.mapping.metadata.impl.SchemaRecordMapper"
        }
      }
    ],
    "doipOpUpdate": {
      "requestUrl": "https://nfdi4ing.datamanager.kit.edu/metastore/api/v1/schemas/{url_encode(targetId)}",
      "verb": "PUT",
      "mimetype": "application/json",
      "body": {
        "metadata": "record",
        "additionalProperties": {
          "schema": "schema"
        }
      },
      "header": {
        "additionalProperties": {
          "If-Match": ""
        }
      },
      "metadata": {
        "className": "edu.kit.turntable.mapping.SchemaRecordSchema",
        "mapperClass": "edu.kit.metadatahub.doip.mapping.metadata.impl.SchemaRecordMapper"
      },
      "response": {
        "className": "edu.kit.turntable.mapping.SchemaRecordSchema",
        "mapperClass": "edu.kit.metadatahub.doip.mapping.metadata.impl.SchemaRecordMapper"
      }
    },
    "doipOpDelete": {},
    "doipOpSearch": {},
    "doipOpListOperations": {},
    "doipOpValidate": {
      "label" : "validate_metadata_document",
      "requestUrl": "https://nfdi4ing.datamanager.kit.edu/metastore/api/v1/schemas/validate/{url_encode(targetId)}"
    }
  }
}
