{
  "clientId": "aims_Schema_ID",
  "baseUrl": "https://pg4aims.ulb.tu-darmstadt.de/AIMS/",
  "mappings": {
    "doipOpHello": {
      "requestUrl": "https://pg4aims.ulb.tu-darmstadt.de/AIMS/application-profiles/"
    },
    "doipOpCreate": {
      "label": "record",
      "requestUrl": "https://pg4aims.ulb.tu-darmstadt.de/AIMS/application-profiles",
      "verb": "PUT",
      "mimetype": "application/json",
      "body": {
        "metadata": "record"
      },
      "header": {
        "Authorization": "",
        "ETag": ""
      },
      "metadata": {
        "className": "edu.kit.turntable.mapping.SchemaRecordSchema",
        "mapperClass": "edu.kit.metadatahub.doip.mapping.metadata.impl.SchemaRecordMapper"
      },
      "response": {
        "className": "edu.kit.turntable.mapping.SchemaRecordSchema",
        "mapperClass": "edu.kit.metadatahub.doip.mapping.metadata.impl.SchemaRecordMapper"
      }
    },
    "doipOpRetrieve": [
      {
        "label": "schema",
        "requestUrl": "https://pg4aims.ulb.tu-darmstadt.de/AIMS/application-profiles/{url_encode(targetId)}?includeDefinition=true",
        "verb": "GET",
        "mimetype": "application/json"
      },
      {
        "label": "metadata",
        "response": {
          "additionalProperties": {
            "creator": "AIMS",
            "publisher": "AIMS",
            "title": "Application Profile",
            "format": "application/json",
            "identifier": "{targetId}",
            "identifierType": "URL"
          }
        }
      }
    ],
    "doipOpUpdate": {
      "label": "record",
      "requestUrl": "https://pg4aims.ulb.tu-darmstadt.de/AIMS/application-profiles",
      "verb": "PUT",
      "mimetype": "application/json",
      "body": {
        "metadata": "record"
      },
      "header": {
        "Authorization": "",
        "ETag": ""
      },
      "metadata": {
        "className": "edu.kit.turntable.mapping.SchemaRecordSchema",
        "mapperClass": "edu.kit.metadatahub.doip.mapping.metadata.impl.SchemaRecordMapper"
      },
      "response": {
        "className": "edu.kit.turntable.mapping.SchemaRecordSchema",
        "mapperClass": "edu.kit.metadatahub.doip.mapping.metadata.impl.SchemaRecordMapper"
      }
    },
    "doipOpDelete": {},
    "doipOpSearch": {
      "label": "document",
      "requestUrl": "https://pg4aims.ulb.tu-darmstadt.de/AIMS/application-profiles/?query={targetId}&includeDefinition=true",
      "verb": "GET",
      "mimetype": "application/json",
      "contenttype" : "application/json",
      "header": {
        "Authorization": ""
      }
    },
    "doipOpListOperations": {}
  }
}
