{
  "clientId": "coscine_Schema_ID",
  "baseUrl": "https://coscine.rwth-aachen.de/coscine/api/",
  "mappings": {
    "doipOpHello": {
      "requestUrl": "https://coscine.rwth-aachen.de/coscine/api/v2/application-profiles/profiles"
    },
    "doipOpCreate": {
      "label": "record",
      "requestUrl": "https://coscine.rwth-aachen.de/coscine/api/v2/application-profiles/requests",
      "verb": "POST",
      "mimetype": "application/json",
      "body": {
        "metadata": "record"
      },
      "header": {
        "Authorization": "",
        "ETag": ""
      },
      "metadata": {
        "className": "edu.kit.turntable.mapping.SchemaRecordSchema",
        "mapperClass": "edu.kit.metadatahub.doip.mapping.metadata.impl.SchemaRecordMapper"
      },
      "response": {
        "className": "edu.kit.turntable.mapping.SchemaRecordSchema",
        "mapperClass": "edu.kit.metadatahub.doip.mapping.metadata.impl.SchemaRecordMapper"
      }
    },
    "doipOpRetrieve": [
      {
        "label": "schema",
        "requestUrl": "https://coscine.rwth-aachen.de/coscine/api/v2/application-profiles/profiles/{url_encode(targetId)}?format=application%2Fld%2Bjson",
        "verb": "GET",
        "mimetype": "application/json"
      },
      {
        "label": "metadata",
        "response": {
          "additionalProperties": {
            "creator": "RWTH Aachen",
            "publisher": "RWTH Aachen",
            "title": "Application Profile",
            "format": "application/ld+json",
            "identifier": "{targetId}",
            "identifierType": "URL"
          }
        }
      }
    ],
    "doipOpUpdate": {},
    "doipOpDelete": {},
    "doipOpSearch": {},
    "doipOpListOperations": {}
  }
}
