<?xml version="1.0" encoding="UTF-8"?>
<!-- Do not edit this file with editors other than draw.io -->
<!DOCTYPE svg PUBLIC "-//W3C//DTD SVG 1.1//EN" "http://www.w3.org/Graphics/SVG/1.1/DTD/svg11.dtd">
<svg xmlns="http://www.w3.org/2000/svg" xmlns:xlink="http://www.w3.org/1999/xlink" version="1.1" width="662px" height="367px" viewBox="-0.5 -0.5 662 367" content="&lt;mxfile host=&quot;app.diagrams.net&quot; modified=&quot;2024-07-12T08:46:31.764Z&quot; agent=&quot;Mozilla/5.0 (Windows NT 10.0; Win64; x64) AppleWebKit/537.36 (KHTML, like Gecko) Chrome/126.0.0.0 Safari/537.36&quot; version=&quot;24.5.3&quot; etag=&quot;g3bhIBANN-VYgaOWuNxS&quot; type=&quot;device&quot; scale=&quot;1&quot; border=&quot;0&quot;&gt;&#10;  &lt;diagram name=&quot;Seite-1&quot; id=&quot;kuIH82XcFkdecusrPt1_&quot;&gt;&#10;    &lt;mxGraphModel dx=&quot;1114&quot; dy=&quot;550&quot; grid=&quot;1&quot; gridSize=&quot;10&quot; guides=&quot;1&quot; tooltips=&quot;1&quot; connect=&quot;1&quot; arrows=&quot;1&quot; fold=&quot;1&quot; page=&quot;1&quot; pageScale=&quot;1&quot; pageWidth=&quot;827&quot; pageHeight=&quot;1169&quot; math=&quot;0&quot; shadow=&quot;0&quot;&gt;&#10;      &lt;root&gt;&#10;        &lt;mxCell id=&quot;0&quot; /&gt;&#10;        &lt;mxCell id=&quot;1&quot; parent=&quot;0&quot; /&gt;&#10;        &lt;UserObject label=&quot;Variable&quot; link=&quot;#http://www.molmod.info/semantics/pims-ii.ttl#Variable&quot; id=&quot;2&quot;&gt;&#10;          &lt;mxCell style=&quot;swimlane;fontStyle=0;childLayout=stackLayout;horizontal=1;startSize=26;horizontalStack=0;resizeParent=1;resizeParentMax=0;resizeLast=0;collapsible=1;marginBottom=0;fillColor=#dae8fc;strokeColor=#6c8ebf;verticalAlign=middle;&quot; vertex=&quot;1&quot; parent=&quot;1&quot;&gt;&#10;            &lt;mxGeometry x=&quot;230&quot; y=&quot;300&quot; width=&quot;140&quot; height=&quot;66&quot; as=&quot;geometry&quot;&gt;&#10;              &lt;mxRectangle x=&quot;310&quot; y=&quot;639&quot; width=&quot;80&quot; height=&quot;30&quot; as=&quot;alternateBounds&quot; /&gt;&#10;            &lt;/mxGeometry&gt;&#10;          &lt;/mxCell&gt;&#10;        &lt;/UserObject&gt;&#10;        &lt;UserObject label=&quot;has symbol&quot; link=&quot;#hasSymbol&quot; id=&quot;3&quot;&gt;&#10;          &lt;mxCell style=&quot;text;strokeColor=none;fillColor=none;align=left;verticalAlign=middle;spacingLeft=4;spacingRight=4;overflow=hidden;rotatable=0;points=[[0,0.5],[1,0.5]];portConstraint=eastwest;&quot; vertex=&quot;1&quot; parent=&quot;2&quot;&gt;&#10;            &lt;mxGeometry y=&quot;26&quot; width=&quot;140&quot; height=&quot;20&quot; as=&quot;geometry&quot; /&gt;&#10;          &lt;/mxCell&gt;&#10;        &lt;/UserObject&gt;&#10;        &lt;UserObject label=&quot;has variable description&quot; link=&quot;#hasVariableDescription&quot; id=&quot;4&quot;&gt;&#10;          &lt;mxCell style=&quot;text;strokeColor=none;fillColor=none;align=left;verticalAlign=middle;spacingLeft=4;spacingRight=4;overflow=hidden;rotatable=0;points=[[0,0.5],[1,0.5]];portConstraint=eastwest;&quot; vertex=&quot;1&quot; parent=&quot;2&quot;&gt;&#10;            &lt;mxGeometry y=&quot;46&quot; width=&quot;140&quot; height=&quot;20&quot; as=&quot;geometry&quot; /&gt;&#10;          &lt;/mxCell&gt;&#10;        &lt;/UserObject&gt;&#10;        &lt;UserObject label=&quot;&quot; link=&quot;#hasParameter&quot; id=&quot;5&quot;&gt;&#10;          &lt;mxCell style=&quot;edgeStyle=orthogonalEdgeStyle;rounded=1;orthogonalLoop=1;jettySize=auto;html=1;exitX=0.5;exitY=1;exitDx=0;exitDy=0;entryX=0.5;entryY=0;entryDx=0;entryDy=0;verticalAlign=middle;&quot; edge=&quot;1&quot; source=&quot;12&quot; target=&quot;2&quot; parent=&quot;1&quot;&gt;&#10;            &lt;mxGeometry relative=&quot;1&quot; as=&quot;geometry&quot;&gt;&#10;              &lt;mxPoint x=&quot;319&quot; y=&quot;369&quot; as=&quot;targetPoint&quot; /&gt;&#10;              &lt;Array as=&quot;points&quot;&gt;&#10;                &lt;mxPoint x=&quot;180&quot; y=&quot;280&quot; /&gt;&#10;                &lt;mxPoint x=&quot;300&quot; y=&quot;280&quot; /&gt;&#10;              &lt;/Array&gt;&#10;            &lt;/mxGeometry&gt;&#10;          &lt;/mxCell&gt;&#10;        &lt;/UserObject&gt;&#10;        &lt;UserObject label=&quot;has parameter&quot; link=&quot;#hasParameter&quot; id=&quot;6&quot;&gt;&#10;          &lt;mxCell style=&quot;edgeStyle=orthogonalEdgeStyle;rounded=1;orthogonalLoop=1;jettySize=auto;html=1;exitX=0.5;exitY=1;exitDx=0;exitDy=0;entryX=0.5;entryY=0;entryDx=0;entryDy=0;verticalAlign=middle;fontStyle=4&quot; edge=&quot;1&quot; source=&quot;13&quot; target=&quot;2&quot; parent=&quot;1&quot;&gt;&#10;            &lt;mxGeometry x=&quot;0.75&quot; relative=&quot;1&quot; as=&quot;geometry&quot;&gt;&#10;              &lt;mxPoint x=&quot;389&quot; y=&quot;369&quot; as=&quot;targetPoint&quot; /&gt;&#10;              &lt;mxPoint as=&quot;offset&quot; /&gt;&#10;              &lt;Array as=&quot;points&quot;&gt;&#10;                &lt;mxPoint x=&quot;420&quot; y=&quot;280&quot; /&gt;&#10;                &lt;mxPoint x=&quot;300&quot; y=&quot;280&quot; /&gt;&#10;              &lt;/Array&gt;&#10;            &lt;/mxGeometry&gt;&#10;          &lt;/mxCell&gt;&#10;        &lt;/UserObject&gt;&#10;        &lt;mxCell id=&quot;7&quot; value=&quot;part of&quot; style=&quot;edgeStyle=orthogonalEdgeStyle;rounded=1;orthogonalLoop=1;jettySize=auto;html=1;exitX=0.25;exitY=0;exitDx=0;exitDy=0;entryX=1;entryY=0.5;entryDx=0;entryDy=0;endArrow=diamondThin;endFill=0;verticalAlign=middle;fontStyle=4&quot; edge=&quot;1&quot; source=&quot;10&quot; target=&quot;24&quot; parent=&quot;1&quot;&gt;&#10;          &lt;mxGeometry x=&quot;-0.1429&quot; relative=&quot;1&quot; as=&quot;geometry&quot;&gt;&#10;            &lt;mxPoint as=&quot;offset&quot; /&gt;&#10;          &lt;/mxGeometry&gt;&#10;        &lt;/mxCell&gt;&#10;        &lt;mxCell id=&quot;8&quot; style=&quot;edgeStyle=orthogonalEdgeStyle;rounded=1;orthogonalLoop=1;jettySize=auto;html=1;entryX=0;entryY=0.5;entryDx=0;entryDy=0;strokeColor=default;align=center;verticalAlign=middle;fontFamily=Helvetica;fontSize=11;fontColor=default;labelBackgroundColor=default;endArrow=classic;exitX=0.75;exitY=0;exitDx=0;exitDy=0;&quot; edge=&quot;1&quot; source=&quot;10&quot; target=&quot;22&quot; parent=&quot;1&quot;&gt;&#10;          &lt;mxGeometry relative=&quot;1&quot; as=&quot;geometry&quot; /&gt;&#10;        &lt;/mxCell&gt;&#10;        &lt;UserObject label=&quot;has participant&quot; link=&quot;#http://purl.obolibrary.org/obo/RO_0000057&quot; id=&quot;9&quot;&gt;&#10;          &lt;mxCell style=&quot;edgeLabel;html=1;align=center;verticalAlign=middle;resizable=0;points=[];fontFamily=Helvetica;fontSize=11;fontColor=default;labelBackgroundColor=default;fontStyle=4&quot; vertex=&quot;1&quot; connectable=&quot;0&quot; parent=&quot;8&quot;&gt;&#10;            &lt;mxGeometry x=&quot;0.0216&quot; y=&quot;1&quot; relative=&quot;1&quot; as=&quot;geometry&quot;&gt;&#10;              &lt;mxPoint x=&quot;-4&quot; y=&quot;11&quot; as=&quot;offset&quot; /&gt;&#10;            &lt;/mxGeometry&gt;&#10;          &lt;/mxCell&gt;&#10;        &lt;/UserObject&gt;&#10;        &lt;UserObject label=&quot;Processing step&quot; link=&quot;#ProcessingStep&quot; id=&quot;10&quot;&gt;&#10;          &lt;mxCell style=&quot;swimlane;fontStyle=0;childLayout=stackLayout;horizontal=1;startSize=26;horizontalStack=0;resizeParent=1;resizeParentMax=0;resizeLast=0;collapsible=1;marginBottom=0;fillColor=#fff2cc;strokeColor=#d6b656;verticalAlign=middle;&quot; vertex=&quot;1&quot; parent=&quot;1&quot;&gt;&#10;            &lt;mxGeometry x=&quot;230&quot; y=&quot;100&quot; width=&quot;140&quot; height=&quot;53&quot; as=&quot;geometry&quot; /&gt;&#10;          &lt;/mxCell&gt;&#10;        &lt;/UserObject&gt;&#10;        &lt;UserObject label=&quot;implemented by&quot; link=&quot;#implementedBy&quot; id=&quot;11&quot;&gt;&#10;          &lt;mxCell style=&quot;edgeStyle=orthogonalEdgeStyle;rounded=0;orthogonalLoop=1;jettySize=auto;html=1;exitX=1;exitY=0.25;exitDx=0;exitDy=0;entryX=0;entryY=0.25;entryDx=0;entryDy=0;verticalAlign=middle;fontStyle=4&quot; edge=&quot;1&quot; source=&quot;12&quot; target=&quot;13&quot; parent=&quot;1&quot;&gt;&#10;            &lt;mxGeometry relative=&quot;1&quot; as=&quot;geometry&quot; /&gt;&#10;          &lt;/mxCell&gt;&#10;        &lt;/UserObject&gt;&#10;        &lt;UserObject label=&quot;Method&quot; link=&quot;#Method&quot; id=&quot;12&quot;&gt;&#10;          &lt;mxCell style=&quot;swimlane;fontStyle=0;childLayout=stackLayout;horizontal=1;startSize=26;horizontalStack=0;resizeParent=1;resizeParentMax=0;resizeLast=0;collapsible=1;marginBottom=0;fillColor=#fff2cc;strokeColor=#d6b656;verticalAlign=middle;&quot; vertex=&quot;1&quot; parent=&quot;1&quot;&gt;&#10;            &lt;mxGeometry x=&quot;110&quot; y=&quot;210&quot; width=&quot;140&quot; height=&quot;50&quot; as=&quot;geometry&quot; /&gt;&#10;          &lt;/mxCell&gt;&#10;        &lt;/UserObject&gt;&#10;        &lt;UserObject label=&quot;Tool&quot; link=&quot;#Tool&quot; id=&quot;13&quot;&gt;&#10;          &lt;mxCell style=&quot;swimlane;fontStyle=0;childLayout=stackLayout;horizontal=1;startSize=26;horizontalStack=0;resizeParent=1;resizeParentMax=0;resizeLast=0;collapsible=1;marginBottom=0;fillColor=#fff2cc;strokeColor=#d6b656;verticalAlign=middle;&quot; vertex=&quot;1&quot; parent=&quot;1&quot;&gt;&#10;            &lt;mxGeometry x=&quot;350&quot; y=&quot;210&quot; width=&quot;140&quot; height=&quot;50&quot; as=&quot;geometry&quot; /&gt;&#10;          &lt;/mxCell&gt;&#10;        &lt;/UserObject&gt;&#10;        &lt;mxCell id=&quot;14&quot; value=&quot;Thing&quot; style=&quot;swimlane;fontStyle=0;childLayout=stackLayout;horizontal=1;startSize=26;horizontalStack=0;resizeParent=1;resizeParentMax=0;resizeLast=0;collapsible=1;marginBottom=0;fillColor=#d5e8d4;strokeColor=#82b366;verticalAlign=middle;&quot; vertex=&quot;1&quot; parent=&quot;1&quot;&gt;&#10;          &lt;mxGeometry x=&quot;40&quot; y=&quot;70&quot; width=&quot;100&quot; height=&quot;50&quot; as=&quot;geometry&quot; /&gt;&#10;        &lt;/mxCell&gt;&#10;        &lt;mxCell id=&quot;15&quot; value=&quot;Thing&quot; style=&quot;swimlane;fontStyle=0;childLayout=stackLayout;horizontal=1;startSize=26;horizontalStack=0;resizeParent=1;resizeParentMax=0;resizeLast=0;collapsible=1;marginBottom=0;fillColor=#d5e8d4;strokeColor=#82b366;verticalAlign=middle;&quot; vertex=&quot;1&quot; parent=&quot;1&quot;&gt;&#10;          &lt;mxGeometry x=&quot;40&quot; y=&quot;140&quot; width=&quot;100&quot; height=&quot;50&quot; as=&quot;geometry&quot; /&gt;&#10;        &lt;/mxCell&gt;&#10;        &lt;UserObject label=&quot;has input&quot; link=&quot;#http://purl.obolibrary.org/obo/RO_0002233&quot; id=&quot;16&quot;&gt;&#10;          &lt;mxCell style=&quot;endArrow=none;html=1;exitX=1;exitY=0.5;exitDx=0;exitDy=0;startArrow=classic;startFill=1;endFill=0;edgeStyle=orthogonalEdgeStyle;entryX=0;entryY=0.75;entryDx=0;entryDy=0;verticalAlign=middle;fontStyle=4&quot; edge=&quot;1&quot; source=&quot;15&quot; target=&quot;10&quot; parent=&quot;1&quot;&gt;&#10;            &lt;mxGeometry x=&quot;0.0069&quot; width=&quot;50&quot; height=&quot;50&quot; relative=&quot;1&quot; as=&quot;geometry&quot;&gt;&#10;              &lt;mxPoint x=&quot;186&quot; y=&quot;170&quot; as=&quot;sourcePoint&quot; /&gt;&#10;              &lt;mxPoint x=&quot;230&quot; y=&quot;145&quot; as=&quot;targetPoint&quot; /&gt;&#10;              &lt;mxPoint as=&quot;offset&quot; /&gt;&#10;            &lt;/mxGeometry&gt;&#10;          &lt;/mxCell&gt;&#10;        &lt;/UserObject&gt;&#10;        &lt;UserObject label=&quot;investigates&quot; link=&quot;#investigates&quot; id=&quot;17&quot;&gt;&#10;          &lt;mxCell style=&quot;endArrow=classic;html=1;exitX=0;exitY=0.25;exitDx=0;exitDy=0;entryX=1;entryY=0.5;entryDx=0;entryDy=0;edgeStyle=orthogonalEdgeStyle;verticalAlign=middle;fontStyle=4&quot; edge=&quot;1&quot; source=&quot;10&quot; target=&quot;14&quot; parent=&quot;1&quot;&gt;&#10;            &lt;mxGeometry x=&quot;0.0591&quot; width=&quot;50&quot; height=&quot;50&quot; relative=&quot;1&quot; as=&quot;geometry&quot;&gt;&#10;              &lt;mxPoint x=&quot;326&quot; y=&quot;230&quot; as=&quot;sourcePoint&quot; /&gt;&#10;              &lt;mxPoint x=&quot;376&quot; y=&quot;180&quot; as=&quot;targetPoint&quot; /&gt;&#10;              &lt;mxPoint as=&quot;offset&quot; /&gt;&#10;            &lt;/mxGeometry&gt;&#10;          &lt;/mxCell&gt;&#10;        &lt;/UserObject&gt;&#10;        &lt;mxCell id=&quot;18&quot; value=&quot;Thing&quot; style=&quot;swimlane;fontStyle=0;childLayout=stackLayout;horizontal=1;startSize=26;horizontalStack=0;resizeParent=1;resizeParentMax=0;resizeLast=0;collapsible=1;marginBottom=0;fillColor=#d5e8d4;strokeColor=#82b366;verticalAlign=middle;&quot; vertex=&quot;1&quot; parent=&quot;1&quot;&gt;&#10;          &lt;mxGeometry x=&quot;460&quot; y=&quot;140&quot; width=&quot;100&quot; height=&quot;50&quot; as=&quot;geometry&quot; /&gt;&#10;        &lt;/mxCell&gt;&#10;        &lt;UserObject label=&quot;has output&quot; link=&quot;#http://purl.obolibrary.org/obo/RO_0002234&quot; id=&quot;19&quot;&gt;&#10;          &lt;mxCell style=&quot;endArrow=none;html=1;exitX=0;exitY=0.5;exitDx=0;exitDy=0;endFill=0;startArrow=classic;startFill=1;edgeStyle=orthogonalEdgeStyle;entryX=1;entryY=0.75;entryDx=0;entryDy=0;verticalAlign=middle;fontStyle=4&quot; edge=&quot;1&quot; source=&quot;18&quot; target=&quot;10&quot; parent=&quot;1&quot;&gt;&#10;            &lt;mxGeometry width=&quot;50&quot; height=&quot;50&quot; relative=&quot;1&quot; as=&quot;geometry&quot;&gt;&#10;              &lt;mxPoint x=&quot;326&quot; y=&quot;230&quot; as=&quot;sourcePoint&quot; /&gt;&#10;              &lt;mxPoint x=&quot;371&quot; y=&quot;130&quot; as=&quot;targetPoint&quot; /&gt;&#10;              &lt;mxPoint as=&quot;offset&quot; /&gt;&#10;            &lt;/mxGeometry&gt;&#10;          &lt;/mxCell&gt;&#10;        &lt;/UserObject&gt;&#10;        &lt;UserObject label=&quot;has employed tool&quot; link=&quot;#hasEmployedTool&quot; id=&quot;20&quot;&gt;&#10;          &lt;mxCell style=&quot;endArrow=classic;html=1;exitX=0.75;exitY=1;exitDx=0;exitDy=0;entryX=0.5;entryY=0;entryDx=0;entryDy=0;edgeStyle=orthogonalEdgeStyle;verticalAlign=middle;fontStyle=4&quot; edge=&quot;1&quot; source=&quot;10&quot; target=&quot;13&quot; parent=&quot;1&quot;&gt;&#10;            &lt;mxGeometry x=&quot;-0.0054&quot; width=&quot;50&quot; height=&quot;50&quot; relative=&quot;1&quot; as=&quot;geometry&quot;&gt;&#10;              &lt;mxPoint x=&quot;334.72&quot; y=&quot;133.702&quot; as=&quot;sourcePoint&quot; /&gt;&#10;              &lt;mxPoint x=&quot;606&quot; y=&quot;200&quot; as=&quot;targetPoint&quot; /&gt;&#10;              &lt;mxPoint as=&quot;offset&quot; /&gt;&#10;            &lt;/mxGeometry&gt;&#10;          &lt;/mxCell&gt;&#10;        &lt;/UserObject&gt;&#10;        &lt;UserObject label=&quot;realizes method&quot; link=&quot;#realizesMethod&quot; id=&quot;21&quot;&gt;&#10;          &lt;mxCell style=&quot;endArrow=classic;html=1;exitX=0.25;exitY=1;exitDx=0;exitDy=0;entryX=0.5;entryY=0;entryDx=0;entryDy=0;edgeStyle=orthogonalEdgeStyle;verticalAlign=middle;fontStyle=4&quot; edge=&quot;1&quot; source=&quot;10&quot; target=&quot;12&quot; parent=&quot;1&quot;&gt;&#10;            &lt;mxGeometry width=&quot;50&quot; height=&quot;50&quot; relative=&quot;1&quot; as=&quot;geometry&quot;&gt;&#10;              &lt;mxPoint x=&quot;316&quot; y=&quot;142&quot; as=&quot;sourcePoint&quot; /&gt;&#10;              &lt;mxPoint x=&quot;369.5&quot; y=&quot;220&quot; as=&quot;targetPoint&quot; /&gt;&#10;              &lt;mxPoint as=&quot;offset&quot; /&gt;&#10;            &lt;/mxGeometry&gt;&#10;          &lt;/mxCell&gt;&#10;        &lt;/UserObject&gt;&#10;        &lt;UserObject label=&quot;Person&quot; link=&quot;#http://www.w3.org/ns/prov#Person&quot; id=&quot;22&quot;&gt;&#10;          &lt;mxCell style=&quot;swimlane;fontStyle=0;childLayout=stackLayout;horizontal=1;startSize=26;horizontalStack=0;resizeParent=1;resizeParentMax=0;resizeLast=0;collapsible=1;marginBottom=0;fillColor=#f8cecc;strokeColor=#b85450;verticalAlign=middle;&quot; vertex=&quot;1&quot; parent=&quot;1&quot;&gt;&#10;            &lt;mxGeometry x=&quot;400&quot; width=&quot;140&quot; height=&quot;50&quot; as=&quot;geometry&quot; /&gt;&#10;          &lt;/mxCell&gt;&#10;        &lt;/UserObject&gt;&#10;        &lt;UserObject label=&quot;implements&quot; link=&quot;#implements&quot; id=&quot;23&quot;&gt;&#10;          &lt;mxCell style=&quot;edgeStyle=orthogonalEdgeStyle;rounded=0;orthogonalLoop=1;jettySize=auto;html=1;exitX=1;exitY=0.75;exitDx=0;exitDy=0;entryX=0;entryY=0.75;entryDx=0;entryDy=0;startArrow=classic;startFill=1;endArrow=none;endFill=0;verticalAlign=middle;fontStyle=4&quot; edge=&quot;1&quot; source=&quot;12&quot; target=&quot;13&quot; parent=&quot;1&quot;&gt;&#10;            &lt;mxGeometry x=&quot;0.0118&quot; relative=&quot;1&quot; as=&quot;geometry&quot;&gt;&#10;              &lt;mxPoint x=&quot;291&quot; y=&quot;246&quot; as=&quot;sourcePoint&quot; /&gt;&#10;              &lt;mxPoint x=&quot;401&quot; y=&quot;246&quot; as=&quot;targetPoint&quot; /&gt;&#10;              &lt;mxPoint as=&quot;offset&quot; /&gt;&#10;            &lt;/mxGeometry&gt;&#10;          &lt;/mxCell&gt;&#10;        &lt;/UserObject&gt;&#10;        &lt;UserObject label=&quot;Research project&quot; link=&quot;#https://schema.org/ResearchProject&quot; id=&quot;24&quot;&gt;&#10;          &lt;mxCell style=&quot;swimlane;fontStyle=0;childLayout=stackLayout;horizontal=1;startSize=26;horizontalStack=0;resizeParent=1;resizeParentMax=0;resizeLast=0;collapsible=1;marginBottom=0;fillColor=#f8cecc;strokeColor=#b85450;verticalAlign=middle;&quot; vertex=&quot;1&quot; parent=&quot;1&quot;&gt;&#10;            &lt;mxGeometry x=&quot;60&quot; width=&quot;140&quot; height=&quot;50&quot; as=&quot;geometry&quot; /&gt;&#10;          &lt;/mxCell&gt;&#10;        &lt;/UserObject&gt;&#10;        &lt;UserObject label=&quot;qualified association&quot; link=&quot;#http://www.w3.org/ns/prov#qualifiedAssociation&quot; id=&quot;25&quot;&gt;&#10;          &lt;mxCell style=&quot;edgeStyle=orthogonalEdgeStyle;rounded=1;orthogonalLoop=1;jettySize=auto;html=1;entryX=1;entryY=0.25;entryDx=0;entryDy=0;startArrow=classic;startFill=1;endArrow=none;endFill=0;curved=0;fontSize=9;fontStyle=4&quot; edge=&quot;1&quot; source=&quot;29&quot; target=&quot;10&quot; parent=&quot;1&quot;&gt;&#10;            &lt;mxGeometry x=&quot;0.1432&quot; relative=&quot;1&quot; as=&quot;geometry&quot;&gt;&#10;              &lt;mxPoint as=&quot;offset&quot; /&gt;&#10;              &lt;Array as=&quot;points&quot;&gt;&#10;                &lt;mxPoint x=&quot;551&quot; y=&quot;113&quot; /&gt;&#10;              &lt;/Array&gt;&#10;              &lt;mxPoint x=&quot;515&quot; y=&quot;90&quot; as=&quot;targetPoint&quot; /&gt;&#10;            &lt;/mxGeometry&gt;&#10;          &lt;/mxCell&gt;&#10;        &lt;/UserObject&gt;&#10;        &lt;UserObject label=&quot;agent&quot; link=&quot;#http://www.w3.org/ns/prov#Agent&quot; id=&quot;26&quot;&gt;&#10;          &lt;mxCell style=&quot;edgeStyle=orthogonalEdgeStyle;rounded=1;orthogonalLoop=1;jettySize=auto;html=1;exitX=0.5;exitY=1;exitDx=0;exitDy=0;entryX=0.5;entryY=0;entryDx=0;entryDy=0;endArrow=none;endFill=0;startArrow=classic;startFill=1;fontSize=9;fontStyle=4&quot; edge=&quot;1&quot; source=&quot;22&quot; target=&quot;29&quot; parent=&quot;1&quot;&gt;&#10;            &lt;mxGeometry x=&quot;-0.0099&quot; relative=&quot;1&quot; as=&quot;geometry&quot;&gt;&#10;              &lt;mxPoint x=&quot;480&quot; y=&quot;-20&quot; as=&quot;sourcePoint&quot; /&gt;&#10;              &lt;Array as=&quot;points&quot;&gt;&#10;                &lt;mxPoint x=&quot;470&quot; y=&quot;60&quot; /&gt;&#10;                &lt;mxPoint x=&quot;550&quot; y=&quot;60&quot; /&gt;&#10;                &lt;mxPoint x=&quot;550&quot; y=&quot;70&quot; /&gt;&#10;              &lt;/Array&gt;&#10;              &lt;mxPoint as=&quot;offset&quot; /&gt;&#10;            &lt;/mxGeometry&gt;&#10;          &lt;/mxCell&gt;&#10;        &lt;/UserObject&gt;&#10;        &lt;UserObject label=&quot;Role&quot; link=&quot;#http://www.w3.org/ns/prov#Role&quot; id=&quot;27&quot;&gt;&#10;          &lt;mxCell style=&quot;swimlane;fontStyle=0;childLayout=stackLayout;horizontal=1;startSize=26;horizontalStack=0;resizeParent=1;resizeParentMax=0;resizeLast=0;collapsible=1;marginBottom=0;fillColor=#f8cecc;strokeColor=#b85450;&quot; vertex=&quot;1&quot; parent=&quot;1&quot;&gt;&#10;            &lt;mxGeometry x=&quot;561&quot; width=&quot;140&quot; height=&quot;50&quot; as=&quot;geometry&quot; /&gt;&#10;          &lt;/mxCell&gt;&#10;        &lt;/UserObject&gt;&#10;        &lt;UserObject label=&quot;had role&quot; link=&quot;#http://www.w3.org/ns/prov#hadRole&quot; id=&quot;28&quot;&gt;&#10;          &lt;mxCell style=&quot;endArrow=classic;html=1;exitX=0.5;exitY=0;exitDx=0;exitDy=0;entryX=0.5;entryY=1;entryDx=0;entryDy=0;edgeStyle=orthogonalEdgeStyle;fontSize=9;fontStyle=4&quot; edge=&quot;1&quot; source=&quot;29&quot; target=&quot;27&quot; parent=&quot;1&quot;&gt;&#10;            &lt;mxGeometry x=&quot;0.18&quot; width=&quot;50&quot; height=&quot;50&quot; relative=&quot;1&quot; as=&quot;geometry&quot;&gt;&#10;              &lt;mxPoint x=&quot;1261&quot; y=&quot;72&quot; as=&quot;sourcePoint&quot; /&gt;&#10;              &lt;mxPoint x=&quot;1536&quot; y=&quot;110&quot; as=&quot;targetPoint&quot; /&gt;&#10;              &lt;mxPoint as=&quot;offset&quot; /&gt;&#10;              &lt;Array as=&quot;points&quot;&gt;&#10;                &lt;mxPoint x=&quot;551&quot; y=&quot;60&quot; /&gt;&#10;                &lt;mxPoint x=&quot;631&quot; y=&quot;60&quot; /&gt;&#10;              &lt;/Array&gt;&#10;            &lt;/mxGeometry&gt;&#10;          &lt;/mxCell&gt;&#10;        &lt;/UserObject&gt;&#10;        &lt;mxCell id=&quot;29&quot; value=&quot;&quot; style=&quot;ellipse;whiteSpace=wrap;html=1;aspect=fixed;fillColor=#000000;&quot; vertex=&quot;1&quot; parent=&quot;1&quot;&gt;&#10;          &lt;mxGeometry x=&quot;540&quot; y=&quot;80&quot; width=&quot;20&quot; height=&quot;20&quot; as=&quot;geometry&quot; /&gt;&#10;        &lt;/mxCell&gt;&#10;      &lt;/root&gt;&#10;    &lt;/mxGraphModel&gt;&#10;  &lt;/diagram&gt;&#10;&lt;/mxfile&gt;&#10;" style="background-color: rgb(255, 255, 255);"><defs><clipPath id="mx-clip-194-326-132-20-0"><rect x="194" y="326" width="132" height="20"/></clipPath><clipPath id="mx-clip-194-346-132-20-0"><rect x="194" y="346" width="132" height="20"/></clipPath></defs><rect fill="#ffffff" width="100%" height="100%" x="0" y="0"/><g><a xlink:href="https://app.diagrams.net/#http://www.molmod.info/semantics/pims-ii.ttl#Variable"><g><path d="M 190 326 L 190 300 L 330 300 L 330 326" fill="#dae8fc" stroke="#6c8ebf" stroke-miterlimit="10" pointer-events="all"/><path d="M 190 326 L 190 366 L 330 366 L 330 326" fill="none" stroke="#6c8ebf" stroke-miterlimit="10"/><path d="M 190 326 L 330 326" fill="none" stroke="#6c8ebf" stroke-miterlimit="10"/></g><g><g fill="rgb(0, 0, 0)" font-family="Helvetica" text-anchor="middle" font-size="12px"><text x="259.5" y="317.5">Variable</text></g></g></a><a xlink:href="https://app.diagrams.net/#hasSymbol"><g><rect x="190" y="326" width="140" height="20" fill="none" stroke="none" pointer-events="all"/></g><g><g fill="rgb(0, 0, 0)" font-family="Helvetica" clip-path="url(#mx-clip-194-326-132-20-0)" font-size="12px"><text x="195.5" y="340.5">has symbol</text></g></g></a><a xlink:href="https://app.diagrams.net/#hasVariableDescription"><g><rect x="190" y="346" width="140" height="20" fill="none" stroke="none" pointer-events="all"/></g><g><g fill="rgb(0, 0, 0)" font-family="Helvetica" clip-path="url(#mx-clip-194-346-132-20-0)" font-size="12px"><text x="195.5" y="360.5">has variable description</text></g></g></a><a xlink:href="https://app.diagrams.net/#hasParameter"><g><path d="M 140 260 L 140 270 Q 140 280 150 280 L 250 280 Q 260 280 260 286.82 L 260 293.63" fill="none" stroke="rgb(0, 0, 0)" stroke-miterlimit="10" pointer-events="stroke"/><path d="M 260 298.88 L 256.5 291.88 L 260 293.63 L 263.5 291.88 Z" fill="rgb(0, 0, 0)" stroke="rgb(0, 0, 0)" stroke-miterlimit="10" pointer-events="all"/></g></a><a xlink:href="https://app.diagrams.net/#hasParameter"><g><path d="M 380 260 L 380 270 Q 380 280 370 280 L 270 280 Q 260 280 260 286.82 L 260 293.63" fill="none" stroke="rgb(0, 0, 0)" stroke-miterlimit="10" pointer-events="stroke"/><path d="M 260 298.88 L 256.5 291.88 L 260 293.63 L 263.5 291.88 Z" fill="rgb(0, 0, 0)" stroke="rgb(0, 0, 0)" stroke-miterlimit="10" pointer-events="all"/></g><g><g transform="translate(-0.5 -0.5)"><switch><foreignObject pointer-events="none" width="100%" height="100%" requiredFeatures="http://www.w3.org/TR/SVG11/feature#Extensibility" style="overflow: visible; text-align: left;"><div xmlns="http://www.w3.org/1999/xhtml" style="display: flex; align-items: unsafe center; justify-content: unsafe center; width: 1px; height: 1px; padding-top: 280px; margin-left: 260px;"><div data-drawio-colors="color: rgb(0, 0, 0); background-color: rgb(255, 255, 255); " style="box-sizing: border-box; font-size: 0px; text-align: center;"><div style="display: inline-block; font-size: 11px; font-family: Helvetica; color: rgb(0, 0, 0); line-height: 1.2; pointer-events: all; text-decoration: underline; background-color: rgb(255, 255, 255); white-space: nowrap;">has parameter</div></div></div></foreignObject><text x="260" y="283" fill="rgb(0, 0, 0)" font-family="Helvetica" font-size="11px" text-anchor="middle" text-decoration="underline">has parameter</text></switch></g></g></a><g><path d="M 225 100 L 225 35 Q 225 25 215 25 L 167.99 25" fill="none" stroke="rgb(0, 0, 0)" stroke-miterlimit="10" pointer-events="stroke"/><path d="M 160.99 25 L 164.49 22.94 L 167.99 25 L 164.49 27.06 Z" fill="none" stroke="rgb(0, 0, 0)" stroke-miterlimit="10" pointer-events="all"/></g><g><g transform="translate(-0.5 -0.5)"><switch><foreignObject pointer-events="none" width="100%" height="100%" requiredFeatures="http://www.w3.org/TR/SVG11/feature#Extensibility" style="overflow: visible; text-align: left;"><div xmlns="http://www.w3.org/1999/xhtml" style="display: flex; align-items: unsafe center; justify-content: unsafe center; width: 1px; height: 1px; padding-top: 40px; margin-left: 225px;"><div data-drawio-colors="color: rgb(0, 0, 0); background-color: rgb(255, 255, 255); " style="box-sizing: border-box; font-size: 0px; text-align: center;"><div style="display: inline-block; font-size: 11px; font-family: Helvetica; color: rgb(0, 0, 0); line-height: 1.2; pointer-events: all; text-decoration: underline; background-color: rgb(255, 255, 255); white-space: nowrap;">part of</div></div></div></foreignObject><text x="225" y="43" fill="rgb(0, 0, 0)" font-family="Helvetica" font-size="11px" text-anchor="middle" text-decoration="underline">part of</text></switch></g></g><g><path d="M 295 100 L 295 35 Q 295 25 305 25 L 353.63 25" fill="none" stroke="rgb(0, 0, 0)" stroke-miterlimit="10" pointer-events="stroke"/><path d="M 358.88 25 L 351.88 28.5 L 353.63 25 L 351.88 21.5 Z" fill="rgb(0, 0, 0)" stroke="rgb(0, 0, 0)" stroke-miterlimit="10" pointer-events="all"/></g><a xlink:href="https://app.diagrams.net/#http://purl.obolibrary.org/obo/RO_0000057"><g><g transform="translate(-0.5 -0.5)"><switch><foreignObject pointer-events="none" width="100%" height="100%" requiredFeatures="http://www.w3.org/TR/SVG11/feature#Extensibility" style="overflow: visible; text-align: left;"><div xmlns="http://www.w3.org/1999/xhtml" style="display: flex; align-items: unsafe center; justify-content: unsafe center; width: 1px; height: 1px; padding-top: 40px; margin-left: 291px;"><div data-drawio-colors="color: rgb(0, 0, 0); background-color: rgb(255, 255, 255); " style="box-sizing: border-box; font-size: 0px; text-align: center;"><div style="display: inline-block; font-size: 11px; font-family: Helvetica; color: rgb(0, 0, 0); line-height: 1.2; pointer-events: all; text-decoration: underline; background-color: rgb(255, 255, 255); white-space: nowrap;">has participant</div></div></div></foreignObject><text x="291" y="43" fill="rgb(0, 0, 0)" font-family="Helvetica" font-size="11px" text-anchor="middle" text-decoration="underline">has participant</text></switch></g></g></a><a xlink:href="https://app.diagrams.net/#ProcessingStep"><g><path d="M 190 126 L 190 100 L 330 100 L 330 126" fill="#fff2cc" stroke="#d6b656" stroke-miterlimit="10" pointer-events="all"/><path d="M 190 126 L 190 153 L 330 153 L 330 126" fill="none" stroke="#d6b656" stroke-miterlimit="10"/><path d="M 190 126 L 330 126" fill="none" stroke="#d6b656" stroke-miterlimit="10"/></g><g><g fill="rgb(0, 0, 0)" font-family="Helvetica" text-anchor="middle" font-size="12px"><text x="259.5" y="117.5">Processing step</text></g></g></a><a xlink:href="https://app.diagrams.net/#implementedBy"><g><path d="M 210 222.5 L 303.63 222.5" fill="none" stroke="rgb(0, 0, 0)" stroke-miterlimit="10" pointer-events="stroke"/><path d="M 308.88 222.5 L 301.88 226 L 303.63 222.5 L 301.88 219 Z" fill="rgb(0, 0, 0)" stroke="rgb(0, 0, 0)" stroke-miterlimit="10" pointer-events="all"/></g><g><g transform="translate(-0.5 -0.5)"><switch><foreignObject pointer-events="none" width="100%" height="100%" requiredFeatures="http://www.w3.org/TR/SVG11/feature#Extensibility" style="overflow: visible; text-align: left;"><div xmlns="http://www.w3.org/1999/xhtml" style="display: flex; align-items: unsafe center; justify-content: unsafe center; width: 1px; height: 1px; padding-top: 223px; margin-left: 260px;"><div data-drawio-colors="color: rgb(0, 0, 0); background-color: rgb(255, 255, 255); " style="box-sizing: border-box; font-size: 0px; text-align: center;"><div style="display: inline-block; font-size: 11px; font-family: Helvetica; color: rgb(0, 0, 0); line-height: 1.2; pointer-events: all; text-decoration: underline; background-color: rgb(255, 255, 255); white-space: nowrap;">implemented by</div></div></div></foreignObject><text x="260" y="226" fill="rgb(0, 0, 0)" font-family="Helvetica" font-size="11px" text-anchor="middle" text-decoration="underline">implemented by</text></switch></g></g></a><a xlink:href="https://app.diagrams.net/#Method"><g><path d="M 70 236 L 70 210 L 210 210 L 210 236" fill="#fff2cc" stroke="#d6b656" stroke-miterlimit="10" pointer-events="all"/><path d="M 70 236 L 70 260 L 210 260 L 210 236" fill="none" stroke="#d6b656" stroke-miterlimit="10"/><path d="M 70 236 L 210 236" fill="none" stroke="#d6b656" stroke-miterlimit="10"/></g><g><g fill="rgb(0, 0, 0)" font-family="Helvetica" text-anchor="middle" font-size="12px"><text x="139.5" y="227.5">Method</text></g></g></a><a xlink:href="https://app.diagrams.net/#Tool"><g><path d="M 310 236 L 310 210 L 450 210 L 450 236" fill="#fff2cc" stroke="#d6b656" stroke-miterlimit="10" pointer-events="all"/><path d="M 310 236 L 310 260 L 450 260 L 450 236" fill="none" stroke="#d6b656" stroke-miterlimit="10"/><path d="M 310 236 L 450 236" fill="none" stroke="#d6b656" stroke-miterlimit="10"/></g><g><g fill="rgb(0, 0, 0)" font-family="Helvetica" text-anchor="middle" font-size="12px"><text x="379.5" y="227.5">Tool</text></g></g></a><g><path d="M 0 96 L 0 70 L 100 70 L 100 96" fill="#d5e8d4" stroke="#82b366" stroke-miterlimit="10" pointer-events="all"/><path d="M 0 96 L 0 120 L 100 120 L 100 96" fill="none" stroke="#82b366" stroke-miterlimit="10"/><path d="M 0 96 L 100 96" fill="none" stroke="#82b366" stroke-miterlimit="10"/></g><g><g fill="rgb(0, 0, 0)" font-family="Helvetica" text-anchor="middle" font-size="12px"><text x="49.5" y="87.5">Thing</text></g></g><g><path d="M 0 166 L 0 140 L 100 140 L 100 166" fill="#d5e8d4" stroke="#82b366" stroke-miterlimit="10" pointer-events="all"/><path d="M 0 166 L 0 190 L 100 190 L 100 166" fill="none" stroke="#82b366" stroke-miterlimit="10"/><path d="M 0 166 L 100 166" fill="none" stroke="#82b366" stroke-miterlimit="10"/></g><g><g fill="rgb(0, 0, 0)" font-family="Helvetica" text-anchor="middle" font-size="12px"><text x="49.5" y="157.5">Thing</text></g></g><a xlink:href="https://app.diagrams.net/#http://purl.obolibrary.org/obo/RO_0002233"><g><path d="M 106.37 165 L 135 165 Q 145 165 145 155 L 145 147.4 Q 145 139.8 155 139.79 L 190 139.75" fill="none" stroke="rgb(0, 0, 0)" stroke-miterlimit="10" pointer-events="stroke"/><path d="M 101.12 165 L 108.12 161.5 L 106.37 165 L 108.12 168.5 Z" fill="rgb(0, 0, 0)" stroke="rgb(0, 0, 0)" stroke-miterlimit="10" pointer-events="all"/></g><g><g transform="translate(-0.5 -0.5)"><switch><foreignObject pointer-events="none" width="100%" height="100%" requiredFeatures="http://www.w3.org/TR/SVG11/feature#Extensibility" style="overflow: visible; text-align: left;"><div xmlns="http://www.w3.org/1999/xhtml" style="display: flex; align-items: unsafe center; justify-content: unsafe center; width: 1px; height: 1px; padding-top: 152px; margin-left: 145px;"><div data-drawio-colors="color: rgb(0, 0, 0); background-color: rgb(255, 255, 255); " style="box-sizing: border-box; font-size: 0px; text-align: center;"><div style="display: inline-block; font-size: 11px; font-family: Helvetica; color: rgb(0, 0, 0); line-height: 1.2; pointer-events: all; text-decoration: underline; background-color: rgb(255, 255, 255); white-space: nowrap;">has input</div></div></div></foreignObject><text x="145" y="155" fill="rgb(0, 0, 0)" font-family="Helvetica" font-size="11px" text-anchor="middle" text-decoration="underline">has input</text></switch></g></g></a><a xlink:href="https://app.diagrams.net/#investigates"><g><path d="M 190 113.25 L 155 113.29 Q 145 113.3 145 104.15 L 145 99.58 Q 145 95 135 95 L 106.37 95" fill="none" stroke="rgb(0, 0, 0)" stroke-miterlimit="10" pointer-events="stroke"/><path d="M 101.12 95 L 108.12 91.5 L 106.37 95 L 108.12 98.5 Z" fill="rgb(0, 0, 0)" stroke="rgb(0, 0, 0)" stroke-miterlimit="10" pointer-events="all"/></g><g><g transform="translate(-0.5 -0.5)"><switch><foreignObject pointer-events="none" width="100%" height="100%" requiredFeatures="http://www.w3.org/TR/SVG11/feature#Extensibility" style="overflow: visible; text-align: left;"><div xmlns="http://www.w3.org/1999/xhtml" style="display: flex; align-items: unsafe center; justify-content: unsafe center; width: 1px; height: 1px; padding-top: 101px; margin-left: 145px;"><div data-drawio-colors="color: rgb(0, 0, 0); background-color: rgb(255, 255, 255); " style="box-sizing: border-box; font-size: 0px; text-align: center;"><div style="display: inline-block; font-size: 11px; font-family: Helvetica; color: rgb(0, 0, 0); line-height: 1.2; pointer-events: all; text-decoration: underline; background-color: rgb(255, 255, 255); white-space: nowrap;">investigates</div></div></div></foreignObject><text x="145" y="105" fill="rgb(0, 0, 0)" font-family="Helvetica" font-size="11px" text-anchor="middle" text-decoration="underline">investigat...</text></switch></g></g></a><g><path d="M 420 166 L 420 140 L 520 140 L 520 166" fill="#d5e8d4" stroke="#82b366" stroke-miterlimit="10" pointer-events="all"/><path d="M 420 166 L 420 190 L 520 190 L 520 166" fill="none" stroke="#82b366" stroke-miterlimit="10"/><path d="M 420 166 L 520 166" fill="none" stroke="#82b366" stroke-miterlimit="10"/></g><g><g fill="rgb(0, 0, 0)" font-family="Helvetica" text-anchor="middle" font-size="12px"><text x="469.5" y="157.5">Thing</text></g></g><a xlink:href="https://app.diagrams.net/#http://purl.obolibrary.org/obo/RO_0002234"><g><path d="M 413.63 165 L 385 165 Q 375 165 375 155 L 375 147.4 Q 375 139.8 365 139.79 L 330 139.75" fill="none" stroke="rgb(0, 0, 0)" stroke-miterlimit="10" pointer-events="stroke"/><path d="M 418.88 165 L 411.88 168.5 L 413.63 165 L 411.88 161.5 Z" fill="rgb(0, 0, 0)" stroke="rgb(0, 0, 0)" stroke-miterlimit="10" pointer-events="all"/></g><g><g transform="translate(-0.5 -0.5)"><switch><foreignObject pointer-events="none" width="100%" height="100%" requiredFeatures="http://www.w3.org/TR/SVG11/feature#Extensibility" style="overflow: visible; text-align: left;"><div xmlns="http://www.w3.org/1999/xhtml" style="display: flex; align-items: unsafe center; justify-content: unsafe center; width: 1px; height: 1px; padding-top: 152px; margin-left: 375px;"><div data-drawio-colors="color: rgb(0, 0, 0); background-color: rgb(255, 255, 255); " style="box-sizing: border-box; font-size: 0px; text-align: center;"><div style="display: inline-block; font-size: 11px; font-family: Helvetica; color: rgb(0, 0, 0); line-height: 1.2; pointer-events: all; text-decoration: underline; background-color: rgb(255, 255, 255); white-space: nowrap;">has output</div></div></div></foreignObject><text x="375" y="155" fill="rgb(0, 0, 0)" font-family="Helvetica" font-size="11px" text-anchor="middle" text-decoration="underline">has output</text></switch></g></g></a><a xlink:href="https://app.diagrams.net/#hasEmployedTool"><g><path d="M 295 153 L 295 171.5 Q 295 181.5 305 181.5 L 370 181.5 Q 380 181.5 380 191.5 L 380 203.63" fill="none" stroke="rgb(0, 0, 0)" stroke-miterlimit="10" pointer-events="stroke"/><path d="M 380 208.88 L 376.5 201.88 L 380 203.63 L 383.5 201.88 Z" fill="rgb(0, 0, 0)" stroke="rgb(0, 0, 0)" stroke-miterlimit="10" pointer-events="all"/></g><g><g transform="translate(-0.5 -0.5)"><switch><foreignObject pointer-events="none" width="100%" height="100%" requiredFeatures="http://www.w3.org/TR/SVG11/feature#Extensibility" style="overflow: visible; text-align: left;"><div xmlns="http://www.w3.org/1999/xhtml" style="display: flex; align-items: unsafe center; justify-content: unsafe center; width: 1px; height: 1px; padding-top: 182px; margin-left: 338px;"><div data-drawio-colors="color: rgb(0, 0, 0); background-color: rgb(255, 255, 255); " style="box-sizing: border-box; font-size: 0px; text-align: center;"><div style="display: inline-block; font-size: 11px; font-family: Helvetica; color: rgb(0, 0, 0); line-height: 1.2; pointer-events: all; text-decoration: underline; background-color: rgb(255, 255, 255); white-space: nowrap;">has employed tool</div></div></div></foreignObject><text x="338" y="185" fill="rgb(0, 0, 0)" font-family="Helvetica" font-size="11px" text-anchor="middle" text-decoration="underline">has employ...</text></switch></g></g></a><a xlink:href="https://app.diagrams.net/#realizesMethod"><g><path d="M 225 153 L 225 171.5 Q 225 181.5 215 181.5 L 150 181.5 Q 140 181.5 140 191.5 L 140 203.63" fill="none" stroke="rgb(0, 0, 0)" stroke-miterlimit="10" pointer-events="stroke"/><path d="M 140 208.88 L 136.5 201.88 L 140 203.63 L 143.5 201.88 Z" fill="rgb(0, 0, 0)" stroke="rgb(0, 0, 0)" stroke-miterlimit="10" pointer-events="all"/></g><g><g transform="translate(-0.5 -0.5)"><switch><foreignObject pointer-events="none" width="100%" height="100%" requiredFeatures="http://www.w3.org/TR/SVG11/feature#Extensibility" style="overflow: visible; text-align: left;"><div xmlns="http://www.w3.org/1999/xhtml" style="display: flex; align-items: unsafe center; justify-content: unsafe center; width: 1px; height: 1px; padding-top: 182px; margin-left: 183px;"><div data-drawio-colors="color: rgb(0, 0, 0); background-color: rgb(255, 255, 255); " style="box-sizing: border-box; font-size: 0px; text-align: center;"><div style="display: inline-block; font-size: 11px; font-family: Helvetica; color: rgb(0, 0, 0); line-height: 1.2; pointer-events: all; text-decoration: underline; background-color: rgb(255, 255, 255); white-space: nowrap;">realizes method</div></div></div></foreignObject><text x="183" y="185" fill="rgb(0, 0, 0)" font-family="Helvetica" font-size="11px" text-anchor="middle" text-decoration="underline">realizes m...</text></switch></g></g></a><a xlink:href="https://app.diagrams.net/#http://www.w3.org/ns/prov#Person"><g><path d="M 360 26 L 360 0 L 500 0 L 500 26" fill="#f8cecc" stroke="#b85450" stroke-miterlimit="10" pointer-events="all"/><path d="M 360 26 L 360 50 L 500 50 L 500 26" fill="none" stroke="#b85450" stroke-miterlimit="10"/><path d="M 360 26 L 500 26" fill="none" stroke="#b85450" stroke-miterlimit="10"/></g><g><g fill="rgb(0, 0, 0)" font-family="Helvetica" text-anchor="middle" font-size="12px"><text x="429.5" y="17.5">Person</text></g></g></a><a xlink:href="https://app.diagrams.net/#implements"><g><path d="M 216.37 247.5 L 310 247.5" fill="none" stroke="rgb(0, 0, 0)" stroke-miterlimit="10" pointer-events="stroke"/><path d="M 211.12 247.5 L 218.12 244 L 216.37 247.5 L 218.12 251 Z" fill="rgb(0, 0, 0)" stroke="rgb(0, 0, 0)" stroke-miterlimit="10" pointer-events="all"/></g><g><g transform="translate(-0.5 -0.5)"><switch><foreignObject pointer-events="none" width="100%" height="100%" requiredFeatures="http://www.w3.org/TR/SVG11/feature#Extensibility" style="overflow: visible; text-align: left;"><div xmlns="http://www.w3.org/1999/xhtml" style="display: flex; align-items: unsafe center; justify-content: unsafe center; width: 1px; height: 1px; padding-top: 248px; margin-left: 261px;"><div data-drawio-colors="color: rgb(0, 0, 0); background-color: rgb(255, 255, 255); " style="box-sizing: border-box; font-size: 0px; text-align: center;"><div style="display: inline-block; font-size: 11px; font-family: Helvetica; color: rgb(0, 0, 0); line-height: 1.2; pointer-events: all; text-decoration: underline; background-color: rgb(255, 255, 255); white-space: nowrap;">implements</div></div></div></foreignObject><text x="261" y="251" fill="rgb(0, 0, 0)" font-family="Helvetica" font-size="11px" text-anchor="middle" text-decoration="underline">implements</text></switch></g></g></a><a xlink:href="https://app.diagrams.net/#https://schema.org/ResearchProject"><g><path d="M 20 26 L 20 0 L 160 0 L 160 26" fill="#f8cecc" stroke="#b85450" stroke-miterlimit="10" pointer-events="all"/><path d="M 20 26 L 20 50 L 160 50 L 160 26" fill="none" stroke="#b85450" stroke-miterlimit="10"/><path d="M 20 26 L 160 26" fill="none" stroke="#b85450" stroke-miterlimit="10"/></g><g><g fill="rgb(0, 0, 0)" font-family="Helvetica" text-anchor="middle" font-size="12px"><text x="89.5" y="17.5">Research project</text></g></g></a><a xlink:href="https://app.diagrams.net/#http://www.w3.org/ns/prov#qualifiedAssociation"><g><path d="M 511 106.32 L 511 109.81 Q 511 113.3 501 113.3 L 330 113.25" fill="none" stroke="rgb(0, 0, 0)" stroke-miterlimit="10" pointer-events="stroke"/><path d="M 511 101.07 L 514.5 108.07 L 511 106.32 L 507.5 108.07 Z" fill="rgb(0, 0, 0)" stroke="rgb(0, 0, 0)" stroke-miterlimit="10" pointer-events="all"/></g><g><g transform="translate(-0.5 -0.5)"><switch><foreignObject pointer-events="none" width="100%" height="100%" requiredFeatures="http://www.w3.org/TR/SVG11/feature#Extensibility" style="overflow: visible; text-align: left;"><div xmlns="http://www.w3.org/1999/xhtml" style="display: flex; align-items: unsafe center; justify-content: unsafe center; width: 1px; height: 1px; padding-top: 113px; margin-left: 413px;"><div data-drawio-colors="color: rgb(0, 0, 0); background-color: rgb(255, 255, 255); " style="box-sizing: border-box; font-size: 0px; text-align: center;"><div style="display: inline-block; font-size: 9px; font-family: Helvetica; color: rgb(0, 0, 0); line-height: 1.2; pointer-events: all; text-decoration: underline; background-color: rgb(255, 255, 255); white-space: nowrap;">qualified association</div></div></div></foreignObject><text x="413" y="116" fill="rgb(0, 0, 0)" font-family="Helvetica" font-size="9px" text-anchor="middle" text-decoration="underline">qualified association</text></switch></g></g></a><a xlink:href="https://app.diagrams.net/#http://www.w3.org/ns/prov#Agent"><g><path d="M 430 56.37 L 430 58.18 Q 430 60 440 60 L 500 60 Q 510 60 510 65 L 510 67.5 Q 510 70 510 75 L 510 80" fill="none" stroke="rgb(0, 0, 0)" stroke-miterlimit="10" pointer-events="stroke"/><path d="M 430 51.12 L 433.5 58.12 L 430 56.37 L 426.5 58.12 Z" fill="rgb(0, 0, 0)" stroke="rgb(0, 0, 0)" stroke-miterlimit="10" pointer-events="all"/></g><g><g transform="translate(-0.5 -0.5)"><switch><foreignObject pointer-events="none" width="100%" height="100%" requiredFeatures="http://www.w3.org/TR/SVG11/feature#Extensibility" style="overflow: visible; text-align: left;"><div xmlns="http://www.w3.org/1999/xhtml" style="display: flex; align-items: unsafe center; justify-content: unsafe center; width: 1px; height: 1px; padding-top: 60px; margin-left: 474px;"><div data-drawio-colors="color: rgb(0, 0, 0); background-color: rgb(255, 255, 255); " style="box-sizing: border-box; font-size: 0px; text-align: center;"><div style="display: inline-block; font-size: 9px; font-family: Helvetica; color: rgb(0, 0, 0); line-height: 1.2; pointer-events: all; text-decoration: underline; background-color: rgb(255, 255, 255); white-space: nowrap;">agent</div></div></div></foreignObject><text x="474" y="63" fill="rgb(0, 0, 0)" font-family="Helvetica" font-size="9px" text-anchor="middle" text-decoration="underline">agent</text></switch></g></g></a><a xlink:href="https://app.diagrams.net/#http://www.w3.org/ns/prov#Role"><g><path d="M 521 26 L 521 0 L 661 0 L 661 26" fill="#f8cecc" stroke="#b85450" stroke-miterlimit="10" pointer-events="all"/><path d="M 521 26 L 521 50 L 661 50 L 661 26" fill="none" stroke="#b85450" stroke-miterlimit="10"/><path d="M 521 26 L 661 26" fill="none" stroke="#b85450" stroke-miterlimit="10"/></g><g><g fill="rgb(0, 0, 0)" font-family="Helvetica" text-anchor="middle" font-size="12px"><text x="590.5" y="17.5">Role</text></g></g></a><a xlink:href="https://app.diagrams.net/#http://www.w3.org/ns/prov#hadRole"><g><path d="M 510 80 L 510.5 80 Q 511 80 511 70 L 511 65 Q 511 60 521 60 L 581 60 Q 591 60 591 58.18 L 591 56.37" fill="none" stroke="rgb(0, 0, 0)" stroke-miterlimit="10" pointer-events="stroke"/><path d="M 591 51.12 L 594.5 58.12 L 591 56.37 L 587.5 58.12 Z" fill="rgb(0, 0, 0)" stroke="rgb(0, 0, 0)" stroke-miterlimit="10" pointer-events="all"/></g><g><g transform="translate(-0.5 -0.5)"><switch><foreignObject pointer-events="none" width="100%" height="100%" requiredFeatures="http://www.w3.org/TR/SVG11/feature#Extensibility" style="overflow: visible; text-align: left;"><div xmlns="http://www.w3.org/1999/xhtml" style="display: flex; align-items: unsafe center; justify-content: unsafe center; width: 1px; height: 1px; padding-top: 60px; margin-left: 555px;"><div data-drawio-colors="color: rgb(0, 0, 0); background-color: rgb(255, 255, 255); " style="box-sizing: border-box; font-size: 0px; text-align: center;"><div style="display: inline-block; font-size: 9px; font-family: Helvetica; color: rgb(0, 0, 0); line-height: 1.2; pointer-events: all; text-decoration: underline; background-color: rgb(255, 255, 255); white-space: nowrap;">had role</div></div></div></foreignObject><text x="555" y="63" fill="rgb(0, 0, 0)" font-family="Helvetica" font-size="9px" text-anchor="middle" text-decoration="underline">had role</text></switch></g></g></a><g><ellipse cx="510" cy="90" rx="10" ry="10" fill="#000000" stroke="rgb(0, 0, 0)" pointer-events="all"/></g></g></svg>