<?xml version="1.0" encoding="UTF-8"?>
<!-- Do not edit this file with editors other than draw.io -->
<!DOCTYPE svg PUBLIC "-//W3C//DTD SVG 1.1//EN" "http://www.w3.org/Graphics/SVG/1.1/DTD/svg11.dtd">
<svg xmlns="http://www.w3.org/2000/svg" xmlns:xlink="http://www.w3.org/1999/xlink" version="1.1" width="771px" height="501px" viewBox="-0.5 -0.5 771 501" content="&lt;mxfile host=&quot;Electron&quot; agent=&quot;Mozilla/5.0 (Windows NT 10.0; Win64; x64) AppleWebKit/537.36 (KHTML, like Gecko) draw.io/24.7.8 Chrome/128.0.6613.36 Electron/32.0.1 Safari/537.36&quot; version=&quot;24.7.8&quot; scale=&quot;1&quot; border=&quot;0&quot;&gt;&#10;  &lt;diagram name=&quot;Seite-1&quot; id=&quot;DzO5nodscQTjy9d1WnKH&quot;&gt;&#10;    &lt;mxGraphModel dx=&quot;1404&quot; dy=&quot;934&quot; grid=&quot;1&quot; gridSize=&quot;10&quot; guides=&quot;1&quot; tooltips=&quot;1&quot; connect=&quot;1&quot; arrows=&quot;1&quot; fold=&quot;1&quot; page=&quot;1&quot; pageScale=&quot;1&quot; pageWidth=&quot;827&quot; pageHeight=&quot;1169&quot; math=&quot;0&quot; shadow=&quot;0&quot;&gt;&#10;      &lt;root&gt;&#10;        &lt;mxCell id=&quot;0&quot; /&gt;&#10;        &lt;mxCell id=&quot;1&quot; parent=&quot;0&quot; /&gt;&#10;        &lt;mxCell id=&quot;2&quot; value=&quot;&quot; style=&quot;group&quot; vertex=&quot;1&quot; connectable=&quot;0&quot; parent=&quot;1&quot;&gt;&#10;          &lt;mxGeometry x=&quot;489.86&quot; y=&quot;520&quot; width=&quot;330&quot; height=&quot;190&quot; as=&quot;geometry&quot; /&gt;&#10;        &lt;/mxCell&gt;&#10;        &lt;mxCell id=&quot;3&quot; value=&quot;&quot; style=&quot;rounded=0;whiteSpace=wrap;html=1;fillColor=none;strokeColor=#00994D;dashed=1;verticalAlign=middle;&quot; vertex=&quot;1&quot; parent=&quot;2&quot;&gt;&#10;          &lt;mxGeometry width=&quot;330&quot; height=&quot;190&quot; as=&quot;geometry&quot; /&gt;&#10;        &lt;/mxCell&gt;&#10;        &lt;mxCell id=&quot;4&quot; value=&quot;&amp;lt;b&amp;gt;&amp;lt;font color=&amp;quot;#00994d&amp;quot;&amp;gt;D-SI&amp;lt;/font&amp;gt;&amp;lt;/b&amp;gt;&quot; style=&quot;text;html=1;strokeColor=none;fillColor=none;align=center;verticalAlign=middle;whiteSpace=wrap;rounded=0;&quot; vertex=&quot;1&quot; parent=&quot;2&quot;&gt;&#10;          &lt;mxGeometry width=&quot;40&quot; height=&quot;20&quot; as=&quot;geometry&quot; /&gt;&#10;        &lt;/mxCell&gt;&#10;        &lt;UserObject label=&quot;Variable&quot; link=&quot;#http://www.molmod.info/semantics/pims-ii.ttl#Variable&quot; id=&quot;5&quot;&gt;&#10;          &lt;mxCell style=&quot;swimlane;fontStyle=0;childLayout=stackLayout;horizontal=1;startSize=26;horizontalStack=0;resizeParent=1;resizeParentMax=0;resizeLast=0;collapsible=1;marginBottom=0;fillColor=#dae8fc;strokeColor=#6c8ebf;verticalAlign=middle;&quot; vertex=&quot;1&quot; parent=&quot;1&quot;&gt;&#10;            &lt;mxGeometry x=&quot;230&quot; y=&quot;300&quot; width=&quot;140&quot; height=&quot;66&quot; as=&quot;geometry&quot;&gt;&#10;              &lt;mxRectangle x=&quot;310&quot; y=&quot;639&quot; width=&quot;80&quot; height=&quot;30&quot; as=&quot;alternateBounds&quot; /&gt;&#10;            &lt;/mxGeometry&gt;&#10;          &lt;/mxCell&gt;&#10;        &lt;/UserObject&gt;&#10;        &lt;UserObject label=&quot;has symbol&quot; link=&quot;#hasSymbol&quot; id=&quot;6&quot;&gt;&#10;          &lt;mxCell style=&quot;text;strokeColor=none;fillColor=none;align=left;verticalAlign=middle;spacingLeft=4;spacingRight=4;overflow=hidden;rotatable=0;points=[[0,0.5],[1,0.5]];portConstraint=eastwest;&quot; vertex=&quot;1&quot; parent=&quot;5&quot;&gt;&#10;            &lt;mxGeometry y=&quot;26&quot; width=&quot;140&quot; height=&quot;20&quot; as=&quot;geometry&quot; /&gt;&#10;          &lt;/mxCell&gt;&#10;        &lt;/UserObject&gt;&#10;        &lt;UserObject label=&quot;has variable description&quot; link=&quot;#hasVariableDescription&quot; id=&quot;7&quot;&gt;&#10;          &lt;mxCell style=&quot;text;strokeColor=none;fillColor=none;align=left;verticalAlign=middle;spacingLeft=4;spacingRight=4;overflow=hidden;rotatable=0;points=[[0,0.5],[1,0.5]];portConstraint=eastwest;&quot; vertex=&quot;1&quot; parent=&quot;5&quot;&gt;&#10;            &lt;mxGeometry y=&quot;46&quot; width=&quot;140&quot; height=&quot;20&quot; as=&quot;geometry&quot; /&gt;&#10;          &lt;/mxCell&gt;&#10;        &lt;/UserObject&gt;&#10;        &lt;UserObject label=&quot;Uncertainty declaration&quot; link=&quot;#UncertaintyDeclaration&quot; id=&quot;8&quot;&gt;&#10;          &lt;mxCell style=&quot;swimlane;fontStyle=0;childLayout=stackLayout;horizontal=1;startSize=26;horizontalStack=0;resizeParent=1;resizeParentMax=0;resizeLast=0;collapsible=1;marginBottom=0;fillColor=#dae8fc;strokeColor=#6c8ebf;verticalAlign=middle;&quot; vertex=&quot;1&quot; parent=&quot;1&quot;&gt;&#10;            &lt;mxGeometry x=&quot;589.86&quot; y=&quot;530&quot; width=&quot;140&quot; height=&quot;66&quot; as=&quot;geometry&quot; /&gt;&#10;          &lt;/mxCell&gt;&#10;        &lt;/UserObject&gt;&#10;        &lt;UserObject label=&quot;has coverage probability&quot; link=&quot;#https://ptb.de/si/hasCoverageProbability&quot; id=&quot;9&quot;&gt;&#10;          &lt;mxCell style=&quot;text;strokeColor=none;fillColor=none;align=left;verticalAlign=middle;spacingLeft=4;spacingRight=4;overflow=hidden;rotatable=0;points=[[0,0.5],[1,0.5]];portConstraint=eastwest;fontSize=12;&quot; vertex=&quot;1&quot; parent=&quot;8&quot;&gt;&#10;            &lt;mxGeometry y=&quot;26&quot; width=&quot;140&quot; height=&quot;20&quot; as=&quot;geometry&quot; /&gt;&#10;          &lt;/mxCell&gt;&#10;        &lt;/UserObject&gt;&#10;        &lt;UserObject label=&quot;has statistical distribution&quot; link=&quot;#https://ptb.de/si/hasDistribution&quot; id=&quot;10&quot;&gt;&#10;          &lt;mxCell style=&quot;text;strokeColor=none;fillColor=none;align=left;verticalAlign=middle;spacingLeft=4;spacingRight=4;overflow=hidden;rotatable=0;points=[[0,0.5],[1,0.5]];portConstraint=eastwest;fontSize=12;&quot; vertex=&quot;1&quot; parent=&quot;8&quot;&gt;&#10;            &lt;mxGeometry y=&quot;46&quot; width=&quot;140&quot; height=&quot;20&quot; as=&quot;geometry&quot; /&gt;&#10;          &lt;/mxCell&gt;&#10;        &lt;/UserObject&gt;&#10;        &lt;UserObject label=&quot;Quantity kind&quot; link=&quot;#http://qudt.org/schema/qudt/QuantityKind&quot; id=&quot;11&quot;&gt;&#10;          &lt;mxCell style=&quot;swimlane;fontStyle=0;childLayout=stackLayout;horizontal=1;startSize=26;horizontalStack=0;resizeParent=1;resizeParentMax=0;resizeLast=0;collapsible=1;marginBottom=0;fillColor=#dae8fc;strokeColor=#6c8ebf;fontSize=12;verticalAlign=middle;direction=east;&quot; vertex=&quot;1&quot; parent=&quot;1&quot;&gt;&#10;            &lt;mxGeometry x=&quot;590&quot; y=&quot;390&quot; width=&quot;140&quot; height=&quot;50&quot; as=&quot;geometry&quot; /&gt;&#10;          &lt;/mxCell&gt;&#10;        &lt;/UserObject&gt;&#10;        &lt;UserObject label=&quot;Numerical variable&quot; link=&quot;#NumericalVariable&quot; id=&quot;12&quot;&gt;&#10;          &lt;mxCell style=&quot;swimlane;fontStyle=0;childLayout=stackLayout;horizontal=1;startSize=30;horizontalStack=0;resizeParent=1;resizeParentMax=0;resizeLast=0;collapsible=1;marginBottom=0;fillColor=#dae8fc;strokeColor=#6c8ebf;fontSize=12;verticalAlign=middle;&quot; vertex=&quot;1&quot; parent=&quot;1&quot;&gt;&#10;            &lt;mxGeometry x=&quot;230&quot; y=&quot;400&quot; width=&quot;140&quot; height=&quot;110&quot; as=&quot;geometry&quot;&gt;&#10;              &lt;mxRectangle x=&quot;220&quot; y=&quot;749&quot; width=&quot;150&quot; height=&quot;40&quot; as=&quot;alternateBounds&quot; /&gt;&#10;            &lt;/mxGeometry&gt;&#10;          &lt;/mxCell&gt;&#10;        &lt;/UserObject&gt;&#10;        &lt;UserObject label=&quot;has numerical value&quot; link=&quot;#hasNumericalValue&quot; id=&quot;13&quot;&gt;&#10;          &lt;mxCell style=&quot;text;strokeColor=none;fillColor=none;align=left;verticalAlign=middle;spacingLeft=4;spacingRight=4;overflow=hidden;rotatable=0;points=[[0,0.5],[1,0.5]];portConstraint=eastwest;&quot; vertex=&quot;1&quot; parent=&quot;12&quot;&gt;&#10;            &lt;mxGeometry y=&quot;30&quot; width=&quot;140&quot; height=&quot;20&quot; as=&quot;geometry&quot; /&gt;&#10;          &lt;/mxCell&gt;&#10;        &lt;/UserObject&gt;&#10;        &lt;UserObject label=&quot;has minimum value&quot; link=&quot;#hasMinimumValue&quot; id=&quot;14&quot;&gt;&#10;          &lt;mxCell style=&quot;text;strokeColor=none;fillColor=none;align=left;verticalAlign=middle;spacingLeft=4;spacingRight=4;overflow=hidden;rotatable=0;points=[[0,0.5],[1,0.5]];portConstraint=eastwest;&quot; vertex=&quot;1&quot; parent=&quot;12&quot;&gt;&#10;            &lt;mxGeometry y=&quot;50&quot; width=&quot;140&quot; height=&quot;20&quot; as=&quot;geometry&quot; /&gt;&#10;          &lt;/mxCell&gt;&#10;        &lt;/UserObject&gt;&#10;        &lt;UserObject label=&quot;has maximum value&quot; link=&quot;#hasMaximumValue&quot; id=&quot;15&quot;&gt;&#10;          &lt;mxCell style=&quot;text;strokeColor=none;fillColor=none;align=left;verticalAlign=middle;spacingLeft=4;spacingRight=4;overflow=hidden;rotatable=0;points=[[0,0.5],[1,0.5]];portConstraint=eastwest;&quot; vertex=&quot;1&quot; parent=&quot;12&quot;&gt;&#10;            &lt;mxGeometry y=&quot;70&quot; width=&quot;140&quot; height=&quot;20&quot; as=&quot;geometry&quot; /&gt;&#10;          &lt;/mxCell&gt;&#10;        &lt;/UserObject&gt;&#10;        &lt;UserObject label=&quot;has step size&quot; link=&quot;#hasStepSize&quot; id=&quot;16&quot;&gt;&#10;          &lt;mxCell style=&quot;text;strokeColor=none;fillColor=none;align=left;verticalAlign=middle;spacingLeft=4;spacingRight=4;overflow=hidden;rotatable=0;points=[[0,0.5],[1,0.5]];portConstraint=eastwest;&quot; vertex=&quot;1&quot; parent=&quot;12&quot;&gt;&#10;            &lt;mxGeometry y=&quot;90&quot; width=&quot;140&quot; height=&quot;20&quot; as=&quot;geometry&quot; /&gt;&#10;          &lt;/mxCell&gt;&#10;        &lt;/UserObject&gt;&#10;        &lt;UserObject label=&quot;has kind of quantity&quot; link=&quot;#hasKindOfQuantity&quot; id=&quot;17&quot;&gt;&#10;          &lt;mxCell style=&quot;endArrow=classic;html=1;edgeStyle=orthogonalEdgeStyle;horizontal=1;fontSize=11;verticalAlign=middle;fontStyle=4&quot; edge=&quot;1&quot; source=&quot;12&quot; target=&quot;11&quot; parent=&quot;1&quot;&gt;&#10;            &lt;mxGeometry x=&quot;-0.3636&quot; width=&quot;50&quot; height=&quot;50&quot; relative=&quot;1&quot; as=&quot;geometry&quot;&gt;&#10;              &lt;mxPoint x=&quot;731&quot; y=&quot;402.95000000000005&quot; as=&quot;sourcePoint&quot; /&gt;&#10;              &lt;mxPoint x=&quot;480&quot; y=&quot;353.95000000000005&quot; as=&quot;targetPoint&quot; /&gt;&#10;              &lt;mxPoint as=&quot;offset&quot; /&gt;&#10;              &lt;Array as=&quot;points&quot;&gt;&#10;                &lt;mxPoint x=&quot;430&quot; y=&quot;415&quot; /&gt;&#10;                &lt;mxPoint x=&quot;430&quot; y=&quot;415&quot; /&gt;&#10;              &lt;/Array&gt;&#10;            &lt;/mxGeometry&gt;&#10;          &lt;/mxCell&gt;&#10;        &lt;/UserObject&gt;&#10;        &lt;UserObject label=&quot;Unit&quot; link=&quot;#http://qudt.org/schema/qudt/Unit&quot; id=&quot;18&quot;&gt;&#10;          &lt;mxCell style=&quot;swimlane;fontStyle=0;childLayout=stackLayout;horizontal=1;startSize=26;horizontalStack=0;resizeParent=1;resizeParentMax=0;resizeLast=0;collapsible=1;marginBottom=0;fillColor=#dae8fc;strokeColor=#6c8ebf;fontSize=12;verticalAlign=middle;&quot; vertex=&quot;1&quot; parent=&quot;1&quot;&gt;&#10;            &lt;mxGeometry x=&quot;590&quot; y=&quot;446&quot; width=&quot;140&quot; height=&quot;50&quot; as=&quot;geometry&quot; /&gt;&#10;          &lt;/mxCell&gt;&#10;        &lt;/UserObject&gt;&#10;        &lt;UserObject label=&quot;has unit&quot; link=&quot;#hasUnit&quot; id=&quot;19&quot;&gt;&#10;          &lt;mxCell style=&quot;endArrow=classic;html=1;edgeStyle=orthogonalEdgeStyle;fontSize=11;verticalAlign=middle;fontStyle=4&quot; edge=&quot;1&quot; source=&quot;12&quot; target=&quot;18&quot; parent=&quot;1&quot;&gt;&#10;            &lt;mxGeometry x=&quot;-0.6364&quot; width=&quot;50&quot; height=&quot;50&quot; relative=&quot;1&quot; as=&quot;geometry&quot;&gt;&#10;              &lt;mxPoint x=&quot;314.97999999999996&quot; y=&quot;692.902&quot; as=&quot;sourcePoint&quot; /&gt;&#10;              &lt;mxPoint x=&quot;279.97999999999996&quot; y=&quot;633.95&quot; as=&quot;targetPoint&quot; /&gt;&#10;              &lt;Array as=&quot;points&quot;&gt;&#10;                &lt;mxPoint x=&quot;430&quot; y=&quot;460&quot; /&gt;&#10;                &lt;mxPoint x=&quot;430&quot; y=&quot;460&quot; /&gt;&#10;              &lt;/Array&gt;&#10;              &lt;mxPoint as=&quot;offset&quot; /&gt;&#10;            &lt;/mxGeometry&gt;&#10;          &lt;/mxCell&gt;&#10;        &lt;/UserObject&gt;&#10;        &lt;UserObject label=&quot;Expanded uncertainty&quot; link=&quot;#https://ptb.de/si/ExpandedUnc&quot; id=&quot;20&quot;&gt;&#10;          &lt;mxCell style=&quot;swimlane;fontStyle=0;childLayout=stackLayout;horizontal=1;startSize=26;horizontalStack=0;resizeParent=1;resizeParentMax=0;resizeLast=0;collapsible=1;marginBottom=0;fillColor=#dae8fc;strokeColor=#6c8ebf;verticalAlign=middle;&quot; vertex=&quot;1&quot; parent=&quot;1&quot;&gt;&#10;            &lt;mxGeometry x=&quot;509.86&quot; y=&quot;610&quot; width=&quot;140&quot; height=&quot;66&quot; as=&quot;geometry&quot; /&gt;&#10;          &lt;/mxCell&gt;&#10;        &lt;/UserObject&gt;&#10;        &lt;UserObject label=&quot;has coverage factor&quot; link=&quot;#https://ptb.de/si/hasCoverageFactor&quot; id=&quot;21&quot;&gt;&#10;          &lt;mxCell style=&quot;text;strokeColor=none;fillColor=none;align=left;verticalAlign=middle;spacingLeft=4;spacingRight=4;overflow=hidden;rotatable=0;points=[[0,0.5],[1,0.5]];portConstraint=eastwest;&quot; vertex=&quot;1&quot; parent=&quot;20&quot;&gt;&#10;            &lt;mxGeometry y=&quot;26&quot; width=&quot;140&quot; height=&quot;20&quot; as=&quot;geometry&quot; /&gt;&#10;          &lt;/mxCell&gt;&#10;        &lt;/UserObject&gt;&#10;        &lt;UserObject label=&quot;has uncertainty&quot; link=&quot;#https://ptb.de/si/hasUncertainty&quot; id=&quot;22&quot;&gt;&#10;          &lt;mxCell style=&quot;text;strokeColor=none;fillColor=none;align=left;verticalAlign=middle;spacingLeft=4;spacingRight=4;overflow=hidden;rotatable=0;points=[[0,0.5],[1,0.5]];portConstraint=eastwest;&quot; vertex=&quot;1&quot; parent=&quot;20&quot;&gt;&#10;            &lt;mxGeometry y=&quot;46&quot; width=&quot;140&quot; height=&quot;20&quot; as=&quot;geometry&quot; /&gt;&#10;          &lt;/mxCell&gt;&#10;        &lt;/UserObject&gt;&#10;        &lt;mxCell id=&quot;23&quot; value=&quot;&quot; style=&quot;endArrow=block;html=1;edgeStyle=orthogonalEdgeStyle;endFill=0;exitX=0.5;exitY=0;exitDx=0;exitDy=0;verticalAlign=middle;entryX=0.499;entryY=0.997;entryDx=0;entryDy=0;entryPerimeter=0;&quot; edge=&quot;1&quot; source=&quot;12&quot; target=&quot;7&quot; parent=&quot;1&quot;&gt;&#10;          &lt;mxGeometry width=&quot;50&quot; height=&quot;50&quot; relative=&quot;1&quot; as=&quot;geometry&quot;&gt;&#10;            &lt;mxPoint x=&quot;595&quot; y=&quot;614&quot; as=&quot;sourcePoint&quot; /&gt;&#10;            &lt;mxPoint x=&quot;310&quot; y=&quot;370&quot; as=&quot;targetPoint&quot; /&gt;&#10;            &lt;Array as=&quot;points&quot;&gt;&#10;              &lt;mxPoint x=&quot;300&quot; y=&quot;380&quot; /&gt;&#10;              &lt;mxPoint x=&quot;300&quot; y=&quot;380&quot; /&gt;&#10;            &lt;/Array&gt;&#10;          &lt;/mxGeometry&gt;&#10;        &lt;/mxCell&gt;&#10;        &lt;mxCell id=&quot;24&quot; value=&quot;is a&quot; style=&quot;edgeLabel;html=1;align=center;verticalAlign=middle;resizable=0;points=[];fontSize=11;fontStyle=0&quot; vertex=&quot;1&quot; connectable=&quot;0&quot; parent=&quot;23&quot;&gt;&#10;          &lt;mxGeometry x=&quot;0.0718&quot; y=&quot;-1&quot; relative=&quot;1&quot; as=&quot;geometry&quot;&gt;&#10;            &lt;mxPoint x=&quot;-1&quot; y=&quot;3&quot; as=&quot;offset&quot; /&gt;&#10;          &lt;/mxGeometry&gt;&#10;        &lt;/mxCell&gt;&#10;        &lt;UserObject label=&quot;Coverage interval&quot; link=&quot;#https://ptb.de/si/CoverageInterval&quot; id=&quot;25&quot;&gt;&#10;          &lt;mxCell style=&quot;swimlane;fontStyle=0;childLayout=stackLayout;horizontal=1;startSize=26;horizontalStack=0;resizeParent=1;resizeParentMax=0;resizeLast=0;collapsible=1;marginBottom=0;fillColor=#dae8fc;strokeColor=#6c8ebf;verticalAlign=middle;&quot; vertex=&quot;1&quot; parent=&quot;1&quot;&gt;&#10;            &lt;mxGeometry x=&quot;669.86&quot; y=&quot;610&quot; width=&quot;140&quot; height=&quot;86&quot; as=&quot;geometry&quot; /&gt;&#10;          &lt;/mxCell&gt;&#10;        &lt;/UserObject&gt;&#10;        &lt;UserObject label=&quot;has standard uncertainty&quot; link=&quot;# https://ptb.de/si/hasStandardUnc&quot; id=&quot;26&quot;&gt;&#10;          &lt;mxCell style=&quot;text;strokeColor=none;fillColor=none;align=left;verticalAlign=middle;spacingLeft=4;spacingRight=4;overflow=hidden;rotatable=0;points=[[0,0.5],[1,0.5]];portConstraint=eastwest;&quot; vertex=&quot;1&quot; parent=&quot;25&quot;&gt;&#10;            &lt;mxGeometry y=&quot;26&quot; width=&quot;140&quot; height=&quot;20&quot; as=&quot;geometry&quot; /&gt;&#10;          &lt;/mxCell&gt;&#10;        &lt;/UserObject&gt;&#10;        &lt;UserObject label=&quot;has interval maximum&quot; link=&quot;#https://ptb.de/si/hasIntervalMax&quot; id=&quot;27&quot;&gt;&#10;          &lt;mxCell style=&quot;text;strokeColor=none;fillColor=none;align=left;verticalAlign=middle;spacingLeft=4;spacingRight=4;overflow=hidden;rotatable=0;points=[[0,0.5],[1,0.5]];portConstraint=eastwest;&quot; vertex=&quot;1&quot; parent=&quot;25&quot;&gt;&#10;            &lt;mxGeometry y=&quot;46&quot; width=&quot;140&quot; height=&quot;20&quot; as=&quot;geometry&quot; /&gt;&#10;          &lt;/mxCell&gt;&#10;        &lt;/UserObject&gt;&#10;        &lt;UserObject label=&quot;has interval minimum&quot; link=&quot;#https://ptb.de/si/hasIntervalMin&quot; id=&quot;28&quot;&gt;&#10;          &lt;mxCell style=&quot;text;strokeColor=none;fillColor=none;align=left;verticalAlign=middle;spacingLeft=4;spacingRight=4;overflow=hidden;rotatable=0;points=[[0,0.5],[1,0.5]];portConstraint=eastwest;&quot; vertex=&quot;1&quot; parent=&quot;25&quot;&gt;&#10;            &lt;mxGeometry y=&quot;66&quot; width=&quot;140&quot; height=&quot;20&quot; as=&quot;geometry&quot; /&gt;&#10;          &lt;/mxCell&gt;&#10;        &lt;/UserObject&gt;&#10;        &lt;mxCell id=&quot;29&quot; value=&quot;is a&quot; style=&quot;edgeStyle=orthogonalEdgeStyle;rounded=1;orthogonalLoop=1;jettySize=auto;html=1;exitX=0.75;exitY=0;exitDx=0;exitDy=0;endArrow=block;endFill=0;spacingTop=5;fontSize=11;verticalAlign=middle;entryX=1;entryY=0.5;entryDx=0;entryDy=0;fontStyle=0&quot; edge=&quot;1&quot; source=&quot;25&quot; target=&quot;10&quot; parent=&quot;1&quot;&gt;&#10;          &lt;mxGeometry x=&quot;-0.1594&quot; y=&quot;4&quot; relative=&quot;1&quot; as=&quot;geometry&quot;&gt;&#10;            &lt;mxPoint x=&quot;494.86&quot; y=&quot;654.95&quot; as=&quot;targetPoint&quot; /&gt;&#10;            &lt;Array as=&quot;points&quot;&gt;&#10;              &lt;mxPoint x=&quot;774.86&quot; y=&quot;586&quot; /&gt;&#10;            &lt;/Array&gt;&#10;            &lt;mxPoint as=&quot;offset&quot; /&gt;&#10;          &lt;/mxGeometry&gt;&#10;        &lt;/mxCell&gt;&#10;        &lt;UserObject label=&quot;&quot; link=&quot;#hasCoverageInterval&quot; id=&quot;30&quot;&gt;&#10;          &lt;mxCell style=&quot;edgeStyle=segmentEdgeStyle;endArrow=classic;html=1;verticalAlign=middle;&quot; edge=&quot;1&quot; source=&quot;12&quot; target=&quot;25&quot; parent=&quot;1&quot;&gt;&#10;            &lt;mxGeometry width=&quot;50&quot; height=&quot;50&quot; relative=&quot;1&quot; as=&quot;geometry&quot;&gt;&#10;              &lt;mxPoint x=&quot;389.8400000000001&quot; y=&quot;560.4780000000001&quot; as=&quot;sourcePoint&quot; /&gt;&#10;              &lt;mxPoint x=&quot;279.97999999999996&quot; y=&quot;862.95&quot; as=&quot;targetPoint&quot; /&gt;&#10;              &lt;Array as=&quot;points&quot;&gt;&#10;                &lt;mxPoint x=&quot;340&quot; y=&quot;686&quot; /&gt;&#10;              &lt;/Array&gt;&#10;            &lt;/mxGeometry&gt;&#10;          &lt;/mxCell&gt;&#10;        &lt;/UserObject&gt;&#10;        &lt;UserObject label=&quot;has coverage interval&quot; link=&quot;#hasCoverageInterval&quot; id=&quot;31&quot;&gt;&#10;          &lt;mxCell style=&quot;edgeLabel;html=1;align=center;verticalAlign=middle;resizable=0;points=[];horizontal=1;fontSize=11;fontStyle=4&quot; vertex=&quot;1&quot; connectable=&quot;0&quot; parent=&quot;30&quot;&gt;&#10;            &lt;mxGeometry x=&quot;0.2776&quot; y=&quot;-3&quot; relative=&quot;1&quot; as=&quot;geometry&quot;&gt;&#10;              &lt;mxPoint x=&quot;-73&quot; y=&quot;-3&quot; as=&quot;offset&quot; /&gt;&#10;            &lt;/mxGeometry&gt;&#10;          &lt;/mxCell&gt;&#10;        &lt;/UserObject&gt;&#10;        &lt;UserObject label=&quot;&quot; link=&quot;#hasExpandedUnc&quot; id=&quot;32&quot;&gt;&#10;          &lt;mxCell style=&quot;edgeStyle=segmentEdgeStyle;endArrow=classic;html=1;verticalAlign=middle;&quot; edge=&quot;1&quot; source=&quot;12&quot; target=&quot;20&quot; parent=&quot;1&quot;&gt;&#10;            &lt;mxGeometry width=&quot;50&quot; height=&quot;50&quot; relative=&quot;1&quot; as=&quot;geometry&quot;&gt;&#10;              &lt;mxPoint x=&quot;389.8400000000001&quot; y=&quot;560.4299999999998&quot; as=&quot;sourcePoint&quot; /&gt;&#10;              &lt;mxPoint x=&quot;498.97999999999996&quot; y=&quot;865.95&quot; as=&quot;targetPoint&quot; /&gt;&#10;              &lt;Array as=&quot;points&quot;&gt;&#10;                &lt;mxPoint x=&quot;340&quot; y=&quot;620&quot; /&gt;&#10;              &lt;/Array&gt;&#10;            &lt;/mxGeometry&gt;&#10;          &lt;/mxCell&gt;&#10;        &lt;/UserObject&gt;&#10;        &lt;UserObject label=&quot;has expanded uncertainty&quot; link=&quot;#hasExpandedUnc&quot; id=&quot;33&quot;&gt;&#10;          &lt;mxCell style=&quot;edgeLabel;html=1;align=center;verticalAlign=middle;resizable=0;points=[];horizontal=1;fontSize=11;fontStyle=4&quot; vertex=&quot;1&quot; connectable=&quot;0&quot; parent=&quot;32&quot;&gt;&#10;            &lt;mxGeometry x=&quot;0.2907&quot; relative=&quot;1&quot; as=&quot;geometry&quot;&gt;&#10;              &lt;mxPoint x=&quot;3&quot; as=&quot;offset&quot; /&gt;&#10;            &lt;/mxGeometry&gt;&#10;          &lt;/mxCell&gt;&#10;        &lt;/UserObject&gt;&#10;        &lt;mxCell id=&quot;34&quot; value=&quot;is a&quot; style=&quot;edgeStyle=orthogonalEdgeStyle;rounded=1;orthogonalLoop=1;jettySize=auto;html=1;exitX=0.25;exitY=0;exitDx=0;exitDy=0;endArrow=block;endFill=0;spacingTop=5;fontSize=11;verticalAlign=middle;entryX=0;entryY=0.5;entryDx=0;entryDy=0;fontStyle=0&quot; edge=&quot;1&quot; source=&quot;20&quot; target=&quot;10&quot; parent=&quot;1&quot;&gt;&#10;          &lt;mxGeometry x=&quot;-0.1594&quot; y=&quot;-4&quot; relative=&quot;1&quot; as=&quot;geometry&quot;&gt;&#10;            &lt;mxPoint x=&quot;464.88&quot; y=&quot;724.95&quot; as=&quot;sourcePoint&quot; /&gt;&#10;            &lt;mxPoint x=&quot;659.88&quot; y=&quot;644.95&quot; as=&quot;targetPoint&quot; /&gt;&#10;            &lt;Array as=&quot;points&quot;&gt;&#10;              &lt;mxPoint x=&quot;544.86&quot; y=&quot;586&quot; /&gt;&#10;            &lt;/Array&gt;&#10;            &lt;mxPoint as=&quot;offset&quot; /&gt;&#10;          &lt;/mxGeometry&gt;&#10;        &lt;/mxCell&gt;&#10;        &lt;UserObject label=&quot;has uncertainty declaration&quot; link=&quot;#hasUncertaintyDeclaration&quot; linkTarget=&quot;_blank&quot; id=&quot;35&quot;&gt;&#10;          &lt;mxCell style=&quot;endArrow=classic;html=1;edgeStyle=orthogonalEdgeStyle;fontSize=11;verticalAlign=middle;fontStyle=4&quot; edge=&quot;1&quot; source=&quot;12&quot; target=&quot;8&quot; parent=&quot;1&quot;&gt;&#10;            &lt;mxGeometry x=&quot;-0.2139&quot; width=&quot;50&quot; height=&quot;50&quot; relative=&quot;1&quot; as=&quot;geometry&quot;&gt;&#10;              &lt;mxPoint x=&quot;389.8400000000001&quot; y=&quot;552.238&quot; as=&quot;sourcePoint&quot; /&gt;&#10;              &lt;mxPoint x=&quot;304.97999999999996&quot; y=&quot;537.95&quot; as=&quot;targetPoint&quot; /&gt;&#10;              &lt;mxPoint as=&quot;offset&quot; /&gt;&#10;              &lt;Array as=&quot;points&quot;&gt;&#10;                &lt;mxPoint x=&quot;340&quot; y=&quot;540&quot; /&gt;&#10;              &lt;/Array&gt;&#10;            &lt;/mxGeometry&gt;&#10;          &lt;/mxCell&gt;&#10;        &lt;/UserObject&gt;&#10;        &lt;UserObject label=&quot;&quot; link=&quot;#hasParameter&quot; id=&quot;36&quot;&gt;&#10;          &lt;mxCell style=&quot;edgeStyle=orthogonalEdgeStyle;rounded=1;orthogonalLoop=1;jettySize=auto;html=1;exitX=0.5;exitY=1;exitDx=0;exitDy=0;entryX=0.5;entryY=0;entryDx=0;entryDy=0;verticalAlign=middle;&quot; edge=&quot;1&quot; source=&quot;42&quot; target=&quot;5&quot; parent=&quot;1&quot;&gt;&#10;            &lt;mxGeometry relative=&quot;1&quot; as=&quot;geometry&quot;&gt;&#10;              &lt;mxPoint x=&quot;319&quot; y=&quot;369&quot; as=&quot;targetPoint&quot; /&gt;&#10;              &lt;Array as=&quot;points&quot;&gt;&#10;                &lt;mxPoint x=&quot;180&quot; y=&quot;280&quot; /&gt;&#10;                &lt;mxPoint x=&quot;300&quot; y=&quot;280&quot; /&gt;&#10;              &lt;/Array&gt;&#10;            &lt;/mxGeometry&gt;&#10;          &lt;/mxCell&gt;&#10;        &lt;/UserObject&gt;&#10;        &lt;UserObject label=&quot;has parameter&quot; link=&quot;#hasParameter&quot; id=&quot;37&quot;&gt;&#10;          &lt;mxCell style=&quot;edgeStyle=orthogonalEdgeStyle;rounded=1;orthogonalLoop=1;jettySize=auto;html=1;exitX=0.5;exitY=1;exitDx=0;exitDy=0;entryX=0.5;entryY=0;entryDx=0;entryDy=0;verticalAlign=middle;fontStyle=4&quot; edge=&quot;1&quot; source=&quot;43&quot; target=&quot;5&quot; parent=&quot;1&quot;&gt;&#10;            &lt;mxGeometry x=&quot;0.75&quot; relative=&quot;1&quot; as=&quot;geometry&quot;&gt;&#10;              &lt;mxPoint x=&quot;389&quot; y=&quot;369&quot; as=&quot;targetPoint&quot; /&gt;&#10;              &lt;mxPoint as=&quot;offset&quot; /&gt;&#10;              &lt;Array as=&quot;points&quot;&gt;&#10;                &lt;mxPoint x=&quot;420&quot; y=&quot;280&quot; /&gt;&#10;                &lt;mxPoint x=&quot;300&quot; y=&quot;280&quot; /&gt;&#10;              &lt;/Array&gt;&#10;            &lt;/mxGeometry&gt;&#10;          &lt;/mxCell&gt;&#10;        &lt;/UserObject&gt;&#10;        &lt;UserObject label=&quot;Text variable&quot; link=&quot;#TextVariable&quot; id=&quot;38&quot;&gt;&#10;          &lt;mxCell style=&quot;swimlane;fontStyle=0;childLayout=stackLayout;horizontal=1;startSize=26;horizontalStack=0;resizeParent=1;resizeParentMax=0;resizeLast=0;collapsible=1;marginBottom=0;fillColor=#dae8fc;strokeColor=#6c8ebf;verticalAlign=middle;&quot; vertex=&quot;1&quot; parent=&quot;1&quot;&gt;&#10;            &lt;mxGeometry x=&quot;50&quot; y=&quot;400&quot; width=&quot;140&quot; height=&quot;46&quot; as=&quot;geometry&quot; /&gt;&#10;          &lt;/mxCell&gt;&#10;        &lt;/UserObject&gt;&#10;        &lt;UserObject label=&quot;has string value&quot; link=&quot;#hasStringValue&quot; id=&quot;39&quot;&gt;&#10;          &lt;mxCell style=&quot;text;strokeColor=none;fillColor=none;align=left;verticalAlign=middle;spacingLeft=4;spacingRight=4;overflow=hidden;rotatable=0;points=[[0,0.5],[1,0.5]];portConstraint=eastwest;&quot; vertex=&quot;1&quot; parent=&quot;38&quot;&gt;&#10;            &lt;mxGeometry y=&quot;26&quot; width=&quot;140&quot; height=&quot;20&quot; as=&quot;geometry&quot; /&gt;&#10;          &lt;/mxCell&gt;&#10;        &lt;/UserObject&gt;&#10;        &lt;mxCell id=&quot;40&quot; value=&quot;is a&quot; style=&quot;endArrow=block;edgeStyle=orthogonalEdgeStyle;endFill=0;exitX=0.5;exitY=0;exitDx=0;exitDy=0;entryX=0.254;entryY=1.005;entryDx=0;entryDy=0;verticalAlign=middle;entryPerimeter=0;fontStyle=0&quot; edge=&quot;1&quot; source=&quot;38&quot; target=&quot;7&quot; parent=&quot;1&quot;&gt;&#10;          &lt;mxGeometry width=&quot;50&quot; height=&quot;50&quot; relative=&quot;1&quot; as=&quot;geometry&quot;&gt;&#10;            &lt;mxPoint x=&quot;181&quot; y=&quot;636&quot; as=&quot;sourcePoint&quot; /&gt;&#10;            &lt;mxPoint x=&quot;280&quot; y=&quot;390&quot; as=&quot;targetPoint&quot; /&gt;&#10;            &lt;Array as=&quot;points&quot;&gt;&#10;              &lt;mxPoint x=&quot;120&quot; y=&quot;380&quot; /&gt;&#10;              &lt;mxPoint x=&quot;266&quot; y=&quot;380&quot; /&gt;&#10;            &lt;/Array&gt;&#10;          &lt;/mxGeometry&gt;&#10;        &lt;/mxCell&gt;&#10;        &lt;UserObject label=&quot;implemented by&quot; link=&quot;#implementedBy&quot; id=&quot;41&quot;&gt;&#10;          &lt;mxCell style=&quot;edgeStyle=orthogonalEdgeStyle;rounded=0;orthogonalLoop=1;jettySize=auto;html=1;exitX=1;exitY=0.25;exitDx=0;exitDy=0;entryX=0;entryY=0.25;entryDx=0;entryDy=0;verticalAlign=middle;fontStyle=4&quot; edge=&quot;1&quot; source=&quot;42&quot; target=&quot;43&quot; parent=&quot;1&quot;&gt;&#10;            &lt;mxGeometry relative=&quot;1&quot; as=&quot;geometry&quot; /&gt;&#10;          &lt;/mxCell&gt;&#10;        &lt;/UserObject&gt;&#10;        &lt;UserObject label=&quot;Method&quot; link=&quot;#Method&quot; id=&quot;42&quot;&gt;&#10;          &lt;mxCell style=&quot;swimlane;fontStyle=0;childLayout=stackLayout;horizontal=1;startSize=26;horizontalStack=0;resizeParent=1;resizeParentMax=0;resizeLast=0;collapsible=1;marginBottom=0;fillColor=#fff2cc;strokeColor=#d6b656;verticalAlign=middle;&quot; vertex=&quot;1&quot; parent=&quot;1&quot;&gt;&#10;            &lt;mxGeometry x=&quot;110&quot; y=&quot;210&quot; width=&quot;140&quot; height=&quot;50&quot; as=&quot;geometry&quot; /&gt;&#10;          &lt;/mxCell&gt;&#10;        &lt;/UserObject&gt;&#10;        &lt;UserObject label=&quot;Tool&quot; link=&quot;#Tool&quot; id=&quot;43&quot;&gt;&#10;          &lt;mxCell style=&quot;swimlane;fontStyle=0;childLayout=stackLayout;horizontal=1;startSize=26;horizontalStack=0;resizeParent=1;resizeParentMax=0;resizeLast=0;collapsible=1;marginBottom=0;fillColor=#fff2cc;strokeColor=#d6b656;verticalAlign=middle;&quot; vertex=&quot;1&quot; parent=&quot;1&quot;&gt;&#10;            &lt;mxGeometry x=&quot;350&quot; y=&quot;210&quot; width=&quot;140&quot; height=&quot;50&quot; as=&quot;geometry&quot; /&gt;&#10;          &lt;/mxCell&gt;&#10;        &lt;/UserObject&gt;&#10;        &lt;UserObject label=&quot;implements&quot; link=&quot;#implements&quot; id=&quot;44&quot;&gt;&#10;          &lt;mxCell style=&quot;edgeStyle=orthogonalEdgeStyle;rounded=0;orthogonalLoop=1;jettySize=auto;html=1;exitX=1;exitY=0.75;exitDx=0;exitDy=0;entryX=0;entryY=0.75;entryDx=0;entryDy=0;startArrow=classic;startFill=1;endArrow=none;endFill=0;verticalAlign=middle;fontStyle=4&quot; edge=&quot;1&quot; source=&quot;42&quot; target=&quot;43&quot; parent=&quot;1&quot;&gt;&#10;            &lt;mxGeometry x=&quot;0.0118&quot; relative=&quot;1&quot; as=&quot;geometry&quot;&gt;&#10;              &lt;mxPoint x=&quot;291&quot; y=&quot;246&quot; as=&quot;sourcePoint&quot; /&gt;&#10;              &lt;mxPoint x=&quot;401&quot; y=&quot;246&quot; as=&quot;targetPoint&quot; /&gt;&#10;              &lt;mxPoint as=&quot;offset&quot; /&gt;&#10;            &lt;/mxGeometry&gt;&#10;          &lt;/mxCell&gt;&#10;        &lt;/UserObject&gt;&#10;        &lt;mxCell id=&quot;45&quot; value=&quot;&quot; style=&quot;group&quot; vertex=&quot;1&quot; connectable=&quot;0&quot; parent=&quot;1&quot;&gt;&#10;          &lt;mxGeometry x=&quot;490&quot; y=&quot;380&quot; width=&quot;250&quot; height=&quot;130&quot; as=&quot;geometry&quot; /&gt;&#10;        &lt;/mxCell&gt;&#10;        &lt;mxCell id=&quot;46&quot; value=&quot;&quot; style=&quot;rounded=0;whiteSpace=wrap;html=1;fillColor=none;strokeColor=#FF33FF;dashed=1;verticalAlign=middle;&quot; vertex=&quot;1&quot; parent=&quot;45&quot;&gt;&#10;          &lt;mxGeometry width=&quot;250&quot; height=&quot;130&quot; as=&quot;geometry&quot; /&gt;&#10;        &lt;/mxCell&gt;&#10;        &lt;mxCell id=&quot;47&quot; value=&quot;&amp;lt;b&amp;gt;&amp;lt;font&amp;gt;QUDT&amp;lt;/font&amp;gt;&amp;lt;/b&amp;gt;&quot; style=&quot;text;html=1;strokeColor=none;fillColor=none;align=center;verticalAlign=middle;whiteSpace=wrap;rounded=0;fontColor=#FF33FF;&quot; vertex=&quot;1&quot; parent=&quot;45&quot;&gt;&#10;          &lt;mxGeometry width=&quot;40&quot; height=&quot;20&quot; as=&quot;geometry&quot; /&gt;&#10;        &lt;/mxCell&gt;&#10;      &lt;/root&gt;&#10;    &lt;/mxGraphModel&gt;&#10;  &lt;/diagram&gt;&#10;&lt;/mxfile&gt;&#10;" style="background-color: rgb(255, 255, 255);"><defs><clipPath id="mx-clip-184-116-132-20-0"><rect x="184" y="116" width="132" height="20"/></clipPath><clipPath id="mx-clip-184-136-132-20-0"><rect x="184" y="136" width="132" height="20"/></clipPath><clipPath id="mx-clip-544-346-132-20-0"><rect x="544" y="346" width="132" height="20"/></clipPath><clipPath id="mx-clip-544-366-132-20-0"><rect x="544" y="366" width="132" height="20"/></clipPath><clipPath id="mx-clip-184-220-132-20-0"><rect x="184" y="220" width="132" height="20"/></clipPath><clipPath id="mx-clip-184-240-132-20-0"><rect x="184" y="240" width="132" height="20"/></clipPath><clipPath id="mx-clip-184-260-132-20-0"><rect x="184" y="260" width="132" height="20"/></clipPath><clipPath id="mx-clip-184-280-132-20-0"><rect x="184" y="280" width="132" height="20"/></clipPath><clipPath id="mx-clip-464-426-132-20-0"><rect x="464" y="426" width="132" height="20"/></clipPath><clipPath id="mx-clip-464-446-132-20-0"><rect x="464" y="446" width="132" height="20"/></clipPath><clipPath id="mx-clip-624-426-132-20-0"><rect x="624" y="426" width="132" height="20"/></clipPath><clipPath id="mx-clip-624-446-132-20-0"><rect x="624" y="446" width="132" height="20"/></clipPath><clipPath id="mx-clip-624-466-132-20-0"><rect x="624" y="466" width="132" height="20"/></clipPath><clipPath id="mx-clip-4-216-132-20-0"><rect x="4" y="216" width="132" height="20"/></clipPath></defs><rect fill="#ffffff" width="100%" height="100%" x="0" y="0"/><g><g data-cell-id="0"><g data-cell-id="1"><g data-cell-id="4dCZw6B6W82sYAjBPajG-47"/><g data-cell-id="4dCZw6B6W82sYAjBPajG-14"><g data-cell-id="4dCZw6B6W82sYAjBPajG-16"/></g><g data-cell-id="MCqLrkwaRwdILURwViHq-1"><g/><g data-cell-id="wAnAnFlkNdK7Y5vFdeTG-25"><g><rect x="439.86" y="310" width="330" height="190" fill="none" stroke="#00994d" stroke-dasharray="3 3" pointer-events="all"/></g></g><g data-cell-id="wAnAnFlkNdK7Y5vFdeTG-29"><g><rect x="439.86" y="310" width="40" height="20" fill="none" stroke="none" pointer-events="all"/></g><g><g transform="translate(-0.5 -0.5)"><switch><foreignObject pointer-events="none" width="100%" height="100%" requiredFeatures="http://www.w3.org/TR/SVG11/feature#Extensibility" style="overflow: visible; text-align: left;"><div xmlns="http://www.w3.org/1999/xhtml" style="display: flex; align-items: unsafe center; justify-content: unsafe center; width: 38px; height: 1px; padding-top: 320px; margin-left: 441px;"><div data-drawio-colors="color: rgb(0, 0, 0); " style="box-sizing: border-box; font-size: 0px; text-align: center;"><div style="display: inline-block; font-size: 12px; font-family: Helvetica; color: rgb(0, 0, 0); line-height: 1.2; pointer-events: all; white-space: normal; overflow-wrap: normal;"><b><font color="#00994d">D-SI</font></b></div></div></div></foreignObject><text x="460" y="324" fill="rgb(0, 0, 0)" font-family="&quot;Helvetica&quot;" font-size="12px" text-anchor="middle">D-SI</text></switch></g></g></g></g><g data-cell-id="NNVuIOWM0AHgZY2DdkeC-1"><a xlink:href="file:///C:/Program%20Files/draw.io/resources/app.asar/drawio/src/main/webapp/index.html?dev=0&amp;test=0&amp;gapi=0&amp;db=0&amp;od=0&amp;gh=0&amp;gl=0&amp;tr=0&amp;browser=0&amp;picker=0&amp;mode=device&amp;export=https%3A%2F%2Fconvert.diagrams.net%2Fnode%2Fexport&amp;disableUpdate=0&amp;enableSpellCheck=0&amp;enableStoreBkp=1&amp;isGoogleFontsEnabled=0&amp;appLang=de#http://www.molmod.info/semantics/pims-ii.ttl#Variable"><g><path d="M 180 116 L 180 90 L 320 90 L 320 116" fill="#dae8fc" stroke="#6c8ebf" stroke-miterlimit="10" pointer-events="all"/><path d="M 180 116 L 180 156 L 320 156 L 320 116" fill="none" stroke="#6c8ebf" stroke-miterlimit="10"/><path d="M 180 116 L 320 116" fill="none" stroke="#6c8ebf" stroke-miterlimit="10"/></g><g><g fill="rgb(0, 0, 0)" font-family="&quot;Helvetica&quot;" text-anchor="middle" font-size="12px"><text x="249.5" y="107.5">Variable</text></g></g></a><g data-cell-id="NNVuIOWM0AHgZY2DdkeC-2"><a xlink:href="file:///C:/Program%20Files/draw.io/resources/app.asar/drawio/src/main/webapp/index.html?dev=0&amp;test=0&amp;gapi=0&amp;db=0&amp;od=0&amp;gh=0&amp;gl=0&amp;tr=0&amp;browser=0&amp;picker=0&amp;mode=device&amp;export=https%3A%2F%2Fconvert.diagrams.net%2Fnode%2Fexport&amp;disableUpdate=0&amp;enableSpellCheck=0&amp;enableStoreBkp=1&amp;isGoogleFontsEnabled=0&amp;appLang=de#hasSymbol"><g><rect x="180" y="116" width="140" height="20" fill="none" stroke="none" pointer-events="all"/></g><g><g fill="rgb(0, 0, 0)" font-family="&quot;Helvetica&quot;" clip-path="url(#mx-clip-184-116-132-20-0)" font-size="12px"><text x="185.5" y="130.5">has symbol</text></g></g></a></g><g data-cell-id="NNVuIOWM0AHgZY2DdkeC-3"><a xlink:href="file:///C:/Program%20Files/draw.io/resources/app.asar/drawio/src/main/webapp/index.html?dev=0&amp;test=0&amp;gapi=0&amp;db=0&amp;od=0&amp;gh=0&amp;gl=0&amp;tr=0&amp;browser=0&amp;picker=0&amp;mode=device&amp;export=https%3A%2F%2Fconvert.diagrams.net%2Fnode%2Fexport&amp;disableUpdate=0&amp;enableSpellCheck=0&amp;enableStoreBkp=1&amp;isGoogleFontsEnabled=0&amp;appLang=de#hasVariableDescription"><g><rect x="180" y="136" width="140" height="20" fill="none" stroke="none" pointer-events="all"/></g><g><g fill="rgb(0, 0, 0)" font-family="&quot;Helvetica&quot;" clip-path="url(#mx-clip-184-136-132-20-0)" font-size="12px"><text x="185.5" y="150.5">has variable description</text></g></g></a></g></g><g data-cell-id="NNVuIOWM0AHgZY2DdkeC-6"><a xlink:href="file:///C:/Program%20Files/draw.io/resources/app.asar/drawio/src/main/webapp/index.html?dev=0&amp;test=0&amp;gapi=0&amp;db=0&amp;od=0&amp;gh=0&amp;gl=0&amp;tr=0&amp;browser=0&amp;picker=0&amp;mode=device&amp;export=https%3A%2F%2Fconvert.diagrams.net%2Fnode%2Fexport&amp;disableUpdate=0&amp;enableSpellCheck=0&amp;enableStoreBkp=1&amp;isGoogleFontsEnabled=0&amp;appLang=de#UncertaintyDeclaration"><g><path d="M 539.86 346 L 539.86 320 L 679.86 320 L 679.86 346" fill="#dae8fc" stroke="#6c8ebf" stroke-miterlimit="10" pointer-events="all"/><path d="M 539.86 346 L 539.86 386 L 679.86 386 L 679.86 346" fill="none" stroke="#6c8ebf" stroke-miterlimit="10"/><path d="M 539.86 346 L 679.86 346" fill="none" stroke="#6c8ebf" stroke-miterlimit="10"/></g><g><g fill="rgb(0, 0, 0)" font-family="&quot;Helvetica&quot;" text-anchor="middle" font-size="12px"><text x="609.36" y="337.5">Uncertainty declaration</text></g></g></a><g data-cell-id="NNVuIOWM0AHgZY2DdkeC-7"><a xlink:href="file:///C:/Program%20Files/draw.io/resources/app.asar/drawio/src/main/webapp/index.html?dev=0&amp;test=0&amp;gapi=0&amp;db=0&amp;od=0&amp;gh=0&amp;gl=0&amp;tr=0&amp;browser=0&amp;picker=0&amp;mode=device&amp;export=https%3A%2F%2Fconvert.diagrams.net%2Fnode%2Fexport&amp;disableUpdate=0&amp;enableSpellCheck=0&amp;enableStoreBkp=1&amp;isGoogleFontsEnabled=0&amp;appLang=de#https://ptb.de/si/hasCoverageProbability"><g><rect x="539.86" y="346" width="140" height="20" fill="none" stroke="none" pointer-events="all"/></g><g><g fill="rgb(0, 0, 0)" font-family="&quot;Helvetica&quot;" clip-path="url(#mx-clip-544-346-132-20-0)" font-size="12px"><text x="545.36" y="360.5">has coverage probability</text></g></g></a></g><g data-cell-id="NNVuIOWM0AHgZY2DdkeC-8"><a xlink:href="file:///C:/Program%20Files/draw.io/resources/app.asar/drawio/src/main/webapp/index.html?dev=0&amp;test=0&amp;gapi=0&amp;db=0&amp;od=0&amp;gh=0&amp;gl=0&amp;tr=0&amp;browser=0&amp;picker=0&amp;mode=device&amp;export=https%3A%2F%2Fconvert.diagrams.net%2Fnode%2Fexport&amp;disableUpdate=0&amp;enableSpellCheck=0&amp;enableStoreBkp=1&amp;isGoogleFontsEnabled=0&amp;appLang=de#https://ptb.de/si/hasDistribution"><g><rect x="539.86" y="366" width="140" height="20" fill="none" stroke="none" pointer-events="all"/></g><g><g fill="rgb(0, 0, 0)" font-family="&quot;Helvetica&quot;" clip-path="url(#mx-clip-544-366-132-20-0)" font-size="12px"><text x="545.36" y="380.5">has statistical distribution</text></g></g></a></g></g><g data-cell-id="NNVuIOWM0AHgZY2DdkeC-9"><a xlink:href="file:///C:/Program%20Files/draw.io/resources/app.asar/drawio/src/main/webapp/index.html?dev=0&amp;test=0&amp;gapi=0&amp;db=0&amp;od=0&amp;gh=0&amp;gl=0&amp;tr=0&amp;browser=0&amp;picker=0&amp;mode=device&amp;export=https%3A%2F%2Fconvert.diagrams.net%2Fnode%2Fexport&amp;disableUpdate=0&amp;enableSpellCheck=0&amp;enableStoreBkp=1&amp;isGoogleFontsEnabled=0&amp;appLang=de#http://qudt.org/schema/qudt/QuantityKind"><g><path d="M 540 206 L 540 180 L 680 180 L 680 206" fill="#dae8fc" stroke="#6c8ebf" stroke-miterlimit="10" pointer-events="all"/><path d="M 540 206 L 540 230 L 680 230 L 680 206" fill="none" stroke="#6c8ebf" stroke-miterlimit="10"/><path d="M 540 206 L 680 206" fill="none" stroke="#6c8ebf" stroke-miterlimit="10"/></g><g><g fill="rgb(0, 0, 0)" font-family="&quot;Helvetica&quot;" text-anchor="middle" font-size="12px"><text x="609.5" y="197.5">Quantity kind</text></g></g></a></g><g data-cell-id="NNVuIOWM0AHgZY2DdkeC-10"><a xlink:href="file:///C:/Program%20Files/draw.io/resources/app.asar/drawio/src/main/webapp/index.html?dev=0&amp;test=0&amp;gapi=0&amp;db=0&amp;od=0&amp;gh=0&amp;gl=0&amp;tr=0&amp;browser=0&amp;picker=0&amp;mode=device&amp;export=https%3A%2F%2Fconvert.diagrams.net%2Fnode%2Fexport&amp;disableUpdate=0&amp;enableSpellCheck=0&amp;enableStoreBkp=1&amp;isGoogleFontsEnabled=0&amp;appLang=de#NumericalVariable"><g><path d="M 180 220 L 180 190 L 320 190 L 320 220" fill="#dae8fc" stroke="#6c8ebf" stroke-miterlimit="10" pointer-events="all"/><path d="M 180 220 L 180 300 L 320 300 L 320 220" fill="none" stroke="#6c8ebf" stroke-miterlimit="10"/><path d="M 180 220 L 320 220" fill="none" stroke="#6c8ebf" stroke-miterlimit="10"/></g><g><g fill="rgb(0, 0, 0)" font-family="&quot;Helvetica&quot;" text-anchor="middle" font-size="12px"><text x="249.5" y="209.5">Numerical variable</text></g></g></a><g data-cell-id="wAnAnFlkNdK7Y5vFdeTG-22"><a xlink:href="file:///C:/Program%20Files/draw.io/resources/app.asar/drawio/src/main/webapp/index.html?dev=0&amp;test=0&amp;gapi=0&amp;db=0&amp;od=0&amp;gh=0&amp;gl=0&amp;tr=0&amp;browser=0&amp;picker=0&amp;mode=device&amp;export=https%3A%2F%2Fconvert.diagrams.net%2Fnode%2Fexport&amp;disableUpdate=0&amp;enableSpellCheck=0&amp;enableStoreBkp=1&amp;isGoogleFontsEnabled=0&amp;appLang=de#hasNumericalValue"><g><rect x="180" y="220" width="140" height="20" fill="none" stroke="none" pointer-events="all"/></g><g><g fill="rgb(0, 0, 0)" font-family="&quot;Helvetica&quot;" clip-path="url(#mx-clip-184-220-132-20-0)" font-size="12px"><text x="185.5" y="234.5">has numerical value</text></g></g></a></g><g data-cell-id="NNVuIOWM0AHgZY2DdkeC-11"><a xlink:href="file:///C:/Program%20Files/draw.io/resources/app.asar/drawio/src/main/webapp/index.html?dev=0&amp;test=0&amp;gapi=0&amp;db=0&amp;od=0&amp;gh=0&amp;gl=0&amp;tr=0&amp;browser=0&amp;picker=0&amp;mode=device&amp;export=https%3A%2F%2Fconvert.diagrams.net%2Fnode%2Fexport&amp;disableUpdate=0&amp;enableSpellCheck=0&amp;enableStoreBkp=1&amp;isGoogleFontsEnabled=0&amp;appLang=de#hasMinimumValue"><g><rect x="180" y="240" width="140" height="20" fill="none" stroke="none" pointer-events="all"/></g><g><g fill="rgb(0, 0, 0)" font-family="&quot;Helvetica&quot;" clip-path="url(#mx-clip-184-240-132-20-0)" font-size="12px"><text x="185.5" y="254.5">has minimum value</text></g></g></a></g><g data-cell-id="8Kx_RdFwWASuP0lmvdKQ-1"><a xlink:href="file:///C:/Program%20Files/draw.io/resources/app.asar/drawio/src/main/webapp/index.html?dev=0&amp;test=0&amp;gapi=0&amp;db=0&amp;od=0&amp;gh=0&amp;gl=0&amp;tr=0&amp;browser=0&amp;picker=0&amp;mode=device&amp;export=https%3A%2F%2Fconvert.diagrams.net%2Fnode%2Fexport&amp;disableUpdate=0&amp;enableSpellCheck=0&amp;enableStoreBkp=1&amp;isGoogleFontsEnabled=0&amp;appLang=de#hasMaximumValue"><g><rect x="180" y="260" width="140" height="20" fill="none" stroke="none" pointer-events="all"/></g><g><g fill="rgb(0, 0, 0)" font-family="&quot;Helvetica&quot;" clip-path="url(#mx-clip-184-260-132-20-0)" font-size="12px"><text x="185.5" y="274.5">has maximum value</text></g></g></a></g><g data-cell-id="8Kx_RdFwWASuP0lmvdKQ-2"><a xlink:href="file:///C:/Program%20Files/draw.io/resources/app.asar/drawio/src/main/webapp/index.html?dev=0&amp;test=0&amp;gapi=0&amp;db=0&amp;od=0&amp;gh=0&amp;gl=0&amp;tr=0&amp;browser=0&amp;picker=0&amp;mode=device&amp;export=https%3A%2F%2Fconvert.diagrams.net%2Fnode%2Fexport&amp;disableUpdate=0&amp;enableSpellCheck=0&amp;enableStoreBkp=1&amp;isGoogleFontsEnabled=0&amp;appLang=de#hasStepSize"><g><rect x="180" y="280" width="140" height="20" fill="none" stroke="none" pointer-events="all"/></g><g><g fill="rgb(0, 0, 0)" font-family="&quot;Helvetica&quot;" clip-path="url(#mx-clip-184-280-132-20-0)" font-size="12px"><text x="185.5" y="294.5">has step size</text></g></g></a></g></g><g data-cell-id="NNVuIOWM0AHgZY2DdkeC-18"><a xlink:href="file:///C:/Program%20Files/draw.io/resources/app.asar/drawio/src/main/webapp/index.html?dev=0&amp;test=0&amp;gapi=0&amp;db=0&amp;od=0&amp;gh=0&amp;gl=0&amp;tr=0&amp;browser=0&amp;picker=0&amp;mode=device&amp;export=https%3A%2F%2Fconvert.diagrams.net%2Fnode%2Fexport&amp;disableUpdate=0&amp;enableSpellCheck=0&amp;enableStoreBkp=1&amp;isGoogleFontsEnabled=0&amp;appLang=de#hasKindOfQuantity"><g><path d="M 320 205 L 370 205 Q 380 205 390 205 L 533.63 205" fill="none" stroke="rgb(0, 0, 0)" stroke-miterlimit="10" pointer-events="stroke"/><path d="M 538.88 205 L 531.88 208.5 L 533.63 205 L 531.88 201.5 Z" fill="rgb(0, 0, 0)" stroke="rgb(0, 0, 0)" stroke-miterlimit="10" pointer-events="all"/></g><g><g transform="translate(-0.5 -0.5)"><switch><foreignObject pointer-events="none" width="100%" height="100%" requiredFeatures="http://www.w3.org/TR/SVG11/feature#Extensibility" style="overflow: visible; text-align: left;"><div xmlns="http://www.w3.org/1999/xhtml" style="display: flex; align-items: unsafe center; justify-content: unsafe center; width: 1px; height: 1px; padding-top: 205px; margin-left: 390px;"><div data-drawio-colors="color: rgb(0, 0, 0); background-color: rgb(255, 255, 255); " style="box-sizing: border-box; font-size: 0px; text-align: center;"><div style="display: inline-block; font-size: 11px; font-family: Helvetica; color: rgb(0, 0, 0); line-height: 1.2; pointer-events: all; text-decoration: underline; background-color: rgb(255, 255, 255); white-space: nowrap;">has kind of quantity</div></div></div></foreignObject><text x="390" y="208" fill="rgb(0, 0, 0)" font-family="&quot;Helvetica&quot;" font-size="11px" text-anchor="middle" text-decoration="underline">has kind o...</text></switch></g></g></a></g><g data-cell-id="NNVuIOWM0AHgZY2DdkeC-19"><a xlink:href="file:///C:/Program%20Files/draw.io/resources/app.asar/drawio/src/main/webapp/index.html?dev=0&amp;test=0&amp;gapi=0&amp;db=0&amp;od=0&amp;gh=0&amp;gl=0&amp;tr=0&amp;browser=0&amp;picker=0&amp;mode=device&amp;export=https%3A%2F%2Fconvert.diagrams.net%2Fnode%2Fexport&amp;disableUpdate=0&amp;enableSpellCheck=0&amp;enableStoreBkp=1&amp;isGoogleFontsEnabled=0&amp;appLang=de#http://qudt.org/schema/qudt/Unit"><g><path d="M 540 262 L 540 236 L 680 236 L 680 262" fill="#dae8fc" stroke="#6c8ebf" stroke-miterlimit="10" pointer-events="all"/><path d="M 540 262 L 540 286 L 680 286 L 680 262" fill="none" stroke="#6c8ebf" stroke-miterlimit="10"/><path d="M 540 262 L 680 262" fill="none" stroke="#6c8ebf" stroke-miterlimit="10"/></g><g><g fill="rgb(0, 0, 0)" font-family="&quot;Helvetica&quot;" text-anchor="middle" font-size="12px"><text x="609.5" y="253.5">Unit</text></g></g></a></g><g data-cell-id="NNVuIOWM0AHgZY2DdkeC-20"><a xlink:href="file:///C:/Program%20Files/draw.io/resources/app.asar/drawio/src/main/webapp/index.html?dev=0&amp;test=0&amp;gapi=0&amp;db=0&amp;od=0&amp;gh=0&amp;gl=0&amp;tr=0&amp;browser=0&amp;picker=0&amp;mode=device&amp;export=https%3A%2F%2Fconvert.diagrams.net%2Fnode%2Fexport&amp;disableUpdate=0&amp;enableSpellCheck=0&amp;enableStoreBkp=1&amp;isGoogleFontsEnabled=0&amp;appLang=de#hasUnit"><g><path d="M 320 250 L 370 250 Q 380 250 390 250 L 533.63 250" fill="none" stroke="rgb(0, 0, 0)" stroke-miterlimit="10" pointer-events="stroke"/><path d="M 538.88 250 L 531.88 253.5 L 533.63 250 L 531.88 246.5 Z" fill="rgb(0, 0, 0)" stroke="rgb(0, 0, 0)" stroke-miterlimit="10" pointer-events="all"/></g><g><g transform="translate(-0.5 -0.5)"><switch><foreignObject pointer-events="none" width="100%" height="100%" requiredFeatures="http://www.w3.org/TR/SVG11/feature#Extensibility" style="overflow: visible; text-align: left;"><div xmlns="http://www.w3.org/1999/xhtml" style="display: flex; align-items: unsafe center; justify-content: unsafe center; width: 1px; height: 1px; padding-top: 250px; margin-left: 360px;"><div data-drawio-colors="color: rgb(0, 0, 0); background-color: rgb(255, 255, 255); " style="box-sizing: border-box; font-size: 0px; text-align: center;"><div style="display: inline-block; font-size: 11px; font-family: Helvetica; color: rgb(0, 0, 0); line-height: 1.2; pointer-events: all; text-decoration: underline; background-color: rgb(255, 255, 255); white-space: nowrap;">has unit</div></div></div></foreignObject><text x="360" y="253" fill="rgb(0, 0, 0)" font-family="&quot;Helvetica&quot;" font-size="11px" text-anchor="middle" text-decoration="underline">has unit</text></switch></g></g></a></g><g data-cell-id="NNVuIOWM0AHgZY2DdkeC-24"><a xlink:href="file:///C:/Program%20Files/draw.io/resources/app.asar/drawio/src/main/webapp/index.html?dev=0&amp;test=0&amp;gapi=0&amp;db=0&amp;od=0&amp;gh=0&amp;gl=0&amp;tr=0&amp;browser=0&amp;picker=0&amp;mode=device&amp;export=https%3A%2F%2Fconvert.diagrams.net%2Fnode%2Fexport&amp;disableUpdate=0&amp;enableSpellCheck=0&amp;enableStoreBkp=1&amp;isGoogleFontsEnabled=0&amp;appLang=de#https://ptb.de/si/ExpandedUnc"><g><path d="M 459.86 426 L 459.86 400 L 599.86 400 L 599.86 426" fill="#dae8fc" stroke="#6c8ebf" stroke-miterlimit="10" pointer-events="all"/><path d="M 459.86 426 L 459.86 466 L 599.86 466 L 599.86 426" fill="none" stroke="#6c8ebf" stroke-miterlimit="10"/><path d="M 459.86 426 L 599.86 426" fill="none" stroke="#6c8ebf" stroke-miterlimit="10"/></g><g><g fill="rgb(0, 0, 0)" font-family="&quot;Helvetica&quot;" text-anchor="middle" font-size="12px"><text x="529.36" y="417.5">Expanded uncertainty</text></g></g></a><g data-cell-id="NNVuIOWM0AHgZY2DdkeC-25"><a xlink:href="file:///C:/Program%20Files/draw.io/resources/app.asar/drawio/src/main/webapp/index.html?dev=0&amp;test=0&amp;gapi=0&amp;db=0&amp;od=0&amp;gh=0&amp;gl=0&amp;tr=0&amp;browser=0&amp;picker=0&amp;mode=device&amp;export=https%3A%2F%2Fconvert.diagrams.net%2Fnode%2Fexport&amp;disableUpdate=0&amp;enableSpellCheck=0&amp;enableStoreBkp=1&amp;isGoogleFontsEnabled=0&amp;appLang=de#https://ptb.de/si/hasCoverageFactor"><g><rect x="459.86" y="426" width="140" height="20" fill="none" stroke="none" pointer-events="all"/></g><g><g fill="rgb(0, 0, 0)" font-family="&quot;Helvetica&quot;" clip-path="url(#mx-clip-464-426-132-20-0)" font-size="12px"><text x="465.36" y="440.5">has coverage factor</text></g></g></a></g><g data-cell-id="NNVuIOWM0AHgZY2DdkeC-26"><a xlink:href="file:///C:/Program%20Files/draw.io/resources/app.asar/drawio/src/main/webapp/index.html?dev=0&amp;test=0&amp;gapi=0&amp;db=0&amp;od=0&amp;gh=0&amp;gl=0&amp;tr=0&amp;browser=0&amp;picker=0&amp;mode=device&amp;export=https%3A%2F%2Fconvert.diagrams.net%2Fnode%2Fexport&amp;disableUpdate=0&amp;enableSpellCheck=0&amp;enableStoreBkp=1&amp;isGoogleFontsEnabled=0&amp;appLang=de#https://ptb.de/si/hasUncertainty"><g><rect x="459.86" y="446" width="140" height="20" fill="none" stroke="none" pointer-events="all"/></g><g><g fill="rgb(0, 0, 0)" font-family="&quot;Helvetica&quot;" clip-path="url(#mx-clip-464-446-132-20-0)" font-size="12px"><text x="465.36" y="460.5">has uncertainty</text></g></g></a></g></g><g data-cell-id="NNVuIOWM0AHgZY2DdkeC-27"><g><path d="M 250 190 L 250 180 Q 250 170 249.97 167.03 L 249.94 164.06" fill="none" stroke="rgb(0, 0, 0)" stroke-miterlimit="10" pointer-events="stroke"/><path d="M 249.87 157.06 L 253.44 164.02 L 246.44 164.09 Z" fill="none" stroke="rgb(0, 0, 0)" stroke-miterlimit="10" pointer-events="all"/></g><g data-cell-id="NNVuIOWM0AHgZY2DdkeC-28"><g><g transform="translate(-0.5 -0.5)"><switch><foreignObject pointer-events="none" width="100%" height="100%" requiredFeatures="http://www.w3.org/TR/SVG11/feature#Extensibility" style="overflow: visible; text-align: left;"><div xmlns="http://www.w3.org/1999/xhtml" style="display: flex; align-items: unsafe center; justify-content: unsafe center; width: 1px; height: 1px; padding-top: 176px; margin-left: 251px;"><div data-drawio-colors="color: rgb(0, 0, 0); background-color: rgb(255, 255, 255); " style="box-sizing: border-box; font-size: 0px; text-align: center;"><div style="display: inline-block; font-size: 11px; font-family: Helvetica; color: rgb(0, 0, 0); line-height: 1.2; pointer-events: all; background-color: rgb(255, 255, 255); white-space: nowrap;">is a</div></div></div></foreignObject><text x="251" y="179" fill="rgb(0, 0, 0)" font-family="&quot;Helvetica&quot;" font-size="11px" text-anchor="middle">is a</text></switch></g></g></g></g><g data-cell-id="NNVuIOWM0AHgZY2DdkeC-29"><a xlink:href="file:///C:/Program%20Files/draw.io/resources/app.asar/drawio/src/main/webapp/index.html?dev=0&amp;test=0&amp;gapi=0&amp;db=0&amp;od=0&amp;gh=0&amp;gl=0&amp;tr=0&amp;browser=0&amp;picker=0&amp;mode=device&amp;export=https%3A%2F%2Fconvert.diagrams.net%2Fnode%2Fexport&amp;disableUpdate=0&amp;enableSpellCheck=0&amp;enableStoreBkp=1&amp;isGoogleFontsEnabled=0&amp;appLang=de#https://ptb.de/si/CoverageInterval"><g><path d="M 619.86 426 L 619.86 400 L 759.86 400 L 759.86 426" fill="#dae8fc" stroke="#6c8ebf" stroke-miterlimit="10" pointer-events="all"/><path d="M 619.86 426 L 619.86 486 L 759.86 486 L 759.86 426" fill="none" stroke="#6c8ebf" stroke-miterlimit="10"/><path d="M 619.86 426 L 759.86 426" fill="none" stroke="#6c8ebf" stroke-miterlimit="10"/></g><g><g fill="rgb(0, 0, 0)" font-family="&quot;Helvetica&quot;" text-anchor="middle" font-size="12px"><text x="689.36" y="417.5">Coverage interval</text></g></g></a><g data-cell-id="NNVuIOWM0AHgZY2DdkeC-30"><a xlink:href="file:///C:/Program%20Files/draw.io/resources/app.asar/drawio/src/main/webapp/index.html?dev=0&amp;test=0&amp;gapi=0&amp;db=0&amp;od=0&amp;gh=0&amp;gl=0&amp;tr=0&amp;browser=0&amp;picker=0&amp;mode=device&amp;export=https%3A%2F%2Fconvert.diagrams.net%2Fnode%2Fexport&amp;disableUpdate=0&amp;enableSpellCheck=0&amp;enableStoreBkp=1&amp;isGoogleFontsEnabled=0&amp;appLang=de# https://ptb.de/si/hasStandardUnc"><g><rect x="619.86" y="426" width="140" height="20" fill="none" stroke="none" pointer-events="all"/></g><g><g fill="rgb(0, 0, 0)" font-family="&quot;Helvetica&quot;" clip-path="url(#mx-clip-624-426-132-20-0)" font-size="12px"><text x="625.36" y="440.5">has standard uncertainty</text></g></g></a></g><g data-cell-id="NNVuIOWM0AHgZY2DdkeC-31"><a xlink:href="file:///C:/Program%20Files/draw.io/resources/app.asar/drawio/src/main/webapp/index.html?dev=0&amp;test=0&amp;gapi=0&amp;db=0&amp;od=0&amp;gh=0&amp;gl=0&amp;tr=0&amp;browser=0&amp;picker=0&amp;mode=device&amp;export=https%3A%2F%2Fconvert.diagrams.net%2Fnode%2Fexport&amp;disableUpdate=0&amp;enableSpellCheck=0&amp;enableStoreBkp=1&amp;isGoogleFontsEnabled=0&amp;appLang=de#https://ptb.de/si/hasIntervalMax"><g><rect x="619.86" y="446" width="140" height="20" fill="none" stroke="none" pointer-events="all"/></g><g><g fill="rgb(0, 0, 0)" font-family="&quot;Helvetica&quot;" clip-path="url(#mx-clip-624-446-132-20-0)" font-size="12px"><text x="625.36" y="460.5">has interval maximum</text></g></g></a></g><g data-cell-id="NNVuIOWM0AHgZY2DdkeC-32"><a xlink:href="file:///C:/Program%20Files/draw.io/resources/app.asar/drawio/src/main/webapp/index.html?dev=0&amp;test=0&amp;gapi=0&amp;db=0&amp;od=0&amp;gh=0&amp;gl=0&amp;tr=0&amp;browser=0&amp;picker=0&amp;mode=device&amp;export=https%3A%2F%2Fconvert.diagrams.net%2Fnode%2Fexport&amp;disableUpdate=0&amp;enableSpellCheck=0&amp;enableStoreBkp=1&amp;isGoogleFontsEnabled=0&amp;appLang=de#https://ptb.de/si/hasIntervalMin"><g><rect x="619.86" y="466" width="140" height="20" fill="none" stroke="none" pointer-events="all"/></g><g><g fill="rgb(0, 0, 0)" font-family="&quot;Helvetica&quot;" clip-path="url(#mx-clip-624-466-132-20-0)" font-size="12px"><text x="625.36" y="480.5">has interval minimum</text></g></g></a></g></g><g data-cell-id="NNVuIOWM0AHgZY2DdkeC-34"><g><path d="M 724.86 400 L 724.88 386 Q 724.9 376 714.9 376 L 687.98 376" fill="none" stroke="rgb(0, 0, 0)" stroke-miterlimit="10" pointer-events="stroke"/><path d="M 680.98 376 L 687.98 372.5 L 687.98 379.5 Z" fill="none" stroke="rgb(0, 0, 0)" stroke-miterlimit="10" pointer-events="all"/></g><g><g transform="translate(-0.5 -0.5)"><switch><foreignObject pointer-events="none" width="100%" height="100%" requiredFeatures="http://www.w3.org/TR/SVG11/feature#Extensibility" style="overflow: visible; text-align: left;"><div xmlns="http://www.w3.org/1999/xhtml" style="display: flex; align-items: unsafe center; justify-content: unsafe center; width: 1px; height: 1px; padding-top: 383px; margin-left: 720px;"><div data-drawio-colors="color: rgb(0, 0, 0); background-color: rgb(255, 255, 255); " style="box-sizing: border-box; font-size: 0px; text-align: center;"><div style="display: inline-block; font-size: 11px; font-family: Helvetica; color: rgb(0, 0, 0); line-height: 1.2; pointer-events: all; background-color: rgb(255, 255, 255); white-space: nowrap;">is a</div></div></div></foreignObject><text x="720" y="386" fill="rgb(0, 0, 0)" font-family="&quot;Helvetica&quot;" font-size="11px" text-anchor="middle">is a</text></switch></g></g></g><g data-cell-id="nTTSXxFIunqc8R1kV0SP-5"><a xlink:href="file:///C:/Program%20Files/draw.io/resources/app.asar/drawio/src/main/webapp/index.html?dev=0&amp;test=0&amp;gapi=0&amp;db=0&amp;od=0&amp;gh=0&amp;gl=0&amp;tr=0&amp;browser=0&amp;picker=0&amp;mode=device&amp;export=https%3A%2F%2Fconvert.diagrams.net%2Fnode%2Fexport&amp;disableUpdate=0&amp;enableSpellCheck=0&amp;enableStoreBkp=1&amp;isGoogleFontsEnabled=0&amp;appLang=de#hasCoverageInterval"><g><path d="M 290 300 L 290 466 Q 290 476 300 476 L 613.49 476" fill="none" stroke="rgb(0, 0, 0)" stroke-miterlimit="10" pointer-events="stroke"/><path d="M 618.74 476 L 611.74 479.5 L 613.49 476 L 611.74 472.5 Z" fill="rgb(0, 0, 0)" stroke="rgb(0, 0, 0)" stroke-miterlimit="10" pointer-events="all"/></g></a><g data-cell-id="nTTSXxFIunqc8R1kV0SP-9"><a xlink:href="file:///C:/Program%20Files/draw.io/resources/app.asar/drawio/src/main/webapp/index.html?dev=0&amp;test=0&amp;gapi=0&amp;db=0&amp;od=0&amp;gh=0&amp;gl=0&amp;tr=0&amp;browser=0&amp;picker=0&amp;mode=device&amp;export=https%3A%2F%2Fconvert.diagrams.net%2Fnode%2Fexport&amp;disableUpdate=0&amp;enableSpellCheck=0&amp;enableStoreBkp=1&amp;isGoogleFontsEnabled=0&amp;appLang=de#hasCoverageInterval"><g><g transform="translate(-0.5 -0.5)"><switch><foreignObject pointer-events="none" width="100%" height="100%" requiredFeatures="http://www.w3.org/TR/SVG11/feature#Extensibility" style="overflow: visible; text-align: left;"><div xmlns="http://www.w3.org/1999/xhtml" style="display: flex; align-items: unsafe center; justify-content: unsafe center; width: 1px; height: 1px; padding-top: 477px; margin-left: 365px;"><div data-drawio-colors="color: rgb(0, 0, 0); background-color: rgb(255, 255, 255); " style="box-sizing: border-box; font-size: 0px; text-align: center;"><div style="display: inline-block; font-size: 11px; font-family: Helvetica; color: rgb(0, 0, 0); line-height: 1.2; pointer-events: all; text-decoration: underline; background-color: rgb(255, 255, 255); white-space: nowrap;">has coverage interval</div></div></div></foreignObject><text x="365" y="480" fill="rgb(0, 0, 0)" font-family="&quot;Helvetica&quot;" font-size="11px" text-anchor="middle" text-decoration="underline">has coverage interval</text></switch></g></g></a></g></g><g data-cell-id="nTTSXxFIunqc8R1kV0SP-6"><a xlink:href="file:///C:/Program%20Files/draw.io/resources/app.asar/drawio/src/main/webapp/index.html?dev=0&amp;test=0&amp;gapi=0&amp;db=0&amp;od=0&amp;gh=0&amp;gl=0&amp;tr=0&amp;browser=0&amp;picker=0&amp;mode=device&amp;export=https%3A%2F%2Fconvert.diagrams.net%2Fnode%2Fexport&amp;disableUpdate=0&amp;enableSpellCheck=0&amp;enableStoreBkp=1&amp;isGoogleFontsEnabled=0&amp;appLang=de#hasExpandedUnc"><g><path d="M 290 300 L 290 400 Q 290 410 300 410 L 453.49 410" fill="none" stroke="rgb(0, 0, 0)" stroke-miterlimit="10" pointer-events="stroke"/><path d="M 458.74 410 L 451.74 413.5 L 453.49 410 L 451.74 406.5 Z" fill="rgb(0, 0, 0)" stroke="rgb(0, 0, 0)" stroke-miterlimit="10" pointer-events="all"/></g></a><g data-cell-id="nTTSXxFIunqc8R1kV0SP-10"><a xlink:href="file:///C:/Program%20Files/draw.io/resources/app.asar/drawio/src/main/webapp/index.html?dev=0&amp;test=0&amp;gapi=0&amp;db=0&amp;od=0&amp;gh=0&amp;gl=0&amp;tr=0&amp;browser=0&amp;picker=0&amp;mode=device&amp;export=https%3A%2F%2Fconvert.diagrams.net%2Fnode%2Fexport&amp;disableUpdate=0&amp;enableSpellCheck=0&amp;enableStoreBkp=1&amp;isGoogleFontsEnabled=0&amp;appLang=de#hasExpandedUnc"><g><g transform="translate(-0.5 -0.5)"><switch><foreignObject pointer-events="none" width="100%" height="100%" requiredFeatures="http://www.w3.org/TR/SVG11/feature#Extensibility" style="overflow: visible; text-align: left;"><div xmlns="http://www.w3.org/1999/xhtml" style="display: flex; align-items: unsafe center; justify-content: unsafe center; width: 1px; height: 1px; padding-top: 411px; margin-left: 365px;"><div data-drawio-colors="color: rgb(0, 0, 0); background-color: rgb(255, 255, 255); " style="box-sizing: border-box; font-size: 0px; text-align: center;"><div style="display: inline-block; font-size: 11px; font-family: Helvetica; color: rgb(0, 0, 0); line-height: 1.2; pointer-events: all; text-decoration: underline; background-color: rgb(255, 255, 255); white-space: nowrap;">has expanded uncertainty</div></div></div></foreignObject><text x="365" y="414" fill="rgb(0, 0, 0)" font-family="&quot;Helvetica&quot;" font-size="11px" text-anchor="middle" text-decoration="underline">has expanded uncertainty</text></switch></g></g></a></g></g><g data-cell-id="nTTSXxFIunqc8R1kV0SP-8"><g><path d="M 494.86 400 L 494.88 386 Q 494.9 376 504.9 376 L 531.74 376" fill="none" stroke="rgb(0, 0, 0)" stroke-miterlimit="10" pointer-events="stroke"/><path d="M 538.74 376 L 531.74 379.5 L 531.74 372.5 Z" fill="none" stroke="rgb(0, 0, 0)" stroke-miterlimit="10" pointer-events="all"/></g><g><g transform="translate(-0.5 -0.5)"><switch><foreignObject pointer-events="none" width="100%" height="100%" requiredFeatures="http://www.w3.org/TR/SVG11/feature#Extensibility" style="overflow: visible; text-align: left;"><div xmlns="http://www.w3.org/1999/xhtml" style="display: flex; align-items: unsafe center; justify-content: unsafe center; width: 1px; height: 1px; padding-top: 383px; margin-left: 500px;"><div data-drawio-colors="color: rgb(0, 0, 0); background-color: rgb(255, 255, 255); " style="box-sizing: border-box; font-size: 0px; text-align: center;"><div style="display: inline-block; font-size: 11px; font-family: Helvetica; color: rgb(0, 0, 0); line-height: 1.2; pointer-events: all; background-color: rgb(255, 255, 255); white-space: nowrap;">is a</div></div></div></foreignObject><text x="500" y="386" fill="rgb(0, 0, 0)" font-family="&quot;Helvetica&quot;" font-size="11px" text-anchor="middle">is a</text></switch></g></g></g><g data-cell-id="NNVuIOWM0AHgZY2DdkeC-17"><a xlink:href="file:///C:/Program%20Files/draw.io/resources/app.asar/drawio/src/main/webapp/index.html?dev=0&amp;test=0&amp;gapi=0&amp;db=0&amp;od=0&amp;gh=0&amp;gl=0&amp;tr=0&amp;browser=0&amp;picker=0&amp;mode=device&amp;export=https%3A%2F%2Fconvert.diagrams.net%2Fnode%2Fexport&amp;disableUpdate=0&amp;enableSpellCheck=0&amp;enableStoreBkp=1&amp;isGoogleFontsEnabled=0&amp;appLang=de#hasUncertaintyDeclaration" target="_blank"><g><path d="M 290 300 L 290 320 Q 290 330 300 330 L 533.49 330" fill="none" stroke="rgb(0, 0, 0)" stroke-miterlimit="10" pointer-events="stroke"/><path d="M 538.74 330 L 531.74 333.5 L 533.49 330 L 531.74 326.5 Z" fill="rgb(0, 0, 0)" stroke="rgb(0, 0, 0)" stroke-miterlimit="10" pointer-events="all"/></g><g><g transform="translate(-0.5 -0.5)"><switch><foreignObject pointer-events="none" width="100%" height="100%" requiredFeatures="http://www.w3.org/TR/SVG11/feature#Extensibility" style="overflow: visible; text-align: left;"><div xmlns="http://www.w3.org/1999/xhtml" style="display: flex; align-items: unsafe center; justify-content: unsafe center; width: 1px; height: 1px; padding-top: 330px; margin-left: 370px;"><div data-drawio-colors="color: rgb(0, 0, 0); background-color: rgb(255, 255, 255); " style="box-sizing: border-box; font-size: 0px; text-align: center;"><div style="display: inline-block; font-size: 11px; font-family: Helvetica; color: rgb(0, 0, 0); line-height: 1.2; pointer-events: all; text-decoration: underline; background-color: rgb(255, 255, 255); white-space: nowrap;">has uncertainty declaration</div></div></div></foreignObject><text x="370" y="333" fill="rgb(0, 0, 0)" font-family="&quot;Helvetica&quot;" font-size="11px" text-anchor="middle" text-decoration="underline">has uncert...</text></switch></g></g></a></g><g data-cell-id="-WgzllDmIaoAlK_s1Hyz-2"><a xlink:href="file:///C:/Program%20Files/draw.io/resources/app.asar/drawio/src/main/webapp/index.html?dev=0&amp;test=0&amp;gapi=0&amp;db=0&amp;od=0&amp;gh=0&amp;gl=0&amp;tr=0&amp;browser=0&amp;picker=0&amp;mode=device&amp;export=https%3A%2F%2Fconvert.diagrams.net%2Fnode%2Fexport&amp;disableUpdate=0&amp;enableSpellCheck=0&amp;enableStoreBkp=1&amp;isGoogleFontsEnabled=0&amp;appLang=de#hasParameter"><g><path d="M 130 50 L 130 60 Q 130 70 140 70 L 240 70 Q 250 70 250 76.82 L 250 83.63" fill="none" stroke="rgb(0, 0, 0)" stroke-miterlimit="10" pointer-events="stroke"/><path d="M 250 88.88 L 246.5 81.88 L 250 83.63 L 253.5 81.88 Z" fill="rgb(0, 0, 0)" stroke="rgb(0, 0, 0)" stroke-miterlimit="10" pointer-events="all"/></g></a></g><g data-cell-id="-WgzllDmIaoAlK_s1Hyz-4"><a xlink:href="file:///C:/Program%20Files/draw.io/resources/app.asar/drawio/src/main/webapp/index.html?dev=0&amp;test=0&amp;gapi=0&amp;db=0&amp;od=0&amp;gh=0&amp;gl=0&amp;tr=0&amp;browser=0&amp;picker=0&amp;mode=device&amp;export=https%3A%2F%2Fconvert.diagrams.net%2Fnode%2Fexport&amp;disableUpdate=0&amp;enableSpellCheck=0&amp;enableStoreBkp=1&amp;isGoogleFontsEnabled=0&amp;appLang=de#hasParameter"><g><path d="M 370 50 L 370 60 Q 370 70 360 70 L 260 70 Q 250 70 250 76.82 L 250 83.63" fill="none" stroke="rgb(0, 0, 0)" stroke-miterlimit="10" pointer-events="stroke"/><path d="M 250 88.88 L 246.5 81.88 L 250 83.63 L 253.5 81.88 Z" fill="rgb(0, 0, 0)" stroke="rgb(0, 0, 0)" stroke-miterlimit="10" pointer-events="all"/></g><g><g transform="translate(-0.5 -0.5)"><switch><foreignObject pointer-events="none" width="100%" height="100%" requiredFeatures="http://www.w3.org/TR/SVG11/feature#Extensibility" style="overflow: visible; text-align: left;"><div xmlns="http://www.w3.org/1999/xhtml" style="display: flex; align-items: unsafe center; justify-content: unsafe center; width: 1px; height: 1px; padding-top: 70px; margin-left: 250px;"><div data-drawio-colors="color: rgb(0, 0, 0); background-color: rgb(255, 255, 255); " style="box-sizing: border-box; font-size: 0px; text-align: center;"><div style="display: inline-block; font-size: 11px; font-family: Helvetica; color: rgb(0, 0, 0); line-height: 1.2; pointer-events: all; text-decoration: underline; background-color: rgb(255, 255, 255); white-space: nowrap;">has parameter</div></div></div></foreignObject><text x="250" y="73" fill="rgb(0, 0, 0)" font-family="&quot;Helvetica&quot;" font-size="11px" text-anchor="middle" text-decoration="underline">has parameter</text></switch></g></g></a></g><g data-cell-id="8fpH_Xs8z7H2R0amvTTy-4"><a xlink:href="file:///C:/Program%20Files/draw.io/resources/app.asar/drawio/src/main/webapp/index.html?dev=0&amp;test=0&amp;gapi=0&amp;db=0&amp;od=0&amp;gh=0&amp;gl=0&amp;tr=0&amp;browser=0&amp;picker=0&amp;mode=device&amp;export=https%3A%2F%2Fconvert.diagrams.net%2Fnode%2Fexport&amp;disableUpdate=0&amp;enableSpellCheck=0&amp;enableStoreBkp=1&amp;isGoogleFontsEnabled=0&amp;appLang=de#TextVariable"><g><path d="M 0 216 L 0 190 L 140 190 L 140 216" fill="#dae8fc" stroke="#6c8ebf" stroke-miterlimit="10" pointer-events="all"/><path d="M 0 216 L 0 236 L 140 236 L 140 216" fill="none" stroke="#6c8ebf" stroke-miterlimit="10"/><path d="M 0 216 L 140 216" fill="none" stroke="#6c8ebf" stroke-miterlimit="10"/></g><g><g fill="rgb(0, 0, 0)" font-family="&quot;Helvetica&quot;" text-anchor="middle" font-size="12px"><text x="69.5" y="207.5">Text variable</text></g></g></a><g data-cell-id="8fpH_Xs8z7H2R0amvTTy-5"><a xlink:href="file:///C:/Program%20Files/draw.io/resources/app.asar/drawio/src/main/webapp/index.html?dev=0&amp;test=0&amp;gapi=0&amp;db=0&amp;od=0&amp;gh=0&amp;gl=0&amp;tr=0&amp;browser=0&amp;picker=0&amp;mode=device&amp;export=https%3A%2F%2Fconvert.diagrams.net%2Fnode%2Fexport&amp;disableUpdate=0&amp;enableSpellCheck=0&amp;enableStoreBkp=1&amp;isGoogleFontsEnabled=0&amp;appLang=de#hasStringValue"><g><rect x="0" y="216" width="140" height="20" fill="none" stroke="none" pointer-events="all"/></g><g><g fill="rgb(0, 0, 0)" font-family="&quot;Helvetica&quot;" clip-path="url(#mx-clip-4-216-132-20-0)" font-size="12px"><text x="5.5" y="230.5">has string value</text></g></g></a></g></g><g data-cell-id="8fpH_Xs8z7H2R0amvTTy-6"><g><path d="M 70 190 L 70 180 Q 70 170 80 170 L 205.6 170 Q 215.6 170 215.59 167.11 L 215.58 164.22" fill="none" stroke="rgb(0, 0, 0)" stroke-miterlimit="10" pointer-events="stroke"/><path d="M 215.56 157.22 L 219.08 164.21 L 212.08 164.23 Z" fill="none" stroke="rgb(0, 0, 0)" stroke-miterlimit="10" pointer-events="all"/></g><g><g fill="rgb(0, 0, 0)" font-family="&quot;Helvetica&quot;" text-anchor="middle" font-size="11px"><rect fill="rgb(255, 255, 255)" stroke="none" x="131" y="164" width="19" height="14" stroke-width="0"/><text x="139.5" y="174">is a</text></g></g></g><g data-cell-id="SMSgAn2DswhM7eBbD89N-36"/><g data-cell-id="SMSgAn2DswhM7eBbD89N-37"/><g data-cell-id="SMSgAn2DswhM7eBbD89N-38"/><g data-cell-id="SMSgAn2DswhM7eBbD89N-39"/><g data-cell-id="SMSgAn2DswhM7eBbD89N-40"/><g data-cell-id="SMSgAn2DswhM7eBbD89N-41"/><g data-cell-id="SMSgAn2DswhM7eBbD89N-42"/><g data-cell-id="SMSgAn2DswhM7eBbD89N-43"/><g data-cell-id="SMSgAn2DswhM7eBbD89N-44"/><g data-cell-id="SMSgAn2DswhM7eBbD89N-45"/><g data-cell-id="SMSgAn2DswhM7eBbD89N-46"/><g data-cell-id="SMSgAn2DswhM7eBbD89N-47"/><g data-cell-id="SMSgAn2DswhM7eBbD89N-50"><g data-cell-id="SMSgAn2DswhM7eBbD89N-52"/><g data-cell-id="SMSgAn2DswhM7eBbD89N-51"/><g data-cell-id="SMSgAn2DswhM7eBbD89N-53"/><g data-cell-id="SMSgAn2DswhM7eBbD89N-54"/><g data-cell-id="SMSgAn2DswhM7eBbD89N-55"/></g><g data-cell-id="SMSgAn2DswhM7eBbD89N-56"/><g data-cell-id="SMSgAn2DswhM7eBbD89N-57"><g data-cell-id="SMSgAn2DswhM7eBbD89N-58"/><g data-cell-id="SMSgAn2DswhM7eBbD89N-59"/><g data-cell-id="SMSgAn2DswhM7eBbD89N-60"/></g><g data-cell-id="SMSgAn2DswhM7eBbD89N-61"><g data-cell-id="SMSgAn2DswhM7eBbD89N-62"/></g><g data-cell-id="SMSgAn2DswhM7eBbD89N-63"><g data-cell-id="SMSgAn2DswhM7eBbD89N-64"/></g><g data-cell-id="SMSgAn2DswhM7eBbD89N-65"><g data-cell-id="SMSgAn2DswhM7eBbD89N-66"/><g data-cell-id="SMSgAn2DswhM7eBbD89N-67"/><g data-cell-id="4dCZw6B6W82sYAjBPajG-8"/></g><g data-cell-id="SMSgAn2DswhM7eBbD89N-75"/><g data-cell-id="SMSgAn2DswhM7eBbD89N-76"/><g data-cell-id="3jXeRQxRBbPQwMiEegV--1"/><g data-cell-id="3jXeRQxRBbPQwMiEegV--2"><g data-cell-id="3jXeRQxRBbPQwMiEegV--3"/></g><g data-cell-id="3jXeRQxRBbPQwMiEegV--4"/><g data-cell-id="3jXeRQxRBbPQwMiEegV--5"><a xlink:href="file:///C:/Program%20Files/draw.io/resources/app.asar/drawio/src/main/webapp/index.html?dev=0&amp;test=0&amp;gapi=0&amp;db=0&amp;od=0&amp;gh=0&amp;gl=0&amp;tr=0&amp;browser=0&amp;picker=0&amp;mode=device&amp;export=https%3A%2F%2Fconvert.diagrams.net%2Fnode%2Fexport&amp;disableUpdate=0&amp;enableSpellCheck=0&amp;enableStoreBkp=1&amp;isGoogleFontsEnabled=0&amp;appLang=de#implementedBy"><g><path d="M 200 12.5 L 293.63 12.5" fill="none" stroke="rgb(0, 0, 0)" stroke-miterlimit="10" pointer-events="stroke"/><path d="M 298.88 12.5 L 291.88 16 L 293.63 12.5 L 291.88 9 Z" fill="rgb(0, 0, 0)" stroke="rgb(0, 0, 0)" stroke-miterlimit="10" pointer-events="all"/></g><g><g transform="translate(-0.5 -0.5)"><switch><foreignObject pointer-events="none" width="100%" height="100%" requiredFeatures="http://www.w3.org/TR/SVG11/feature#Extensibility" style="overflow: visible; text-align: left;"><div xmlns="http://www.w3.org/1999/xhtml" style="display: flex; align-items: unsafe center; justify-content: unsafe center; width: 1px; height: 1px; padding-top: 13px; margin-left: 250px;"><div data-drawio-colors="color: rgb(0, 0, 0); background-color: rgb(255, 255, 255); " style="box-sizing: border-box; font-size: 0px; text-align: center;"><div style="display: inline-block; font-size: 11px; font-family: Helvetica; color: rgb(0, 0, 0); line-height: 1.2; pointer-events: all; text-decoration: underline; background-color: rgb(255, 255, 255); white-space: nowrap;">implemented by</div></div></div></foreignObject><text x="250" y="16" fill="rgb(0, 0, 0)" font-family="&quot;Helvetica&quot;" font-size="11px" text-anchor="middle" text-decoration="underline">implemented by</text></switch></g></g></a></g><g data-cell-id="3jXeRQxRBbPQwMiEegV--8"><a xlink:href="file:///C:/Program%20Files/draw.io/resources/app.asar/drawio/src/main/webapp/index.html?dev=0&amp;test=0&amp;gapi=0&amp;db=0&amp;od=0&amp;gh=0&amp;gl=0&amp;tr=0&amp;browser=0&amp;picker=0&amp;mode=device&amp;export=https%3A%2F%2Fconvert.diagrams.net%2Fnode%2Fexport&amp;disableUpdate=0&amp;enableSpellCheck=0&amp;enableStoreBkp=1&amp;isGoogleFontsEnabled=0&amp;appLang=de#Method"><g><path d="M 60 26 L 60 0 L 200 0 L 200 26" fill="#fff2cc" stroke="#d6b656" stroke-miterlimit="10" pointer-events="all"/><path d="M 60 26 L 60 50 L 200 50 L 200 26" fill="none" stroke="#d6b656" stroke-miterlimit="10"/><path d="M 60 26 L 200 26" fill="none" stroke="#d6b656" stroke-miterlimit="10"/></g><g><g fill="rgb(0, 0, 0)" font-family="&quot;Helvetica&quot;" text-anchor="middle" font-size="12px"><text x="129.5" y="17.5">Method</text></g></g></a></g><g data-cell-id="3jXeRQxRBbPQwMiEegV--11"><a xlink:href="file:///C:/Program%20Files/draw.io/resources/app.asar/drawio/src/main/webapp/index.html?dev=0&amp;test=0&amp;gapi=0&amp;db=0&amp;od=0&amp;gh=0&amp;gl=0&amp;tr=0&amp;browser=0&amp;picker=0&amp;mode=device&amp;export=https%3A%2F%2Fconvert.diagrams.net%2Fnode%2Fexport&amp;disableUpdate=0&amp;enableSpellCheck=0&amp;enableStoreBkp=1&amp;isGoogleFontsEnabled=0&amp;appLang=de#Tool"><g><path d="M 300 26 L 300 0 L 440 0 L 440 26" fill="#fff2cc" stroke="#d6b656" stroke-miterlimit="10" pointer-events="all"/><path d="M 300 26 L 300 50 L 440 50 L 440 26" fill="none" stroke="#d6b656" stroke-miterlimit="10"/><path d="M 300 26 L 440 26" fill="none" stroke="#d6b656" stroke-miterlimit="10"/></g><g><g fill="rgb(0, 0, 0)" font-family="&quot;Helvetica&quot;" text-anchor="middle" font-size="12px"><text x="369.5" y="17.5">Tool</text></g></g></a></g><g data-cell-id="3jXeRQxRBbPQwMiEegV--12"/><g data-cell-id="3jXeRQxRBbPQwMiEegV--13"/><g data-cell-id="3jXeRQxRBbPQwMiEegV--14"/><g data-cell-id="3jXeRQxRBbPQwMiEegV--15"/><g data-cell-id="3jXeRQxRBbPQwMiEegV--16"/><g data-cell-id="3jXeRQxRBbPQwMiEegV--17"/><g data-cell-id="3jXeRQxRBbPQwMiEegV--18"/><g data-cell-id="3jXeRQxRBbPQwMiEegV--19"/><g data-cell-id="3jXeRQxRBbPQwMiEegV--20"/><g data-cell-id="3jXeRQxRBbPQwMiEegV--21"><a xlink:href="file:///C:/Program%20Files/draw.io/resources/app.asar/drawio/src/main/webapp/index.html?dev=0&amp;test=0&amp;gapi=0&amp;db=0&amp;od=0&amp;gh=0&amp;gl=0&amp;tr=0&amp;browser=0&amp;picker=0&amp;mode=device&amp;export=https%3A%2F%2Fconvert.diagrams.net%2Fnode%2Fexport&amp;disableUpdate=0&amp;enableSpellCheck=0&amp;enableStoreBkp=1&amp;isGoogleFontsEnabled=0&amp;appLang=de#implements"><g><path d="M 206.37 37.5 L 300 37.5" fill="none" stroke="rgb(0, 0, 0)" stroke-miterlimit="10" pointer-events="stroke"/><path d="M 201.12 37.5 L 208.12 34 L 206.37 37.5 L 208.12 41 Z" fill="rgb(0, 0, 0)" stroke="rgb(0, 0, 0)" stroke-miterlimit="10" pointer-events="all"/></g><g><g transform="translate(-0.5 -0.5)"><switch><foreignObject pointer-events="none" width="100%" height="100%" requiredFeatures="http://www.w3.org/TR/SVG11/feature#Extensibility" style="overflow: visible; text-align: left;"><div xmlns="http://www.w3.org/1999/xhtml" style="display: flex; align-items: unsafe center; justify-content: unsafe center; width: 1px; height: 1px; padding-top: 38px; margin-left: 251px;"><div data-drawio-colors="color: rgb(0, 0, 0); background-color: rgb(255, 255, 255); " style="box-sizing: border-box; font-size: 0px; text-align: center;"><div style="display: inline-block; font-size: 11px; font-family: Helvetica; color: rgb(0, 0, 0); line-height: 1.2; pointer-events: all; text-decoration: underline; background-color: rgb(255, 255, 255); white-space: nowrap;">implements</div></div></div></foreignObject><text x="251" y="41" fill="rgb(0, 0, 0)" font-family="&quot;Helvetica&quot;" font-size="11px" text-anchor="middle" text-decoration="underline">implements</text></switch></g></g></a></g><g data-cell-id="3jXeRQxRBbPQwMiEegV--22"/><g data-cell-id="3jXeRQxRBbPQwMiEegV--24"/><g data-cell-id="3jXeRQxRBbPQwMiEegV--25"/><g data-cell-id="3jXeRQxRBbPQwMiEegV--26"/><g data-cell-id="3jXeRQxRBbPQwMiEegV--27"/><g data-cell-id="3jXeRQxRBbPQwMiEegV--28"/><g data-cell-id="3jXeRQxRBbPQwMiEegV--29"/><g data-cell-id="3jXeRQxRBbPQwMiEegV--30"/><g data-cell-id="3jXeRQxRBbPQwMiEegV--31"/><g data-cell-id="3jXeRQxRBbPQwMiEegV--32"/><g data-cell-id="3jXeRQxRBbPQwMiEegV--33"/><g data-cell-id="3jXeRQxRBbPQwMiEegV--34"/><g data-cell-id="3jXeRQxRBbPQwMiEegV--35"/><g data-cell-id="3jXeRQxRBbPQwMiEegV--36"/><g data-cell-id="3jXeRQxRBbPQwMiEegV--37"/><g data-cell-id="3jXeRQxRBbPQwMiEegV--38"/><g data-cell-id="3jXeRQxRBbPQwMiEegV--39"/><g data-cell-id="3jXeRQxRBbPQwMiEegV--40"/><g data-cell-id="3jXeRQxRBbPQwMiEegV--41"/><g data-cell-id="3jXeRQxRBbPQwMiEegV--42"/><g data-cell-id="3jXeRQxRBbPQwMiEegV--43"/><g data-cell-id="3jXeRQxRBbPQwMiEegV--44"><g data-cell-id="3jXeRQxRBbPQwMiEegV--45"/><g data-cell-id="3jXeRQxRBbPQwMiEegV--46"/><g data-cell-id="3jXeRQxRBbPQwMiEegV--47"/></g><g data-cell-id="3jXeRQxRBbPQwMiEegV--48"/><g data-cell-id="3jXeRQxRBbPQwMiEegV--49"><g data-cell-id="3jXeRQxRBbPQwMiEegV--50"/></g><g data-cell-id="3jXeRQxRBbPQwMiEegV--51"><g data-cell-id="3jXeRQxRBbPQwMiEegV--52"/><g data-cell-id="3jXeRQxRBbPQwMiEegV--53"/><g data-cell-id="3jXeRQxRBbPQwMiEegV--54"/></g><g data-cell-id="3jXeRQxRBbPQwMiEegV--55"/><g data-cell-id="3jXeRQxRBbPQwMiEegV--56"/><g data-cell-id="3jXeRQxRBbPQwMiEegV--57"><g data-cell-id="3jXeRQxRBbPQwMiEegV--58"/><g data-cell-id="3jXeRQxRBbPQwMiEegV--59"/><g data-cell-id="3jXeRQxRBbPQwMiEegV--60"/></g><g data-cell-id="3jXeRQxRBbPQwMiEegV--61"/><g data-cell-id="3jXeRQxRBbPQwMiEegV--62"/><g data-cell-id="3jXeRQxRBbPQwMiEegV--63"><g data-cell-id="3jXeRQxRBbPQwMiEegV--64"/><g data-cell-id="3jXeRQxRBbPQwMiEegV--66"/></g><g data-cell-id="3jXeRQxRBbPQwMiEegV--82"><g data-cell-id="3jXeRQxRBbPQwMiEegV--83"/></g><g data-cell-id="3jXeRQxRBbPQwMiEegV--84"><g data-cell-id="3jXeRQxRBbPQwMiEegV--85"/></g><g data-cell-id="3jXeRQxRBbPQwMiEegV--86"/><g data-cell-id="3jXeRQxRBbPQwMiEegV--89"/><g data-cell-id="3jXeRQxRBbPQwMiEegV--92"/><g data-cell-id="3jXeRQxRBbPQwMiEegV--94"/><g data-cell-id="3jXeRQxRBbPQwMiEegV--95"/><g data-cell-id="3jXeRQxRBbPQwMiEegV--96"><g data-cell-id="3jXeRQxRBbPQwMiEegV--97"/></g><g data-cell-id="3jXeRQxRBbPQwMiEegV--98"><g data-cell-id="3jXeRQxRBbPQwMiEegV--99"/></g><g data-cell-id="3jXeRQxRBbPQwMiEegV--100"/><g data-cell-id="3jXeRQxRBbPQwMiEegV--101"/><g data-cell-id="3jXeRQxRBbPQwMiEegV--102"/><g data-cell-id="3jXeRQxRBbPQwMiEegV--103"/><g data-cell-id="3jXeRQxRBbPQwMiEegV--104"/><g data-cell-id="3jXeRQxRBbPQwMiEegV--105"/><g data-cell-id="3jXeRQxRBbPQwMiEegV--106"/><g data-cell-id="1PWDoPm8GPqUj0qIG4uX-7"><g data-cell-id="4dCZw6B6W82sYAjBPajG-24"/></g><g data-cell-id="3jXeRQxRBbPQwMiEegV--110"><g data-cell-id="4dCZw6B6W82sYAjBPajG-26"/></g><g data-cell-id="MCqLrkwaRwdILURwViHq-3"><g><rect x="440" y="170" width="250" height="130" fill="none" stroke="none"/></g><g data-cell-id="QYycugF4pwrcZ2Ile55V-1"><g><rect x="440" y="170" width="250" height="130" fill="none" stroke="#ff33ff" stroke-dasharray="3 3" pointer-events="all"/></g></g><g data-cell-id="QYycugF4pwrcZ2Ile55V-2"><g><rect x="440" y="170" width="40" height="20" fill="none" stroke="none" pointer-events="all"/></g><g><g transform="translate(-0.5 -0.5)"><switch><foreignObject pointer-events="none" width="100%" height="100%" requiredFeatures="http://www.w3.org/TR/SVG11/feature#Extensibility" style="overflow: visible; text-align: left;"><div xmlns="http://www.w3.org/1999/xhtml" style="display: flex; align-items: unsafe center; justify-content: unsafe center; width: 38px; height: 1px; padding-top: 180px; margin-left: 441px;"><div data-drawio-colors="color: #FF33FF; " style="box-sizing: border-box; font-size: 0px; text-align: center;"><div style="display: inline-block; font-size: 12px; font-family: Helvetica; color: rgb(255, 51, 255); line-height: 1.2; pointer-events: all; white-space: normal; overflow-wrap: normal;"><b><font>QUDT</font></b></div></div></div></foreignObject><text x="460" y="184" fill="#FF33FF" font-family="&quot;Helvetica&quot;" font-size="12px" text-anchor="middle">QUDT</text></switch></g></g></g></g><g data-cell-id="1PWDoPm8GPqUj0qIG4uX-13"/><g data-cell-id="agfy0CuS_o6dEDDAk89o-12"><g data-cell-id="agfy0CuS_o6dEDDAk89o-13"/></g><g data-cell-id="agfy0CuS_o6dEDDAk89o-14"><g data-cell-id="4dCZw6B6W82sYAjBPajG-25"/><g data-cell-id="4dCZw6B6W82sYAjBPajG-29"/></g><g data-cell-id="LXMZuVYuaKzVn9KVMGfn-5"/><g data-cell-id="LXMZuVYuaKzVn9KVMGfn-2"><g data-cell-id="4dCZw6B6W82sYAjBPajG-6"/><g data-cell-id="4dCZw6B6W82sYAjBPajG-7"/></g><g data-cell-id="LXMZuVYuaKzVn9KVMGfn-6"/><g data-cell-id="LXMZuVYuaKzVn9KVMGfn-7"/><g data-cell-id="LXMZuVYuaKzVn9KVMGfn-3"/><g data-cell-id="LXMZuVYuaKzVn9KVMGfn-11"/><g data-cell-id="4dCZw6B6W82sYAjBPajG-1"/><g data-cell-id="LXMZuVYuaKzVn9KVMGfn-4"><g data-cell-id="4dCZw6B6W82sYAjBPajG-3"/></g><g data-cell-id="1PWDoPm8GPqUj0qIG4uX-15"/><g data-cell-id="-cKlvjgBHZY-M0fkeHKr-1"><g data-cell-id="4dCZw6B6W82sYAjBPajG-20"/><g data-cell-id="4dCZw6B6W82sYAjBPajG-30"/></g><g data-cell-id="-cKlvjgBHZY-M0fkeHKr-2"><g data-cell-id="4dCZw6B6W82sYAjBPajG-22"/></g><g data-cell-id="-cKlvjgBHZY-M0fkeHKr-3"/><g data-cell-id="1PWDoPm8GPqUj0qIG4uX-1"><g data-cell-id="4dCZw6B6W82sYAjBPajG-32"/></g><g data-cell-id="1PWDoPm8GPqUj0qIG4uX-3"/><g data-cell-id="1PWDoPm8GPqUj0qIG4uX-6"/><g data-cell-id="1PWDoPm8GPqUj0qIG4uX-10"><g data-cell-id="4dCZw6B6W82sYAjBPajG-31"/></g><g data-cell-id="LXMZuVYuaKzVn9KVMGfn-1"><g data-cell-id="4dCZw6B6W82sYAjBPajG-9"/><g data-cell-id="4dCZw6B6W82sYAjBPajG-10"/><g data-cell-id="4dCZw6B6W82sYAjBPajG-11"/><g data-cell-id="4dCZw6B6W82sYAjBPajG-13"/></g><g data-cell-id="1PWDoPm8GPqUj0qIG4uX-20"/><g data-cell-id="hu12ddXktHGyxANyEhZB-1"/><g data-cell-id="hu12ddXktHGyxANyEhZB-2"/><g data-cell-id="hu12ddXktHGyxANyEhZB-3"/><g data-cell-id="hu12ddXktHGyxANyEhZB-4"/><g data-cell-id="hu12ddXktHGyxANyEhZB-5"/><g data-cell-id="4dCZw6B6W82sYAjBPajG-2"/><g data-cell-id="4dCZw6B6W82sYAjBPajG-27"/><g data-cell-id="4dCZw6B6W82sYAjBPajG-39"/><g data-cell-id="4dCZw6B6W82sYAjBPajG-41"><g data-cell-id="4dCZw6B6W82sYAjBPajG-42"/></g><g data-cell-id="1PWDoPm8GPqUj0qIG4uX-9"/></g></g></g></svg>