<?xml version="1.0" encoding="UTF-8"?>
<!-- Do not edit this file with editors other than draw.io -->
<!DOCTYPE svg PUBLIC "-//W3C//DTD SVG 1.1//EN" "http://www.w3.org/Graphics/SVG/1.1/DTD/svg11.dtd">
<svg xmlns="http://www.w3.org/2000/svg" xmlns:xlink="http://www.w3.org/1999/xlink" version="1.1" width="708px" height="251px" viewBox="-0.5 -0.5 708 251" content="&lt;mxfile host=&quot;app.diagrams.net&quot; modified=&quot;2024-07-12T08:42:00.521Z&quot; agent=&quot;Mozilla/5.0 (Windows NT 10.0; Win64; x64) AppleWebKit/537.36 (KHTML, like Gecko) Chrome/126.0.0.0 Safari/537.36&quot; version=&quot;24.5.3&quot; etag=&quot;ZDpnr5RVX-x9IAsnpYvI&quot; type=&quot;device&quot; scale=&quot;1&quot; border=&quot;0&quot;&gt;&#10;  &lt;diagram name=&quot;Seite-1&quot; id=&quot;4glDYyTt0ufWidFZ8DZi&quot;&gt;&#10;    &lt;mxGraphModel dx=&quot;1114&quot; dy=&quot;550&quot; grid=&quot;1&quot; gridSize=&quot;10&quot; guides=&quot;1&quot; tooltips=&quot;1&quot; connect=&quot;1&quot; arrows=&quot;1&quot; fold=&quot;1&quot; page=&quot;1&quot; pageScale=&quot;1&quot; pageWidth=&quot;827&quot; pageHeight=&quot;1169&quot; math=&quot;0&quot; shadow=&quot;0&quot;&gt;&#10;      &lt;root&gt;&#10;        &lt;mxCell id=&quot;0&quot; /&gt;&#10;        &lt;mxCell id=&quot;1&quot; parent=&quot;0&quot; /&gt;&#10;        &lt;UserObject label=&quot;precedes&quot; link=&quot;#http://purl.obolibrary.org/obo/BFO_0000063&quot; id=&quot;2&quot;&gt;&#10;          &lt;mxCell style=&quot;edgeStyle=orthogonalEdgeStyle;rounded=0;orthogonalLoop=1;jettySize=auto;html=1;exitX=1;exitY=0.5;exitDx=0;exitDy=0;entryX=0;entryY=0.5;entryDx=0;entryDy=0;fontStyle=4&quot; edge=&quot;1&quot; source=&quot;4&quot; target=&quot;11&quot; parent=&quot;1&quot;&gt;&#10;            &lt;mxGeometry relative=&quot;1&quot; as=&quot;geometry&quot; /&gt;&#10;          &lt;/mxCell&gt;&#10;        &lt;/UserObject&gt;&#10;        &lt;UserObject label=&quot;ends with&quot; link=&quot;#http://purl.obolibrary.org/obo/RO_0002230&quot; id=&quot;3&quot;&gt;&#10;          &lt;mxCell style=&quot;edgeStyle=orthogonalEdgeStyle;orthogonalLoop=1;jettySize=auto;html=1;entryX=1;entryY=0.5;entryDx=0;entryDy=0;rounded=1;exitX=1;exitY=0.75;exitDx=0;exitDy=0;fontStyle=4&quot; edge=&quot;1&quot; source=&quot;4&quot; target=&quot;13&quot; parent=&quot;1&quot;&gt;&#10;            &lt;mxGeometry relative=&quot;1&quot; as=&quot;geometry&quot;&gt;&#10;              &lt;Array as=&quot;points&quot;&gt;&#10;                &lt;mxPoint x=&quot;1100&quot; y=&quot;1008&quot; /&gt;&#10;                &lt;mxPoint x=&quot;1100&quot; y=&quot;1040&quot; /&gt;&#10;                &lt;mxPoint x=&quot;1480&quot; y=&quot;1040&quot; /&gt;&#10;                &lt;mxPoint x=&quot;1480&quot; y=&quot;1105&quot; /&gt;&#10;              &lt;/Array&gt;&#10;              &lt;mxPoint x=&quot;1070&quot; y=&quot;1020&quot; as=&quot;sourcePoint&quot; /&gt;&#10;            &lt;/mxGeometry&gt;&#10;          &lt;/mxCell&gt;&#10;        &lt;/UserObject&gt;&#10;        &lt;mxCell id=&quot;4&quot; value=&quot;Processing step&quot; style=&quot;swimlane;fontStyle=0;childLayout=stackLayout;horizontal=1;startSize=26;horizontalStack=0;resizeParent=1;resizeParentMax=0;resizeLast=0;collapsible=1;marginBottom=0;fillColor=#fff2cc;strokeColor=#d6b656;&quot; vertex=&quot;1&quot; parent=&quot;1&quot;&gt;&#10;          &lt;mxGeometry x=&quot;930&quot; y=&quot;970&quot; width=&quot;140&quot; height=&quot;50&quot; as=&quot;geometry&quot; /&gt;&#10;        &lt;/mxCell&gt;&#10;        &lt;UserObject label=&quot;precedes&quot; link=&quot;#http://purl.obolibrary.org/obo/BFO_0000063&quot; id=&quot;5&quot;&gt;&#10;          &lt;mxCell style=&quot;edgeStyle=orthogonalEdgeStyle;rounded=0;orthogonalLoop=1;jettySize=auto;html=1;exitX=1;exitY=0.5;exitDx=0;exitDy=0;entryX=0;entryY=0.5;entryDx=0;entryDy=0;fontStyle=4&quot; edge=&quot;1&quot; source=&quot;6&quot; target=&quot;8&quot; parent=&quot;1&quot;&gt;&#10;            &lt;mxGeometry x=&quot;0.0133&quot; relative=&quot;1&quot; as=&quot;geometry&quot;&gt;&#10;              &lt;mxPoint as=&quot;offset&quot; /&gt;&#10;            &lt;/mxGeometry&gt;&#10;          &lt;/mxCell&gt;&#10;        &lt;/UserObject&gt;&#10;        &lt;mxCell id=&quot;6&quot; value=&quot;Processing step&quot; style=&quot;swimlane;fontStyle=0;childLayout=stackLayout;horizontal=1;startSize=26;horizontalStack=0;resizeParent=1;resizeParentMax=0;resizeLast=0;collapsible=1;marginBottom=0;fillColor=#fff2cc;strokeColor=#d6b656;&quot; vertex=&quot;1&quot; parent=&quot;1&quot;&gt;&#10;          &lt;mxGeometry x=&quot;860&quot; y=&quot;1080&quot; width=&quot;140&quot; height=&quot;50&quot; as=&quot;geometry&quot; /&gt;&#10;        &lt;/mxCell&gt;&#10;        &lt;UserObject label=&quot;immediately precedes&quot; link=&quot;#http://purl.obolibrary.org/obo/RO_0002090&quot; id=&quot;7&quot;&gt;&#10;          &lt;mxCell style=&quot;edgeStyle=orthogonalEdgeStyle;rounded=0;orthogonalLoop=1;jettySize=auto;html=1;exitX=1;exitY=0.5;exitDx=0;exitDy=0;entryX=0;entryY=0.5;entryDx=0;entryDy=0;fontStyle=4&quot; edge=&quot;1&quot; source=&quot;8&quot; target=&quot;13&quot; parent=&quot;1&quot;&gt;&#10;            &lt;mxGeometry relative=&quot;1&quot; as=&quot;geometry&quot;&gt;&#10;              &lt;mxPoint as=&quot;offset&quot; /&gt;&#10;            &lt;/mxGeometry&gt;&#10;          &lt;/mxCell&gt;&#10;        &lt;/UserObject&gt;&#10;        &lt;mxCell id=&quot;8&quot; value=&quot;Processing step&quot; style=&quot;swimlane;fontStyle=0;childLayout=stackLayout;horizontal=1;startSize=26;horizontalStack=0;resizeParent=1;resizeParentMax=0;resizeLast=0;collapsible=1;marginBottom=0;fillColor=#fff2cc;strokeColor=#d6b656;&quot; vertex=&quot;1&quot; parent=&quot;1&quot;&gt;&#10;          &lt;mxGeometry x=&quot;1060&quot; y=&quot;1080&quot; width=&quot;140&quot; height=&quot;50&quot; as=&quot;geometry&quot; /&gt;&#10;        &lt;/mxCell&gt;&#10;        &lt;UserObject label=&quot;part of&quot; link=&quot;#http://purl.obolibrary.org/obo/BFO_0000050&quot; id=&quot;9&quot;&gt;&#10;          &lt;mxCell style=&quot;endArrow=none;html=1;exitX=0.5;exitY=1;exitDx=0;exitDy=0;entryX=0.5;entryY=0;entryDx=0;entryDy=0;edgeStyle=orthogonalEdgeStyle;startArrow=diamondThin;startFill=0;endFill=0;fontStyle=4&quot; edge=&quot;1&quot; source=&quot;4&quot; target=&quot;8&quot; parent=&quot;1&quot;&gt;&#10;            &lt;mxGeometry width=&quot;50&quot; height=&quot;50&quot; relative=&quot;1&quot; as=&quot;geometry&quot;&gt;&#10;              &lt;mxPoint x=&quot;1155&quot; y=&quot;1033&quot; as=&quot;sourcePoint&quot; /&gt;&#10;              &lt;mxPoint x=&quot;1410&quot; y=&quot;1091&quot; as=&quot;targetPoint&quot; /&gt;&#10;              &lt;Array as=&quot;points&quot;&gt;&#10;                &lt;mxPoint x=&quot;1000&quot; y=&quot;1060&quot; /&gt;&#10;                &lt;mxPoint x=&quot;1130&quot; y=&quot;1060&quot; /&gt;&#10;              &lt;/Array&gt;&#10;            &lt;/mxGeometry&gt;&#10;          &lt;/mxCell&gt;&#10;        &lt;/UserObject&gt;&#10;        &lt;UserObject label=&quot;part of&quot; link=&quot;#http://purl.obolibrary.org/obo/BFO_0000050&quot; id=&quot;10&quot;&gt;&#10;          &lt;mxCell style=&quot;endArrow=none;html=1;exitX=0.25;exitY=1;exitDx=0;exitDy=0;entryX=0.5;entryY=0;entryDx=0;entryDy=0;edgeStyle=orthogonalEdgeStyle;startArrow=diamondThin;startFill=0;endFill=0;fontStyle=4&quot; edge=&quot;1&quot; source=&quot;4&quot; target=&quot;6&quot; parent=&quot;1&quot;&gt;&#10;            &lt;mxGeometry x=&quot;0.1579&quot; width=&quot;50&quot; height=&quot;50&quot; relative=&quot;1&quot; as=&quot;geometry&quot;&gt;&#10;              &lt;mxPoint x=&quot;1120&quot; y=&quot;1033&quot; as=&quot;sourcePoint&quot; /&gt;&#10;              &lt;mxPoint x=&quot;1173.5&quot; y=&quot;1111&quot; as=&quot;targetPoint&quot; /&gt;&#10;              &lt;Array as=&quot;points&quot;&gt;&#10;                &lt;mxPoint x=&quot;965&quot; y=&quot;1060&quot; /&gt;&#10;                &lt;mxPoint x=&quot;930&quot; y=&quot;1060&quot; /&gt;&#10;              &lt;/Array&gt;&#10;              &lt;mxPoint as=&quot;offset&quot; /&gt;&#10;            &lt;/mxGeometry&gt;&#10;          &lt;/mxCell&gt;&#10;        &lt;/UserObject&gt;&#10;        &lt;mxCell id=&quot;11&quot; value=&quot;Processing step&quot; style=&quot;swimlane;fontStyle=0;childLayout=stackLayout;horizontal=1;startSize=26;horizontalStack=0;resizeParent=1;resizeParentMax=0;resizeLast=0;collapsible=1;marginBottom=0;fillColor=#fff2cc;strokeColor=#d6b656;&quot; vertex=&quot;1&quot; parent=&quot;1&quot;&gt;&#10;          &lt;mxGeometry x=&quot;1180&quot; y=&quot;970&quot; width=&quot;140&quot; height=&quot;50&quot; as=&quot;geometry&quot; /&gt;&#10;        &lt;/mxCell&gt;&#10;        &lt;mxCell id=&quot;12&quot; value=&quot;Processing step&quot; style=&quot;swimlane;fontStyle=0;childLayout=stackLayout;horizontal=1;startSize=26;horizontalStack=0;resizeParent=1;resizeParentMax=0;resizeLast=0;collapsible=1;marginBottom=0;fillColor=#fff2cc;strokeColor=#d6b656;&quot; vertex=&quot;1&quot; parent=&quot;1&quot;&gt;&#10;          &lt;mxGeometry x=&quot;1400&quot; y=&quot;970&quot; width=&quot;140&quot; height=&quot;50&quot; as=&quot;geometry&quot; /&gt;&#10;        &lt;/mxCell&gt;&#10;        &lt;mxCell id=&quot;13&quot; value=&quot;Processing step&quot; style=&quot;swimlane;fontStyle=0;childLayout=stackLayout;horizontal=1;startSize=26;horizontalStack=0;resizeParent=1;resizeParentMax=0;resizeLast=0;collapsible=1;marginBottom=0;fillColor=#fff2cc;strokeColor=#d6b656;&quot; vertex=&quot;1&quot; parent=&quot;1&quot;&gt;&#10;          &lt;mxGeometry x=&quot;1320&quot; y=&quot;1080&quot; width=&quot;140&quot; height=&quot;50&quot; as=&quot;geometry&quot; /&gt;&#10;        &lt;/mxCell&gt;&#10;        &lt;UserObject label=&quot;part of&quot; link=&quot;#http://purl.obolibrary.org/obo/BFO_0000050&quot; id=&quot;14&quot;&gt;&#10;          &lt;mxCell style=&quot;endArrow=none;html=1;exitX=0.75;exitY=1;exitDx=0;exitDy=0;edgeStyle=orthogonalEdgeStyle;startArrow=diamondThin;startFill=0;endFill=0;entryX=0.5;entryY=0;entryDx=0;entryDy=0;fontStyle=4&quot; edge=&quot;1&quot; source=&quot;4&quot; target=&quot;13&quot; parent=&quot;1&quot;&gt;&#10;            &lt;mxGeometry width=&quot;50&quot; height=&quot;50&quot; relative=&quot;1&quot; as=&quot;geometry&quot;&gt;&#10;              &lt;mxPoint x=&quot;1010&quot; y=&quot;1033&quot; as=&quot;sourcePoint&quot; /&gt;&#10;              &lt;mxPoint x=&quot;1400&quot; y=&quot;1101&quot; as=&quot;targetPoint&quot; /&gt;&#10;              &lt;Array as=&quot;points&quot;&gt;&#10;                &lt;mxPoint x=&quot;1035&quot; y=&quot;1050&quot; /&gt;&#10;                &lt;mxPoint x=&quot;1390&quot; y=&quot;1050&quot; /&gt;&#10;              &lt;/Array&gt;&#10;            &lt;/mxGeometry&gt;&#10;          &lt;/mxCell&gt;&#10;        &lt;/UserObject&gt;&#10;        &lt;mxCell id=&quot;15&quot; value=&quot;Processing step&quot; style=&quot;swimlane;fontStyle=0;childLayout=stackLayout;horizontal=1;startSize=26;horizontalStack=0;resizeParent=1;resizeParentMax=0;resizeLast=0;collapsible=1;marginBottom=0;fillColor=#fff2cc;strokeColor=#d6b656;&quot; vertex=&quot;1&quot; parent=&quot;1&quot;&gt;&#10;          &lt;mxGeometry x=&quot;1130&quot; y=&quot;880&quot; width=&quot;140&quot; height=&quot;50&quot; as=&quot;geometry&quot; /&gt;&#10;        &lt;/mxCell&gt;&#10;        &lt;UserObject label=&quot;part of&quot; link=&quot;#http://purl.obolibrary.org/obo/BFO_0000050&quot; id=&quot;16&quot;&gt;&#10;          &lt;mxCell style=&quot;endArrow=none;html=1;exitX=0.25;exitY=1;exitDx=0;exitDy=0;edgeStyle=orthogonalEdgeStyle;startArrow=diamondThin;startFill=0;endFill=0;fontStyle=4&quot; edge=&quot;1&quot; source=&quot;15&quot; target=&quot;4&quot; parent=&quot;1&quot;&gt;&#10;            &lt;mxGeometry width=&quot;50&quot; height=&quot;50&quot; relative=&quot;1&quot; as=&quot;geometry&quot;&gt;&#10;              &lt;mxPoint x=&quot;975&quot; y=&quot;1033&quot; as=&quot;sourcePoint&quot; /&gt;&#10;              &lt;mxPoint x=&quot;940&quot; y=&quot;1111&quot; as=&quot;targetPoint&quot; /&gt;&#10;            &lt;/mxGeometry&gt;&#10;          &lt;/mxCell&gt;&#10;        &lt;/UserObject&gt;&#10;        &lt;UserObject label=&quot;part of&quot; link=&quot;#http://purl.obolibrary.org/obo/BFO_0000050&quot; id=&quot;17&quot;&gt;&#10;          &lt;mxCell style=&quot;endArrow=none;html=1;exitX=0.5;exitY=1;exitDx=0;exitDy=0;entryX=0.5;entryY=0;entryDx=0;entryDy=0;edgeStyle=orthogonalEdgeStyle;startArrow=diamondThin;startFill=0;endFill=0;fontStyle=4&quot; edge=&quot;1&quot; source=&quot;15&quot; target=&quot;11&quot; parent=&quot;1&quot;&gt;&#10;            &lt;mxGeometry width=&quot;50&quot; height=&quot;50&quot; relative=&quot;1&quot; as=&quot;geometry&quot;&gt;&#10;              &lt;mxPoint x=&quot;1010&quot; y=&quot;1033&quot; as=&quot;sourcePoint&quot; /&gt;&#10;              &lt;mxPoint x=&quot;1170&quot; y=&quot;1111&quot; as=&quot;targetPoint&quot; /&gt;&#10;              &lt;Array as=&quot;points&quot;&gt;&#10;                &lt;mxPoint x=&quot;1200&quot; y=&quot;960&quot; /&gt;&#10;                &lt;mxPoint x=&quot;1250&quot; y=&quot;960&quot; /&gt;&#10;              &lt;/Array&gt;&#10;            &lt;/mxGeometry&gt;&#10;          &lt;/mxCell&gt;&#10;        &lt;/UserObject&gt;&#10;        &lt;UserObject label=&quot;part of&quot; link=&quot;#http://purl.obolibrary.org/obo/BFO_0000050&quot; id=&quot;18&quot;&gt;&#10;          &lt;mxCell style=&quot;endArrow=none;html=1;exitX=0.75;exitY=1;exitDx=0;exitDy=0;entryX=0.5;entryY=0;entryDx=0;entryDy=0;edgeStyle=orthogonalEdgeStyle;startArrow=diamondThin;startFill=0;endFill=0;fontStyle=4&quot; edge=&quot;1&quot; source=&quot;15&quot; target=&quot;12&quot; parent=&quot;1&quot;&gt;&#10;            &lt;mxGeometry width=&quot;50&quot; height=&quot;50&quot; relative=&quot;1&quot; as=&quot;geometry&quot;&gt;&#10;              &lt;mxPoint x=&quot;1210&quot; y=&quot;942&quot; as=&quot;sourcePoint&quot; /&gt;&#10;              &lt;mxPoint x=&quot;1260&quot; y=&quot;981&quot; as=&quot;targetPoint&quot; /&gt;&#10;              &lt;Array as=&quot;points&quot;&gt;&#10;                &lt;mxPoint x=&quot;1235&quot; y=&quot;950&quot; /&gt;&#10;                &lt;mxPoint x=&quot;1470&quot; y=&quot;950&quot; /&gt;&#10;              &lt;/Array&gt;&#10;            &lt;/mxGeometry&gt;&#10;          &lt;/mxCell&gt;&#10;        &lt;/UserObject&gt;&#10;        &lt;UserObject label=&quot;starts with&quot; link=&quot;#http://purl.obolibrary.org/obo/RO_0002224&quot; id=&quot;19&quot;&gt;&#10;          &lt;mxCell style=&quot;endArrow=none;html=1;exitX=0;exitY=0.5;exitDx=0;exitDy=0;entryX=0;entryY=0.75;entryDx=0;entryDy=0;edgeStyle=orthogonalEdgeStyle;startArrow=classic;startFill=1;endFill=0;fontStyle=4&quot; edge=&quot;1&quot; source=&quot;6&quot; target=&quot;4&quot; parent=&quot;1&quot;&gt;&#10;            &lt;mxGeometry x=&quot;0.5184&quot; width=&quot;50&quot; height=&quot;50&quot; relative=&quot;1&quot; as=&quot;geometry&quot;&gt;&#10;              &lt;mxPoint x=&quot;975&quot; y=&quot;1033&quot; as=&quot;sourcePoint&quot; /&gt;&#10;              &lt;mxPoint x=&quot;940&quot; y=&quot;1111&quot; as=&quot;targetPoint&quot; /&gt;&#10;              &lt;Array as=&quot;points&quot;&gt;&#10;                &lt;mxPoint x=&quot;840&quot; y=&quot;1105&quot; /&gt;&#10;                &lt;mxPoint x=&quot;840&quot; y=&quot;1007&quot; /&gt;&#10;              &lt;/Array&gt;&#10;              &lt;mxPoint as=&quot;offset&quot; /&gt;&#10;            &lt;/mxGeometry&gt;&#10;          &lt;/mxCell&gt;&#10;        &lt;/UserObject&gt;&#10;      &lt;/root&gt;&#10;    &lt;/mxGraphModel&gt;&#10;  &lt;/diagram&gt;&#10;&lt;/mxfile&gt;&#10;" style="background-color: rgb(255, 255, 255);"><defs/><rect fill="#ffffff" width="100%" height="100%" x="0" y="0"/><g><a xlink:href="https://app.diagrams.net/#http://purl.obolibrary.org/obo/BFO_0000063"><g><path d="M 237 115 L 340.63 115" fill="none" stroke="rgb(0, 0, 0)" stroke-miterlimit="10" pointer-events="stroke"/><path d="M 345.88 115 L 338.88 118.5 L 340.63 115 L 338.88 111.5 Z" fill="rgb(0, 0, 0)" stroke="rgb(0, 0, 0)" stroke-miterlimit="10" pointer-events="all"/></g><g><g transform="translate(-0.5 -0.5)"><switch><foreignObject pointer-events="none" width="100%" height="100%" requiredFeatures="http://www.w3.org/TR/SVG11/feature#Extensibility" style="overflow: visible; text-align: left;"><div xmlns="http://www.w3.org/1999/xhtml" style="display: flex; align-items: unsafe center; justify-content: unsafe center; width: 1px; height: 1px; padding-top: 115px; margin-left: 292px;"><div data-drawio-colors="color: rgb(0, 0, 0); background-color: rgb(255, 255, 255); " style="box-sizing: border-box; font-size: 0px; text-align: center;"><div style="display: inline-block; font-size: 11px; font-family: Helvetica; color: rgb(0, 0, 0); line-height: 1.2; pointer-events: all; text-decoration: underline; background-color: rgb(255, 255, 255); white-space: nowrap;">precedes</div></div></div></foreignObject><text x="292" y="118" fill="rgb(0, 0, 0)" font-family="Helvetica" font-size="11px" text-anchor="middle" text-decoration="underline">precedes</text></switch></g></g></a><a xlink:href="https://app.diagrams.net/#http://purl.obolibrary.org/obo/RO_0002230"><g><path d="M 237 127.5 L 257 127.5 Q 267 127.5 267 137.5 L 267 150 Q 267 160 277 160 L 637 160 Q 647 160 647 170 L 647 215 Q 647 225 640.18 225 L 633.37 225" fill="none" stroke="rgb(0, 0, 0)" stroke-miterlimit="10" pointer-events="stroke"/><path d="M 628.12 225 L 635.12 221.5 L 633.37 225 L 635.12 228.5 Z" fill="rgb(0, 0, 0)" stroke="rgb(0, 0, 0)" stroke-miterlimit="10" pointer-events="all"/></g><g><g transform="translate(-0.5 -0.5)"><switch><foreignObject pointer-events="none" width="100%" height="100%" requiredFeatures="http://www.w3.org/TR/SVG11/feature#Extensibility" style="overflow: visible; text-align: left;"><div xmlns="http://www.w3.org/1999/xhtml" style="display: flex; align-items: unsafe center; justify-content: unsafe center; width: 1px; height: 1px; padding-top: 160px; margin-left: 469px;"><div data-drawio-colors="color: rgb(0, 0, 0); background-color: rgb(255, 255, 255); " style="box-sizing: border-box; font-size: 0px; text-align: center;"><div style="display: inline-block; font-size: 11px; font-family: Helvetica; color: rgb(0, 0, 0); line-height: 1.2; pointer-events: all; text-decoration: underline; background-color: rgb(255, 255, 255); white-space: nowrap;">ends with</div></div></div></foreignObject><text x="469" y="163" fill="rgb(0, 0, 0)" font-family="Helvetica" font-size="11px" text-anchor="middle" text-decoration="underline">ends with</text></switch></g></g></a><g><path d="M 97 116 L 97 90 L 237 90 L 237 116" fill="#fff2cc" stroke="#d6b656" stroke-miterlimit="10" pointer-events="all"/><path d="M 97 116 L 97 140 L 237 140 L 237 116" fill="none" stroke="#d6b656" stroke-miterlimit="10"/><path d="M 97 116 L 237 116" fill="none" stroke="#d6b656" stroke-miterlimit="10"/></g><g><g fill="rgb(0, 0, 0)" font-family="Helvetica" text-anchor="middle" font-size="12px"><text x="166.5" y="107.5">Processing step</text></g></g><a xlink:href="https://app.diagrams.net/#http://purl.obolibrary.org/obo/BFO_0000063"><g><path d="M 167 225 L 220.63 225" fill="none" stroke="rgb(0, 0, 0)" stroke-miterlimit="10" pointer-events="stroke"/><path d="M 225.88 225 L 218.88 228.5 L 220.63 225 L 218.88 221.5 Z" fill="rgb(0, 0, 0)" stroke="rgb(0, 0, 0)" stroke-miterlimit="10" pointer-events="all"/></g><g><g transform="translate(-0.5 -0.5)"><switch><foreignObject pointer-events="none" width="100%" height="100%" requiredFeatures="http://www.w3.org/TR/SVG11/feature#Extensibility" style="overflow: visible; text-align: left;"><div xmlns="http://www.w3.org/1999/xhtml" style="display: flex; align-items: unsafe center; justify-content: unsafe center; width: 1px; height: 1px; padding-top: 225px; margin-left: 197px;"><div data-drawio-colors="color: rgb(0, 0, 0); background-color: rgb(255, 255, 255); " style="box-sizing: border-box; font-size: 0px; text-align: center;"><div style="display: inline-block; font-size: 11px; font-family: Helvetica; color: rgb(0, 0, 0); line-height: 1.2; pointer-events: all; text-decoration: underline; background-color: rgb(255, 255, 255); white-space: nowrap;">precedes</div></div></div></foreignObject><text x="197" y="228" fill="rgb(0, 0, 0)" font-family="Helvetica" font-size="11px" text-anchor="middle" text-decoration="underline">precedes</text></switch></g></g></a><g><path d="M 27 226 L 27 200 L 167 200 L 167 226" fill="#fff2cc" stroke="#d6b656" stroke-miterlimit="10" pointer-events="all"/><path d="M 27 226 L 27 250 L 167 250 L 167 226" fill="none" stroke="#d6b656" stroke-miterlimit="10"/><path d="M 27 226 L 167 226" fill="none" stroke="#d6b656" stroke-miterlimit="10"/></g><g><g fill="rgb(0, 0, 0)" font-family="Helvetica" text-anchor="middle" font-size="12px"><text x="96.5" y="217.5">Processing step</text></g></g><a xlink:href="https://app.diagrams.net/#http://purl.obolibrary.org/obo/RO_0002090"><g><path d="M 367 225 L 480.63 225" fill="none" stroke="rgb(0, 0, 0)" stroke-miterlimit="10" pointer-events="stroke"/><path d="M 485.88 225 L 478.88 228.5 L 480.63 225 L 478.88 221.5 Z" fill="rgb(0, 0, 0)" stroke="rgb(0, 0, 0)" stroke-miterlimit="10" pointer-events="all"/></g><g><g transform="translate(-0.5 -0.5)"><switch><foreignObject pointer-events="none" width="100%" height="100%" requiredFeatures="http://www.w3.org/TR/SVG11/feature#Extensibility" style="overflow: visible; text-align: left;"><div xmlns="http://www.w3.org/1999/xhtml" style="display: flex; align-items: unsafe center; justify-content: unsafe center; width: 1px; height: 1px; padding-top: 225px; margin-left: 427px;"><div data-drawio-colors="color: rgb(0, 0, 0); background-color: rgb(255, 255, 255); " style="box-sizing: border-box; font-size: 0px; text-align: center;"><div style="display: inline-block; font-size: 11px; font-family: Helvetica; color: rgb(0, 0, 0); line-height: 1.2; pointer-events: all; text-decoration: underline; background-color: rgb(255, 255, 255); white-space: nowrap;">immediately precedes</div></div></div></foreignObject><text x="427" y="228" fill="rgb(0, 0, 0)" font-family="Helvetica" font-size="11px" text-anchor="middle" text-decoration="underline">immediately precedes</text></switch></g></g></a><g><path d="M 227 226 L 227 200 L 367 200 L 367 226" fill="#fff2cc" stroke="#d6b656" stroke-miterlimit="10" pointer-events="all"/><path d="M 227 226 L 227 250 L 367 250 L 367 226" fill="none" stroke="#d6b656" stroke-miterlimit="10"/><path d="M 227 226 L 367 226" fill="none" stroke="#d6b656" stroke-miterlimit="10"/></g><g><g fill="rgb(0, 0, 0)" font-family="Helvetica" text-anchor="middle" font-size="12px"><text x="296.5" y="217.5">Processing step</text></g></g><a xlink:href="https://app.diagrams.net/#http://purl.obolibrary.org/obo/BFO_0000050"><g><path d="M 167 147.99 L 167 170 Q 167 180 177 180 L 287 180 Q 297 180 297 190 L 297 200" fill="none" stroke="rgb(0, 0, 0)" stroke-miterlimit="10" pointer-events="stroke"/><path d="M 167 140.99 L 169.06 144.49 L 167 147.99 L 164.94 144.49 Z" fill="none" stroke="rgb(0, 0, 0)" stroke-miterlimit="10" pointer-events="all"/></g><g><g transform="translate(-0.5 -0.5)"><switch><foreignObject pointer-events="none" width="100%" height="100%" requiredFeatures="http://www.w3.org/TR/SVG11/feature#Extensibility" style="overflow: visible; text-align: left;"><div xmlns="http://www.w3.org/1999/xhtml" style="display: flex; align-items: unsafe center; justify-content: unsafe center; width: 1px; height: 1px; padding-top: 180px; margin-left: 222px;"><div data-drawio-colors="color: rgb(0, 0, 0); background-color: rgb(255, 255, 255); " style="box-sizing: border-box; font-size: 0px; text-align: center;"><div style="display: inline-block; font-size: 11px; font-family: Helvetica; color: rgb(0, 0, 0); line-height: 1.2; pointer-events: all; text-decoration: underline; background-color: rgb(255, 255, 255); white-space: nowrap;">part of</div></div></div></foreignObject><text x="222" y="183" fill="rgb(0, 0, 0)" font-family="Helvetica" font-size="11px" text-anchor="middle" text-decoration="underline">part of</text></switch></g></g></a><a xlink:href="https://app.diagrams.net/#http://purl.obolibrary.org/obo/BFO_0000050"><g><path d="M 132 147.99 L 132 170 Q 132 180 122 180 L 107 180 Q 97 180 97 190 L 97 200" fill="none" stroke="rgb(0, 0, 0)" stroke-miterlimit="10" pointer-events="stroke"/><path d="M 132 140.99 L 134.06 144.49 L 132 147.99 L 129.94 144.49 Z" fill="none" stroke="rgb(0, 0, 0)" stroke-miterlimit="10" pointer-events="all"/></g><g><g transform="translate(-0.5 -0.5)"><switch><foreignObject pointer-events="none" width="100%" height="100%" requiredFeatures="http://www.w3.org/TR/SVG11/feature#Extensibility" style="overflow: visible; text-align: left;"><div xmlns="http://www.w3.org/1999/xhtml" style="display: flex; align-items: unsafe center; justify-content: unsafe center; width: 1px; height: 1px; padding-top: 180px; margin-left: 117px;"><div data-drawio-colors="color: rgb(0, 0, 0); background-color: rgb(255, 255, 255); " style="box-sizing: border-box; font-size: 0px; text-align: center;"><div style="display: inline-block; font-size: 11px; font-family: Helvetica; color: rgb(0, 0, 0); line-height: 1.2; pointer-events: all; text-decoration: underline; background-color: rgb(255, 255, 255); white-space: nowrap;">part of</div></div></div></foreignObject><text x="117" y="183" fill="rgb(0, 0, 0)" font-family="Helvetica" font-size="11px" text-anchor="middle" text-decoration="underline">part of</text></switch></g></g></a><g><path d="M 347 116 L 347 90 L 487 90 L 487 116" fill="#fff2cc" stroke="#d6b656" stroke-miterlimit="10" pointer-events="all"/><path d="M 347 116 L 347 140 L 487 140 L 487 116" fill="none" stroke="#d6b656" stroke-miterlimit="10"/><path d="M 347 116 L 487 116" fill="none" stroke="#d6b656" stroke-miterlimit="10"/></g><g><g fill="rgb(0, 0, 0)" font-family="Helvetica" text-anchor="middle" font-size="12px"><text x="416.5" y="107.5">Processing step</text></g></g><g><path d="M 567 116 L 567 90 L 707 90 L 707 116" fill="#fff2cc" stroke="#d6b656" stroke-miterlimit="10" pointer-events="all"/><path d="M 567 116 L 567 140 L 707 140 L 707 116" fill="none" stroke="#d6b656" stroke-miterlimit="10"/><path d="M 567 116 L 707 116" fill="none" stroke="#d6b656" stroke-miterlimit="10"/></g><g><g fill="rgb(0, 0, 0)" font-family="Helvetica" text-anchor="middle" font-size="12px"><text x="636.5" y="107.5">Processing step</text></g></g><g><path d="M 487 226 L 487 200 L 627 200 L 627 226" fill="#fff2cc" stroke="#d6b656" stroke-miterlimit="10" pointer-events="all"/><path d="M 487 226 L 487 250 L 627 250 L 627 226" fill="none" stroke="#d6b656" stroke-miterlimit="10"/><path d="M 487 226 L 627 226" fill="none" stroke="#d6b656" stroke-miterlimit="10"/></g><g><g fill="rgb(0, 0, 0)" font-family="Helvetica" text-anchor="middle" font-size="12px"><text x="556.5" y="217.5">Processing step</text></g></g><a xlink:href="https://app.diagrams.net/#http://purl.obolibrary.org/obo/BFO_0000050"><g><path d="M 202 147.99 L 202 160 Q 202 170 212 170 L 547 170 Q 557 170 557 180 L 557 200" fill="none" stroke="rgb(0, 0, 0)" stroke-miterlimit="10" pointer-events="stroke"/><path d="M 202 140.99 L 204.06 144.49 L 202 147.99 L 199.94 144.49 Z" fill="none" stroke="rgb(0, 0, 0)" stroke-miterlimit="10" pointer-events="all"/></g><g><g transform="translate(-0.5 -0.5)"><switch><foreignObject pointer-events="none" width="100%" height="100%" requiredFeatures="http://www.w3.org/TR/SVG11/feature#Extensibility" style="overflow: visible; text-align: left;"><div xmlns="http://www.w3.org/1999/xhtml" style="display: flex; align-items: unsafe center; justify-content: unsafe center; width: 1px; height: 1px; padding-top: 170px; margin-left: 380px;"><div data-drawio-colors="color: rgb(0, 0, 0); background-color: rgb(255, 255, 255); " style="box-sizing: border-box; font-size: 0px; text-align: center;"><div style="display: inline-block; font-size: 11px; font-family: Helvetica; color: rgb(0, 0, 0); line-height: 1.2; pointer-events: all; text-decoration: underline; background-color: rgb(255, 255, 255); white-space: nowrap;">part of</div></div></div></foreignObject><text x="380" y="173" fill="rgb(0, 0, 0)" font-family="Helvetica" font-size="11px" text-anchor="middle" text-decoration="underline">part of</text></switch></g></g></a><g><path d="M 297 26 L 297 0 L 437 0 L 437 26" fill="#fff2cc" stroke="#d6b656" stroke-miterlimit="10" pointer-events="all"/><path d="M 297 26 L 297 50 L 437 50 L 437 26" fill="none" stroke="#d6b656" stroke-miterlimit="10"/><path d="M 297 26 L 437 26" fill="none" stroke="#d6b656" stroke-miterlimit="10"/></g><g><g fill="rgb(0, 0, 0)" font-family="Helvetica" text-anchor="middle" font-size="12px"><text x="366.5" y="17.5">Processing step</text></g></g><a xlink:href="https://app.diagrams.net/#http://purl.obolibrary.org/obo/BFO_0000050"><g><path d="M 332 57.99 L 332 63.99 Q 332 70 322 70 L 177 70 Q 167 70 167 80 L 167 90" fill="none" stroke="rgb(0, 0, 0)" stroke-miterlimit="10" pointer-events="stroke"/><path d="M 332 50.99 L 334.06 54.49 L 332 57.99 L 329.94 54.49 Z" fill="none" stroke="rgb(0, 0, 0)" stroke-miterlimit="10" pointer-events="all"/></g><g><g transform="translate(-0.5 -0.5)"><switch><foreignObject pointer-events="none" width="100%" height="100%" requiredFeatures="http://www.w3.org/TR/SVG11/feature#Extensibility" style="overflow: visible; text-align: left;"><div xmlns="http://www.w3.org/1999/xhtml" style="display: flex; align-items: unsafe center; justify-content: unsafe center; width: 1px; height: 1px; padding-top: 70px; margin-left: 249px;"><div data-drawio-colors="color: rgb(0, 0, 0); background-color: rgb(255, 255, 255); " style="box-sizing: border-box; font-size: 0px; text-align: center;"><div style="display: inline-block; font-size: 11px; font-family: Helvetica; color: rgb(0, 0, 0); line-height: 1.2; pointer-events: all; text-decoration: underline; background-color: rgb(255, 255, 255); white-space: nowrap;">part of</div></div></div></foreignObject><text x="249" y="73" fill="rgb(0, 0, 0)" font-family="Helvetica" font-size="11px" text-anchor="middle" text-decoration="underline">part of</text></switch></g></g></a><a xlink:href="https://app.diagrams.net/#http://purl.obolibrary.org/obo/BFO_0000050"><g><path d="M 367 57.99 L 367 70 Q 367 80 377 80 L 407 80 Q 417 80 417 85 L 417 90" fill="none" stroke="rgb(0, 0, 0)" stroke-miterlimit="10" pointer-events="stroke"/><path d="M 367 50.99 L 369.06 54.49 L 367 57.99 L 364.94 54.49 Z" fill="none" stroke="rgb(0, 0, 0)" stroke-miterlimit="10" pointer-events="all"/></g><g><g transform="translate(-0.5 -0.5)"><switch><foreignObject pointer-events="none" width="100%" height="100%" requiredFeatures="http://www.w3.org/TR/SVG11/feature#Extensibility" style="overflow: visible; text-align: left;"><div xmlns="http://www.w3.org/1999/xhtml" style="display: flex; align-items: unsafe center; justify-content: unsafe center; width: 1px; height: 1px; padding-top: 80px; margin-left: 382px;"><div data-drawio-colors="color: rgb(0, 0, 0); background-color: rgb(255, 255, 255); " style="box-sizing: border-box; font-size: 0px; text-align: center;"><div style="display: inline-block; font-size: 11px; font-family: Helvetica; color: rgb(0, 0, 0); line-height: 1.2; pointer-events: all; text-decoration: underline; background-color: rgb(255, 255, 255); white-space: nowrap;">part of</div></div></div></foreignObject><text x="382" y="83" fill="rgb(0, 0, 0)" font-family="Helvetica" font-size="11px" text-anchor="middle" text-decoration="underline">part of</text></switch></g></g></a><a xlink:href="https://app.diagrams.net/#http://purl.obolibrary.org/obo/BFO_0000050"><g><path d="M 402 57.99 L 402 63.99 Q 402 70 412 70 L 627 70 Q 637 70 637 80 L 637 90" fill="none" stroke="rgb(0, 0, 0)" stroke-miterlimit="10" pointer-events="stroke"/><path d="M 402 50.99 L 404.06 54.49 L 402 57.99 L 399.94 54.49 Z" fill="none" stroke="rgb(0, 0, 0)" stroke-miterlimit="10" pointer-events="all"/></g><g><g transform="translate(-0.5 -0.5)"><switch><foreignObject pointer-events="none" width="100%" height="100%" requiredFeatures="http://www.w3.org/TR/SVG11/feature#Extensibility" style="overflow: visible; text-align: left;"><div xmlns="http://www.w3.org/1999/xhtml" style="display: flex; align-items: unsafe center; justify-content: unsafe center; width: 1px; height: 1px; padding-top: 70px; margin-left: 520px;"><div data-drawio-colors="color: rgb(0, 0, 0); background-color: rgb(255, 255, 255); " style="box-sizing: border-box; font-size: 0px; text-align: center;"><div style="display: inline-block; font-size: 11px; font-family: Helvetica; color: rgb(0, 0, 0); line-height: 1.2; pointer-events: all; text-decoration: underline; background-color: rgb(255, 255, 255); white-space: nowrap;">part of</div></div></div></foreignObject><text x="520" y="73" fill="rgb(0, 0, 0)" font-family="Helvetica" font-size="11px" text-anchor="middle" text-decoration="underline">part of</text></switch></g></g></a><a xlink:href="https://app.diagrams.net/#http://purl.obolibrary.org/obo/RO_0002224"><g><path d="M 20.63 225 L 13.82 225 Q 7 225 7 215 L 7 137.5 Q 7 127.5 17 127.5 L 97 127.5" fill="none" stroke="rgb(0, 0, 0)" stroke-miterlimit="10" pointer-events="stroke"/><path d="M 25.88 225 L 18.88 228.5 L 20.63 225 L 18.88 221.5 Z" fill="rgb(0, 0, 0)" stroke="rgb(0, 0, 0)" stroke-miterlimit="10" pointer-events="all"/></g><g><g transform="translate(-0.5 -0.5)"><switch><foreignObject pointer-events="none" width="100%" height="100%" requiredFeatures="http://www.w3.org/TR/SVG11/feature#Extensibility" style="overflow: visible; text-align: left;"><div xmlns="http://www.w3.org/1999/xhtml" style="display: flex; align-items: unsafe center; justify-content: unsafe center; width: 1px; height: 1px; padding-top: 128px; margin-left: 48px;"><div data-drawio-colors="color: rgb(0, 0, 0); background-color: rgb(255, 255, 255); " style="box-sizing: border-box; font-size: 0px; text-align: center;"><div style="display: inline-block; font-size: 11px; font-family: Helvetica; color: rgb(0, 0, 0); line-height: 1.2; pointer-events: all; text-decoration: underline; background-color: rgb(255, 255, 255); white-space: nowrap;">starts with</div></div></div></foreignObject><text x="48" y="131" fill="rgb(0, 0, 0)" font-family="Helvetica" font-size="11px" text-anchor="middle" text-decoration="underline">starts with</text></switch></g></g></a></g></svg>