{
  "blocks_url": "https://edutrain.nfdi4earth.de/api/courses/v2/blocks/?course_id=course-v1%3ANFDI4Earth%2B20230502CP%2Bself-paced",
  "effort": "04:00",
  "end": "2025-01-01T00:00:00Z",
  "enrollment_start": null,
  "enrollment_end": null,
  "id": "course-v1:NFDI4Earth+20230502CP+self-paced",
  "media": {
    "banner_image": {
      "uri": "/asset-v1:NFDI4Earth+20230502CP+self-paced+type@asset+block@images_course_image.jpg",
      "uri_absolute": "https://edutrain.nfdi4earth.de/asset-v1:NFDI4Earth+20230502CP+self-paced+type@asset+block@images_course_image.jpg"
    },
    "course_image": {
      "uri": "/asset-v1:NFDI4Earth+20230502CP+self-paced+type@asset+block@Slide5.JPG"
        },
    "course_video": {"uri": null},
    "image": {
      "raw": "https://edutrain.nfdi4earth.de/asset-v1:NFDI4Earth+20230502CP+self-paced+type@asset+block@Slide5.JPG",
      "small": "https://edutrain.nfdi4earth.de/asset-v1:NFDI4Earth+20230502CP+self-paced+type@asset+block@Slide5.JPG",
      "large": "https://edutrain.nfdi4earth.de/asset-v1:NFDI4Earth+20230502CP+self-paced+type@asset+block@Slide5.JPG"}
  },
  "name": "How to create publishable netcdf-data",
  "number": "20230502CP",
  "org": "NFDI4Earth",
  "short_description": "The course deals with creating publishable netCDF (Network Common Data Format) data from the Earth System Sciences (ESS). Data Centers have certain demands regarding the content and format of ESS data - we will focus in this course on creating CF (Climate and Forecast) compliant netCDF files.",
  "start": "2023-07-17T00:00:00Z",
  "start_display": "July 17, 2023",
  "start_type": "timestamp",
  "pacing": "self",
  "mobile_available": false,
  "hidden": false,
  "invitation_only": false,
  "course_id": "course-v1:NFDI4Earth+20230502CP+self-paced",
  "overview": "<meta name=\"subjectArea\" content=\"dfg:34\"/>\n<meta name=\"datePublished\" content=\"2023-07-15\"/>\n<meta name=\"author\" content=\"Remon Sadikni|https://orcid.org/0009-0009-9872-021X\"/>\n<meta name=\"author\" content=\"Christopher Purr|https://orcid.org/0000-0002-9376-432X\"/>\n<meta name=\"inLanguage\" content=\"ENG\"/>\n<meta name=\"keywords\" content=\"netCDF, CF conventions, data publishing, Python, R\"/>\n<meta name=\"educationalLevel\" content=\"Intro, Intermediate\"/>\n<meta name=\"learningResourceType\" content=\"narrative text\"/>\n\n<section class=\"about\" style=\"font-family: Calibri, Arial, Helvetica, sans-serif; text-align: justify;\">\n    <h2>About This Course</h2>\n    <p>The course deals with creating publishable netCDF (Network Common Data Format) data from the Earth System Sciences (ESS). Data Centers have certain demands regarding the content and format of ESS data - we will focus in this course on creating CF (Climate and Forecast) compliant netCDF files.</p>\n    </section>\n\n<section class=\"difficulty\" style=\"font-family: Calibri, Arial, Helvetica, sans-serif; text-align: justify;\">\n<h2>Level</h2>\n<p class=\"educationalLevel\">Introductory, Intermediate</p></section>\n\n<section class=\"prerequisites\" style=\"font-family: Calibri, Arial, Helvetica, sans-serif; text-align: justify;\">\n  <h2>Requirements</h2>\n  <p class=\"competencyRequired\">Prerequisites are programming skills in Python. And some experience with ESS data.</p>\n</section>\n  \n<section class=\"subjectArea\" style=\"font-family: Calibri, Arial, Helvetica, sans-serif; text-align: justify;\">\n<h2>Subject Area</h2>\n<p>Geosciences</p></section>\n\n  <section class=\"What You Will Learn\" style=\"font-family: Calibri, Arial, Helvetica, sans-serif; text-align: justify;\">\n    <h2>What You Will Learn</h2>\n    <ul>\n      <li>What is the netCDF data format?</li>\n      <li>What are the CF conventions?</li>\n      <li>What are essential metadata in the netCDF header?</li>\n      <li>How do I create CF compliant netCDF files?</li>\n      <li>How do I deal with special formats (single insitu measurements, ship observations, profiles, etc.) in the netCDF format?</li>\n    </ul>\n  </section>\n\n\n<section class=\"resources\" style=\"font-family: Calibri, Arial, Helvetica, sans-serif; text-align: justify;\">\n    <h2>Resources</h2>\n    <p>\n        <!-- For each resource, format it as shown below. -->\n        Remon Sadikni, Christopher Purr\n    </p>\n    <h2>Administration</h2>\n    <p>Farzaneh Sadeghi</p>\n    </section>\n\n\n<footer>\n    <img src=\"https://licensebuttons.net/l/by/4.0/88x31.png\" alt=\"Creative Commons Attribution License\" style=\"margin-right: 10px;\" />\n    <p style=\"color: black;\">This work is licensed under a <a class=\"license\" href=\"https://creativecommons.org/licenses/by/4.0/\" target=\"_blank\" rel=\"license noopener noreferrer\" style=\"color: black !important; text-decoration: underline;\"> Creative Commons Attribution 4.0 International License</a>.</p>\n</footer>"
}
