{
  "RDAMSC": {
    "username": "RDA-MSC-Harvester",
    "password": "rdamsc_test_password",
    "serviceName": "Research Data Alliance (RDA) Metadata Standards Catalog",
    "serviceHomepage": "https://rdamsc.bath.ac.uk/",
    "harvestingEndpoint": "",
    "resourceTypes": "standards",
    "description": "The RDA Metadata Standards Catalog provides metadata for standards via API (see homepage).",
    "id": "n4ekh/21f299138449de56ff03",
    "prefix": "msc"
  },
  "ROR": {
    "username": "ROR-Harvester",
    "password": "ror_test_password",
    "serviceName": "Research Organization Registry (ROR)",
    "serviceHomepage": "https://ror.org/",
    "harvestingEndpoint": "",
    "resourceTypes": "organisations",
    "description": "ROR provides information on organisations. In NFDI4Earth, we only harvest information about organisations, which are linked to at least one entity in the NFDI4Earth Knowledge Hub.",
    "id": "n4ekh/3beb62b4a5de06e90dc9",
    "prefix": "ror"
  },
  "RE3DATA": {
    "username": "re3data-Harvester",
    "password": "r3d_test_password",
    "serviceName": "Registry of Research Data Repositories (re3data)",
    "serviceHomepage": "https://www.re3data.org/",
    "harvestingEndpoint": "",
    "resourceTypes": "repositories",
    "description": "re3data provides information on repositories and aggregators. In NFDI4Earth, we filter repositories with the subject Geosciences.",
    "id": "n4ekh/8dc08e01641b1e3f46b7",
    "prefix": "r3d"
  },
  "WIKIDATA": {
    "username": "wikidata-Harvester",
    "password": "wikidata_test_password",
    "serviceName": "Wikidata",
    "serviceHomepage": "https://www.wikidata.org/",
    "harvestingEndpoint": "",
    "resourceTypes": "organisations",
    "description": "WIKIDATA provides information on organisations. In NFDI4Earth, we combine the information with manually collected data in the Knowledge Hub",
    "id": "n4ekh/64d5d6554a2d3753da0b",
    "prefix": "wkd"
  },
  "ORCID": {
    "username": "orcid-Harvester",
    "password": "orcid_test_password",
    "serviceName": "Open Researcher and Contributor ID (ORCID)",
    "serviceHomepage": "https://orcid.org/",
    "harvestingEndpoint": "",
    "resourceTypes": "researchers/individuals",
    "description": "ORCID provides information on researchers. In NFDI4Earth, we request further information for researchers, who are linked to other entities in the Knowledge Hub.",
    "id": "n4ekh/6851eb6e37b06a1f521f",
    "prefix": "orc"
  },
  "N4E": {
    "username": "NFDI4Earth-uploader",
    "password": "n4e_uploader_test_password",
    "serviceName": "NFDI4Earth collected resources",
    "serviceHomepage": "https://nfdi4earth.de/",
    "harvestingEndpoint": "",
    "resourceTypes": "learning resources, service, research projects",
    "description": "For some resource types, there is no sustainable data source available. We, thus, allow to upload manually collected and curated information about learning resources, services, and research projects.",
    "id": "n4ekh/0550c8e5b1a0caddf73a",
    "prefix": "n4e"
  },
  "LHB": {
    "username": "LHB-Harvester",
    "password": "lhb_harvester_test_password",
    "serviceName": "NFDI4Earth Living Handbook",
    "serviceHomepage": "https://git.rwth-aachen.de/nfdi4earth/livinghandbook/livinghandbook",
    "harvestingEndpoint": "",
    "resourceTypes": "Living Handbook articles",
    "description": "The Living Handbook is one of the NFDI4Earth-developed services. The Handbook provides articles. We harvest the articles from the NFDI4Earth Gitlab into the Knowledge Hub.",
    "id": "n4ekh/c5c5a11a9beb74b341bd",
    "prefix": "lhb"
  },
  "RSD1": {
    "username": "RSD1-Harvester",
    "password": "rsd1_harvester_test_password",
    "serviceName": "Research Software Directory",
    "serviceHomepage": "https://research-software-directory.org/",
    "harvestingEndpoint": "",
    "resourceTypes": "software",
    "description": "The Research Software Directory provides information on software and tools. In NFDI4Earth, we harvest two RSD instances - this one and the GFZ instance (see below).",
    "id": "n4ekh/15ca08c87d0bfb402a9f",
    "prefix": "rsd1"
  },
  "RSD2": {
    "username": "RSD2-Harvester",
    "password": "rsd2_harvester_test_password",
    "serviceName": "helmholtz.software",
    "serviceHomepage": "https://helmholtz.software/",
    "resourceTypes": "software",
    "harvestingEndpoint": "",
    "description": "The Research Software Directory provides information on software and tools.",
    "id": "n4ekh/538e89223d98b3ad5958",
    "prefix": "rsd2"
  },
  "ZENODO": {
    "username": "ZENODO-Harvester",
    "password": "zenodo_harvester_test_password",
    "serviceName": "Zenodo",
    "serviceHomepage": "https://zenodo.org/communities/nfdi4earth/",
    "harvestingEndpoint": "",
    "resourceTypes": "publications",
    "description": "Zenodo provides information about and access to several types of resources. In NFDI4Earth, we harvest publications from the NFDI4Earth community.",
    "id": "n4ekh/ad21633003d6edc92122",
    "prefix": "znd"
  },
  "OPENEDX": {
    "username": "OPENEDX-Harvester",
    "password": "openedx_harvester_test_password",
    "serviceName": "NFDI4Earth EduTrain Portal",
    "serviceHomepage": "https://edutrain.nfdi4earth.de/",
    "harvestingEndpoint": "",
    "resourceTypes": "learning resources",
    "description": "The EduTrain portal is one the NFDI4Earth-developed services and builds on the open-source software OpenEDX. The portal provides access to NFDI4Earth-developed learning resources.",
    "id": "n4ekh/57a96d66191f96c32e35",
    "prefix": "odx"
  },
  "GDI": {
    "username": "GDI-Harvester",
    "password": "gdi_harvester_test_password",
    "serviceName": "GDI-DE Geodata Catalog",
    "serviceHomepage": "https://gdk.gdi-de.org/gdi-de/srv/eng/catalog.search#/home",
    "harvestingEndpoint": "",
    "resourceTypes": "datasets",
    "description": "GDI-DE Geodata Catalog is both data source and harvester node. The catalog harvests metadata from several sources, see: https://www.geoportal.de/Datenanbieter",
    "id": "n4ekh/9cd6f1ee086317e1da9d",
    "prefix": "gdi"
  },
  "ISOGMD": {
    "username": "ISOGMD-Harvester",
    "password": "isogmd_harvester_test_password",
    "description": "A virtual entry - do not display publicly. Needed because currently the application logic has several harvesters pushing datasets in ISO19139 serialization to the harvesting queue of this virtual harvester",
    "id": "n4ekh/8b48350524efb561d35e"
  },
  "DTHB": {
    "username": "Datahub-Harvester",
    "password": "datahub_harvester_test_password",
    "serviceName": "Helmholtz Earth and Environment DataHub",
    "serviceHomepage": "https://earth-data.de/",
    "harvestingEndpoint": "",
    "resourceTypes": "datasets",
    "description": "Helmholtz Earth and Environment DataHub is both data source and harvester node. The DataHub harvests metadata from several sources, see: https://earth-data.de/providers. In NFDI4Earth, we harvest dataset metadata.",
    "id": "n4ekh/08055205819b8f148535",
    "prefix": "dthb"
  },
  "PUB": {
    "username": "Publication-Harvester",
    "password": "publication_harvester_test_password",
    "serviceName": "Publication Harvester",
    "serviceHomepage": "",
    "harvestingEndpoint": "",
    "resourceTypes": "publications",
    "description": "Harvests DOI metadata (via Crossref or DataCite) from publications found in diverse sources",
    "id": "n4ekh/30d1de08f71e69a7367c",
    "prefix": "pub"
  }
}
