<?xml version="1.0" encoding="utf-8"?>
<svg viewBox="5.5 -3.5 32 32" width="32" height="32" xmlns="http://www.w3.org/2000/svg">
  <path d="M 21.471 -3.5 C 25.946 -3.5 29.757 -1.937 32.899 1.186 C 34.403 2.691 35.547 4.41 36.328 6.343 C 37.108 8.277 37.5 10.329 37.5 12.5 C 37.5 14.691 37.113 16.743 36.343 18.657 C 35.571 20.571 34.433 22.262 32.929 23.728 C 31.367 25.271 29.596 26.452 27.614 27.271 C 25.634 28.09 23.586 28.5 21.472 28.5 C 19.358 28.5 17.334 28.096 15.4 27.285 C 13.467 26.476 11.734 25.305 10.2 23.772 C 8.667 22.239 7.5 20.51 6.7 18.586 C 5.9 16.662 5.5 14.634 5.5 12.5 C 5.5 10.386 5.905 8.353 6.714 6.4 C 7.524 4.448 8.7 2.7 10.243 1.157 C 13.29 -1.947 17.033 -3.5 21.471 -3.5 Z M 21.529 -0.614 C 17.872 -0.614 14.795 0.663 12.3 3.215 C 11.042 4.491 10.076 5.924 9.4 7.515 C 8.723 9.105 8.385 10.767 8.385 12.501 C 8.385 14.215 8.723 15.868 9.4 17.457 C 10.076 19.049 11.042 20.468 12.3 21.715 C 13.557 22.963 14.975 23.915 16.557 24.573 C 18.138 25.23 19.795 25.558 21.529 25.558 C 23.243 25.558 24.904 25.226 26.515 24.559 C 28.125 23.891 29.576 22.93 30.872 21.673 C 33.367 19.235 34.614 16.178 34.614 12.501 C 34.614 10.73 34.29 9.054 33.642 7.473 C 32.996 5.892 32.052 4.483 30.815 3.244 C 28.242 0.672 25.148 -0.614 21.529 -0.614 Z M 21.328 9.844 L 19.185 10.958 C 18.956 10.483 18.675 10.149 18.342 9.958 C 18.009 9.768 17.699 9.673 17.413 9.673 C 15.985 9.673 15.27 10.615 15.27 12.501 C 15.27 13.358 15.451 14.043 15.813 14.558 C 16.175 15.072 16.708 15.33 17.413 15.33 C 18.347 15.33 19.004 14.872 19.385 13.958 L 21.356 14.958 C 20.937 15.74 20.356 16.354 19.613 16.801 C 18.871 17.249 18.052 17.473 17.156 17.473 C 15.728 17.473 14.575 17.035 13.699 16.158 C 12.823 15.282 12.385 14.063 12.385 12.502 C 12.385 10.978 12.828 9.769 13.713 8.873 C 14.599 7.978 15.718 7.53 17.071 7.53 C 19.052 7.529 20.471 8.301 21.328 9.844 Z M 30.557 9.844 L 28.442 10.958 C 28.214 10.483 27.932 10.149 27.599 9.958 C 27.265 9.768 26.946 9.673 26.642 9.673 C 25.214 9.673 24.499 10.615 24.499 12.501 C 24.499 13.358 24.68 14.043 25.042 14.558 C 25.403 15.072 25.936 15.33 26.642 15.33 C 27.575 15.33 28.232 14.872 28.613 13.958 L 30.613 14.958 C 30.175 15.74 29.584 16.354 28.842 16.801 C 28.099 17.249 27.29 17.473 26.414 17.473 C 24.966 17.473 23.809 17.035 22.943 16.158 C 22.075 15.282 21.642 14.063 21.642 12.502 C 21.642 10.978 22.085 9.769 22.971 8.873 C 23.856 7.978 24.975 7.53 26.328 7.53 C 28.309 7.529 29.719 8.301 30.557 9.844 Z" style="fill: white;"/>
</svg>