{
	"JSON": {
		"ID": "1ee82416-7ea1-6536-8659-54e002633707",
		"label": "",
		"comment": "UUID6 is used"
	},
	"part": {
		"name": "touch-down_bearing_testrig_4",
		"distance to motor bearing": {
			"value": 450,
			"unit": "millimeter"
		}
	}
}