{
	"JSON": {
		"ID": "1ee82f6c-fdb2-6e84-bdae-6d11902db6ee",
		"label": "",
		"comment": "UUID6 is used"
	},
    "comment": "here you can write down something important about this setup file",
    "info": "List below ALL components, you used in your experiment. By using the UUID there is no possibility to mix something up.",
	"setup": {
		"1ee82f6d-e651-67ac-8ab8-274cec089add": {
            "type": "group_info",
			"name": "group_info",
            "comment": ""
        },
		"1ee82f6e-db00-6e01-9300-a3b95b55c4fe": {
            "type": "instrument",
			"name": "raspberry_pi",
            "comment": ""
        },
		"1ee826bc-ad10-6fa9-818b-5b87707a5a35": {
            "type": "sensor",
			"name": "temperature_cup",
            "comment": ""
        },
		"1ee826c0-782e-69ed-9f87-e60f2d81be9d": {
            "type": "sensor",
			"name": "temperature_environment",
            "comment": ""
        },    
		"1ee82f72-3261-6db1-9c58-1e11e2fcb76d": {
            "type": "probe",
			"name": "probe_description",
            "comment": ""
        },
		"add_more_here_if_you_need": {
			"type": "choose your own type, if you miss one",
			"name": "",
			"comment": ""
		}
	}
}