<?xml version='1.0' encoding='UTF-8'?>
<osm version='0.6' upload='never' generator='JOSM'>
  <node id='-39259' action='modify' lat='49.02249588758' lon='8.43191960138' />
  <node id='-39261' action='modify' lat='49.0229231807' lon='8.4319282618' />
  <way id='-39263' action='modify'>
    <nd ref='-39259' />
    <nd ref='-39261' />
  </way>
</osm>
