Added Porttypes to GenerationTest

5 jobs for integrate-MQTT in 25 minutes and 11 seconds (queued for 4 seconds)
Status Name Job ID Coverage
  Windows
passed masterJobWindows #485129
Windows10

00:07:52

 
  Linux Compile
passed CompileJobLinux #485130

00:04:32

87.0%
 
  Integration
failed MqttIntegrationJob #485131

00:03:54

passed Ros2IntegrationJob #485133

00:09:06

passed RosIntegrationJob #485132

00:12:46

 
Name Stage Failure
failed
MqttIntegrationJob Integration
                          ^~~
exp
make[2]: *** [tests_mqtt_testComp/mqtt/CMakeFiles/MqttAdapter_tests_mqtt_testComp.dir/MqttAdapter_tests_mqtt_testComp.cpp.o] Error 1
tests_mqtt_testComp/mqtt/CMakeFiles/MqttAdapter_tests_mqtt_testComp.dir/build.make:158: recipe for target 'tests_mqtt_testComp/mqtt/CMakeFiles/MqttAdapter_tests_mqtt_testComp.dir/MqttAdapter_tests_mqtt_testComp.cpp.o' failed
CMakeFiles/Makefile2:165: recipe for target 'tests_mqtt_testComp/mqtt/CMakeFiles/MqttAdapter_tests_mqtt_testComp.dir/all' failed
Makefile:129: recipe for target 'all' failed
make[1]: *** [tests_mqtt_testComp/mqtt/CMakeFiles/MqttAdapter_tests_mqtt_testComp.dir/all] Error 2
make: *** [all] Error 2
ERROR: Job failed: exit code 1