Add generation test

5 jobs for integrate-MQTT in 28 minutes and 43 seconds
Status Job ID Name Coverage
  Windows
passed #452712
Windows10
masterJobWindows

00:10:49

 
  Linux Compile
passed #452713
CompileJobLinux

00:04:18

87.0%
 
  Integration
failed #452714
MqttIntegrationJob

00:03:24

passed #452716
Ros2IntegrationJob

00:09:10

passed #452715
RosIntegrationJob

00:13:34

 
Name Stage Failure
failed
MqttIntegrationJob Integration
          ^~~~~~~~~~~~~~~~~~~~~
compilation terminated.
tests_mqtt_testComp/mqtt/CMakeFiles/MqttAdapter_tests_mqtt_testComp.dir/build.make:62: recipe for target 'tests_mqtt_testComp/mqtt/CMakeFiles/MqttAdapter_tests_mqtt_testComp.dir/Callback.cpp.o' failed
make[2]: *** [tests_mqtt_testComp/mqtt/CMakeFiles/MqttAdapter_tests_mqtt_testComp.dir/Callback.cpp.o] Error 1
make[1]: *** [tests_mqtt_testComp/mqtt/CMakeFiles/MqttAdapter_tests_mqtt_testComp.dir/all] Error 2
CMakeFiles/Makefile2:164: recipe for target 'tests_mqtt_testComp/mqtt/CMakeFiles/MqttAdapter_tests_mqtt_testComp.dir/all' failed
Makefile:129: recipe for target 'all' failed
make: *** [all] Error 2
ERROR: Job failed: exit code 1