{
    "modelsDir": "src/main/ema",
    "outputDir": "target/postprocessor",
    "rootModel": "forestrl.multistep.postprocessor.master",
    "generators": [
        "emadlcpp",
        "roscpp"
    ],
    "emadlBackend": "GLUON"
}
