Deleted obsolete file

2 jobs for lab_calculator in 4 minutes and 4 seconds (queued for 2 seconds)
Status Job ID Name Coverage
  Linux
failed #279339
TestCAFFE2

00:03:06

failed #279338
TestMXNET

00:04:04

 
Name Stage Failure
failed
TestMXNET Linux
[ 50%] Built target cNNCalculator_connector
Scanning dependencies of target DigitCalculator
[ 75%] Building CXX object src/cpp/CMakeFiles/DigitCalculator.dir/DigitCalculator.cpp.o
[100%] Linking CXX executable DigitCalculator
[100%] Built target DigitCalculator
$ RES=$(./build/src/cpp/DigitCalculator resources/images/1.png resources/images/2.png resources/images/3.png resources/images/4.png resources/images/5.png resources/images/6.png)
$ if [[ $RES != *"SUM: 579"* ]]; then echo "Wrong result:" $RES; exit 1; fi;
Wrong result: model/cNNCalculator.Network/model_newest-symbol.json ... 126959 bytes model/cNNCalculator.Network/model_newest-0000.params ... 6553573 bytes model/cNNCalculator.Network/model_newest-symbol.json ... 126959 bytes model/cNNCalculator.Network/model_newest-0000.params ... 6553573 bytes model/cNNCalculator.Network/model_newest-symbol.json ... 126959 bytes model/cNNCalculator.Network/model_newest-0000.params ... 6553573 bytes model/cNNCalculator.Network/model_newest-symbol.json ... 126959 bytes model/cNNCalculator.Network/model_newest-0000.params ... 6553573 bytes model/cNNCalculator.Network/model_newest-symbol.json ... 126959 bytes model/cNNCalculator.Network/model_newest-0000.params ... 6553573 bytes model/cNNCalculator.Network/model_newest-symbol.json ... 126959 bytes model/cNNCalculator.Network/model_newest-0000.params ... 6553573 bytes == original image size: [32 x 32] == == simply resize: [32 x 32] == == original image size: [32 x 32] == == simply resize: [32 x 32] == == original image size: [32 x 32] == == simply resize: [32 x 32] == == original image size: [32 x 32] == == simply resize: [32 x 32] == == original image size: [32 x 32] == == simply resize: [32 x 32] == == original image size: [32 x 32] == == simply resize: [32 x 32] == == SUM: 379
ERROR: Job failed: exit code 1
failed
TestCAFFE2 Linux
/usr/bin/ld: cannot find -lcaffe2_gpu
collect2: error: ld returned 1 exit status
make[2]: *** [src/cpp/DigitCalculator] Error 1
src/cpp/CMakeFiles/DigitCalculator.dir/build.make:118: recipe for target 'src/cpp/DigitCalculator' failed
CMakeFiles/Makefile2:85: recipe for target 'src/cpp/CMakeFiles/DigitCalculator.dir/all' failed
make[1]: *** [src/cpp/CMakeFiles/DigitCalculator.dir/all] Error 2
make: *** [all] Error 2
Makefile:83: recipe for target 'all' failed
ERROR: Job failed: exit code 1