update all settings.xml

13 jobs for schemalang in 5 minutes and 3 seconds (queued for 7 seconds)
Status Name Job ID Coverage
  Linux
failed TestEMADLMavenPlugin #2122680

00:03:40

failed TestGLUON #2122675

00:01:22

failed TestMnistCalculator-II #2122677

00:05:03

failed TestMnistWithAdaNet #2122678

00:03:35

failed TestMNISTwithCustomLayer #2122679

00:03:52

failed TestTENSORFLOW #2122676

00:01:31

failed TestEMADLMavenPlugin #2119034

00:03:08

failed TestEMADLMavenPlugin #2118919

00:03:53

failed TestGLUON #2118916

00:01:38

failed TestMnistCalculator-II #2118918

00:03:02

failed TestMnistWithAdaNet #2118920

00:03:36

failed TestMNISTwithCustomLayer #2118921

00:04:07

failed TestTENSORFLOW #2118917

00:01:39

 
Name Stage Failure
failed
TestMnistCalculator-II Linux
[ERROR] Failed to execute goal de.monticore.lang.monticar.utilities:maven-streamtest:0.0.21-SNAPSHOT:streamtest-build (default-cli) on project mnist-calculator: Execution default-cli of goal de.monticore.lang.monticar.utilities:maven-streamtest:0.0.21-SNAPSHOT:streamtest-build failed.: NullPointerException -> [Help 1]
[ERROR]
[ERROR] To see the full stack trace of the errors, re-run Maven with the -e switch.
[ERROR] Re-run Maven using the -X switch to enable full debug logging.
[ERROR]
[ERROR] For more information about the errors and possible solutions, please read the following articles:
[ERROR] [Help 1] http://cwiki.apache.org/confluence/display/MAVEN/PluginExecutionException
Cleaning up project directory and file based variables
ERROR: Job failed: exit code 1

failed
TestMNISTwithCustomLayer Linux
[ERROR] Failed to execute goal de.monticore.lang.monticar.utilities:emadl-maven-plugin:0.0.4-SNAPSHOT:train (default-cli) on project mnist-calculator: Unable to execute mojo: Execution null of goal de.monticore.lang.monticar.utilities:maven-streamtest:0.0.24-SNAPSHOT:streamtest-generator failed: Could not resolve schema definition for model 'General'. -> [Help 1]
[ERROR]
[ERROR] To see the full stack trace of the errors, re-run Maven with the -e switch.
[ERROR] Re-run Maven using the -X switch to enable full debug logging.
[ERROR]
[ERROR] For more information about the errors and possible solutions, please read the following articles:
[ERROR] [Help 1] http://cwiki.apache.org/confluence/display/MAVEN/MojoExecutionException
Cleaning up project directory and file based variables
ERROR: Job failed: exit code 1

failed
TestEMADLMavenPlugin Linux
[ERROR] Failed to execute goal de.monticore.lang.monticar.utilities:emadl-maven-plugin:0.0.5-SNAPSHOT:train (default-cli) on project mnist-calculator: Unable to execute mojo: Execution null of goal de.monticore.lang.monticar.utilities:maven-streamtest:0.0.25:streamtest-generator failed: Could not resolve schema definition for model 'General'. -> [Help 1]
[ERROR]
[ERROR] To see the full stack trace of the errors, re-run Maven with the -e switch.
[ERROR] Re-run Maven using the -X switch to enable full debug logging.
[ERROR]
[ERROR] For more information about the errors and possible solutions, please read the following articles:
[ERROR] [Help 1] http://cwiki.apache.org/confluence/display/MAVEN/MojoExecutionException
Cleaning up project directory and file based variables
ERROR: Job failed: exit code 1

failed
TestMnistWithAdaNet Linux
[ERROR] Failed to execute goal de.monticore.lang.monticar.utilities:emadl-maven-plugin:0.0.4-SNAPSHOT:train (default-cli) on project mnist-calculator: Unable to execute mojo: Execution null of goal de.monticore.lang.monticar.utilities:maven-streamtest:0.0.24-SNAPSHOT:streamtest-generator failed: Missing training configuration for network 'calculator_Connector' -> [Help 1]
[ERROR]
[ERROR] To see the full stack trace of the errors, re-run Maven with the -e switch.
[ERROR] Re-run Maven using the -X switch to enable full debug logging.
[ERROR]
[ERROR] For more information about the errors and possible solutions, please read the following articles:
[ERROR] [Help 1] http://cwiki.apache.org/confluence/display/MAVEN/MojoExecutionException
Cleaning up project directory and file based variables
ERROR: Job failed: exit code 1

failed
TestTENSORFLOW Linux
CMake Error at CMakeLists.txt:5 (add_subdirectory):
add_subdirectory given source "target" which is not an existing directory.


-- Configuring incomplete, errors occurred!
See also "/builds/monticore/EmbeddedMontiArc/applications/mnistcalculator/tensorflow/build/CMakeFiles/CMakeOutput.log".
make: *** No targets specified and no makefile found. Stop.
Cleaning up project directory and file based variables
ERROR: Job failed: exit code 1

failed
TestGLUON Linux
CMake Error at CMakeLists.txt:5 (add_subdirectory):
add_subdirectory given source "target" which is not an existing directory.


-- Configuring incomplete, errors occurred!
See also "/builds/monticore/EmbeddedMontiArc/applications/mnistcalculator/gluon-cpp/build/CMakeFiles/CMakeOutput.log".
make: *** No targets specified and no makefile found. Stop.
Cleaning up project directory and file based variables
ERROR: Job failed: exit code 1