Update pom.xml

3 jobs for schemalang in 2 minutes and 32 seconds (queued for 3 seconds)
Name Stage Failure
failed
install-pretrained Linux
[ERROR] Failed to execute goal de.monticore.lang.monticar.utilities:emadl-maven-plugin:0.0.5-SNAPSHOT:install-pretrained (default-cli) on project threeD_GAN: Execution default-cli of goal de.monticore.lang.monticar.utilities:emadl-maven-plugin:0.0.5-SNAPSHOT:install-pretrained failed: Plugin de.monticore.lang.monticar.utilities:emadl-maven-plugin:0.0.5-SNAPSHOT or one of its dependencies could not be resolved: Failed to collect dependencies at de.monticore.lang.monticar.utilities:emadl-maven-plugin:jar:0.0.5-20211126.172032-3 -> montisim:hardware_emulator:jar:2.1.0-SNAPSHOT -> montisim:sim-commons:jar:3.3.1 -> org.ros.rosjava_core:rosjava:jar:0.3.6 -> org.ros.rosjava_core:apache_xmlrpc_common:jar:0.3.6 -> org.apache.commons:com.springsource.org.apache.commons.httpclient:jar:3.1.0: Failed to read artifact descriptor for org.apache.commons:com.springsource.org.apache.commons.httpclient:jar:3.1.0: Could not transfer artifact org.apache.commons:com.springsource.org.apache.commons.httpclient:pom:3.1.0 from/to spring (https://repo.spring.io/libs-release/): Authentication failed for https://repo.spring.io/libs-release/org/apache/commons/com.springsource.org.apache.commons.httpclient/3.1.0/com.springsource.org.apache.commons.httpclient-3.1.0.pom 401 Unauthorized -> [Help 1]
[ERROR]
[ERROR] To see the full stack trace of the errors, re-run Maven with the -e switch.
[ERROR] Re-run Maven using the -X switch to enable full debug logging.
[ERROR]
[ERROR] For more information about the errors and possible solutions, please read the following articles:
[ERROR] [Help 1] http://cwiki.apache.org/confluence/display/MAVEN/PluginResolutionException
Cleaning up project directory and file based variables
ERROR: Job failed: exit code 1

failed
Train3D-GAN Linux
[ERROR] Failed to execute goal de.monticore.lang.monticar.utilities:emadl-maven-plugin:0.0.3-SNAPSHOT:train (default-cli) on project threeD_GAN: Unable to execute mojo: Execution null of goal de.monticore.lang.monticar.utilities:maven-streamtest:0.0.23-SNAPSHOT:streamtest-generator failed: Could not resolve schema definition for model 'General'. -> [Help 1]
[ERROR]
[ERROR] To see the full stack trace of the errors, re-run Maven with the -e switch.
[ERROR] Re-run Maven using the -X switch to enable full debug logging.
[ERROR]
[ERROR] For more information about the errors and possible solutions, please read the following articles:
[ERROR] [Help 1] http://cwiki.apache.org/confluence/display/MAVEN/MojoExecutionException
Cleaning up project directory and file based variables
ERROR: Job failed: exit code 1

failed
TestWithJar Jar

does not contain a CMakeLists.txt file.


-- Configuring incomplete, errors occurred!
See also "/builds/monticore/EmbeddedMontiArc/applications/gans/3d-gan/Gluon/.test/build/CMakeFiles/CMakeOutput.log".
make: *** No targets specified and no makefile found. Stop.
Cleaning up project directory and file based variables
ERROR: Job failed: exit code 1