Update Generator.cnnt

3 jobs for schemalang in 5 minutes and 21 seconds (queued for 2 seconds)
Name Stage Failure
failed
Train3D-GAN Linux
[ERROR] Failed to execute goal de.monticore.lang.monticar.utilities:emadl-maven-plugin:0.0.3-SNAPSHOT:train (default-cli) on project threeD_GAN: Unable to execute mojo: Execution null of goal de.monticore.lang.monticar.utilities:maven-streamtest:0.0.23-SNAPSHOT:streamtest-generator failed: Could not resolve schema definition for model 'General'. -> [Help 1]
[ERROR]
[ERROR] To see the full stack trace of the errors, re-run Maven with the -e switch.
[ERROR] Re-run Maven using the -X switch to enable full debug logging.
[ERROR]
[ERROR] For more information about the errors and possible solutions, please read the following articles:
[ERROR] [Help 1] http://cwiki.apache.org/confluence/display/MAVEN/MojoExecutionException
Cleaning up project directory and file based variables
ERROR: Job failed: exit code 1

failed
TestWithJar Jar

does not contain a CMakeLists.txt file.


-- Configuring incomplete, errors occurred!
See also "/builds/monticore/EmbeddedMontiArc/applications/gans/3d-gan/Gluon/.test/build/CMakeFiles/CMakeOutput.log".
make: *** No targets specified and no makefile found. Stop.
Cleaning up project directory and file based variables
ERROR: Job failed: exit code 1