BR

1 job for master in 6 minutes and 19 seconds (queued for 1 second)
Status Name Job ID Coverage
  Linux
failed TestJobLinux #1626736

00:06:19

 
Name Stage Failure
failed
TestJobLinux Linux
compilation terminated.
make[2]: *** [target/CMakeFiles/ba_ballTracking.dir/ba_ballTracking.cpp.o] Error 1
target/CMakeFiles/ba_ballTracking.dir/build.make:62: recipe for target 'target/CMakeFiles/ba_ballTracking.dir/ba_ballTracking.cpp.o' failed
CMakeFiles/Makefile2:85: recipe for target 'target/CMakeFiles/ba_ballTracking.dir/all' failed
make[1]: *** [target/CMakeFiles/ba_ballTracking.dir/all] Error 2
Makefile:83: recipe for target 'all' failed
make: *** [all] Error 2
Cleaning up file based variables
ERROR: Job failed: exit code 1